{
  "categorias": [
    {
      "titulo": "Games",
      "cor": "red",
      "link": "https://conteudo.imguol.com.br/blogs/342/files/2020/04/valorant-capa.jpg",
      "videos": [
        {
          "titulo": "Valorant Ambrose#TOP1",
          "url": "https://www.youtube.com/watch?v=fpms5NxHwMg"
        },
        {
          "titulo": "Stardew Valley",
          "url": "https://www.youtube.com/watch?v=owYI7_o4X5o"
        },
        {
          "titulo": "God of War 4",
          "url": "https://www.youtube.com/watch?v=FyIwEFXOcaE"
        },
        {
          "titulo": "The last of US 2",
          "url": "https://www.youtube.com/watch?v=GAZUEv3UQIY"
        },
        {
          "titulo": "Pokémon Let's Go Pikachu/Eevee",
          "url": "https://www.youtube.com/watch?v=L56q_k2ydrs"
        },
        {
          "titulo": "God of War 4",
          "url": "https://www.youtube.com/watch?v=FyIwEFXOcaE"
        },
        {
          "titulo": "The last of US 2",
          "url": "https://www.youtube.com/watch?v=GAZUEv3UQIY"
        },
        {
          "titulo": "God of War 4",
          "url": "https://www.youtube.com/watch?v=FyIwEFXOcaE"
        },
        {
          "titulo": "The last of US 2",
          "url": "https://www.youtube.com/watch?v=GAZUEv3UQIY"
        }
      ]
    },
    {
      "titulo": "Aberturas de Animes",
      "cor": "lightblue",
      "videos": [
        {
          "titulo": "Overlord III - Opening | VORACITY",
          "url": "https://www.youtube.com/watch?v=vci9YwpFFcA"
        },
        {
          "titulo": "You Say Run",
          "url": "https://www.youtube.com/watch?v=lsHCzboWK0U"
        },
        {
          "titulo": "One Punch Man - THE HERO!!",
          "url": "https://www.youtube.com/watch?v=scP1RSC9V3U"
        },
        {
          "titulo": "Sorriso Contagiante (PT-BR)",
          "url": "https://www.youtube.com/watch?v=d7ytzZNXoPg"
        },
        {
          "titulo": "Sorriso Resplandecente",
          "url": "https://www.youtube.com/watch?v=L0_nXyTMyqM"
        }
      ]
    },
    {
      "titulo": "Filmes",
      "cor": "orange",
      "videos": [
        {
          "titulo": "Projeto Almanaque",
          "url": "https://www.youtube.com/watch?v=vHzrkN5NT08"
        },
        {
          "titulo": "ROGUE ONE: A STAR WARS STORY",
          "url": "https://www.youtube.com/watch?v=Wji-BZ0oCwg"
        },
        {
          "titulo": "Para Todos os Garotos que Já Amei",
          "url": "https://www.youtube.com/watch?v=W49hVeuz1Gc"
        },
        {
          "titulo": "O Senhor dos Anéis A sociedade do Anel 2001",
          "url": "https://www.youtube.com/watch?v=0i86oM1nHjM"
        }
      ]
    },
    {
      "titulo": "Animes",
      "cor": "#6b5be2",
      "videos": [
        {
          "titulo": "Attack on Tita",
          "url": "https://www.youtube.com/watch?v=c14MVY3EVaQ"
        },
        {
          "titulo": "One Piece",
          "url": "https://www.youtube.com/watch?v=S8_YwFLCh4U"
        },
        {
          "titulo": "Hunter x Hunter",
          "url": "https://www.youtube.com/watch?v=faqmNf_fZlE"
        }
      ]
    }
  ]
}