<mxfile host="app.diagrams.net" modified="2020-04-02T20:16:48.310Z" agent="5.0 (X11; Linux x86_64) AppleWebKit/537.36 (KHTML, like Gecko) Chrome/80.0.3987.149 Safari/537.36" etag="wdxJ16GCaEdJS288cpq5" version="12.9.6" type="gitlab">
  <diagram id="xoE__qxIpnIsgbBzRb8H" name="Page-1">
    <mxGraphModel dx="1129" dy="673" grid="1" gridSize="10" guides="1" tooltips="1" connect="1" arrows="1" fold="1" page="1" pageScale="1" pageWidth="850" pageHeight="1100" math="0" shadow="0">
      <root>
        <mxCell id="0" />
        <mxCell id="1" parent="0" />
        <mxCell id="7QshRmXqY3w23GVf20kj-1" value="Original KSAT&lt;br&gt;Req_Src: True&lt;br&gt;Req Own: Req&lt;br&gt;Modifiable: No" style="ellipse;whiteSpace=wrap;html=1;fillColor=#f5f5f5;strokeColor=#66FF66;fontColor=#333333;strokeWidth=5;" parent="1" vertex="1">
          <mxGeometry x="170" y="129" width="120" height="80" as="geometry" />
        </mxCell>
        <mxCell id="7QshRmXqY3w23GVf20kj-7" value="" style="edgeStyle=orthogonalEdgeStyle;rounded=0;orthogonalLoop=1;jettySize=auto;html=1;exitX=0;exitY=0.5;exitDx=0;exitDy=0;entryX=1;entryY=0.5;entryDx=0;entryDy=0;" parent="1" source="7QshRmXqY3w23GVf20kj-6" target="7QshRmXqY3w23GVf20kj-3" edge="1">
          <mxGeometry relative="1" as="geometry">
            <mxPoint x="420" y="370" as="targetPoint" />
          </mxGeometry>
        </mxCell>
        <mxCell id="7QshRmXqY3w23GVf20kj-17" value="Child : Parent" style="edgeStyle=orthogonalEdgeStyle;rounded=0;orthogonalLoop=1;jettySize=auto;html=1;exitX=0.5;exitY=0;exitDx=0;exitDy=0;entryX=0.5;entryY=1;entryDx=0;entryDy=0;" parent="1" source="7QshRmXqY3w23GVf20kj-3" target="7QshRmXqY3w23GVf20kj-16" edge="1">
          <mxGeometry relative="1" as="geometry" />
        </mxCell>
        <mxCell id="7QshRmXqY3w23GVf20kj-3" value="Derived KSAT&lt;br&gt;Req Src: False&lt;br&gt;Req Own: Opt&lt;br&gt;Modifiable:&lt;br&gt;Via Owner if populated&lt;br&gt;2 parents/2 children" style="ellipse;whiteSpace=wrap;html=1;strokeColor=#FFFF66;strokeWidth=5;" parent="1" vertex="1">
          <mxGeometry x="250" y="260" width="160" height="130" as="geometry" />
        </mxCell>
        <mxCell id="7QshRmXqY3w23GVf20kj-24" style="edgeStyle=orthogonalEdgeStyle;rounded=0;orthogonalLoop=1;jettySize=auto;html=1;exitX=0.5;exitY=0;exitDx=0;exitDy=0;entryX=0.5;entryY=1;entryDx=0;entryDy=0;" parent="1" source="7QshRmXqY3w23GVf20kj-21" target="7QshRmXqY3w23GVf20kj-1" edge="1">
          <mxGeometry relative="1" as="geometry" />
        </mxCell>
        <mxCell id="7QshRmXqY3w23GVf20kj-31" style="edgeStyle=orthogonalEdgeStyle;rounded=0;orthogonalLoop=1;jettySize=auto;html=1;exitX=1;exitY=0.5;exitDx=0;exitDy=0;entryX=0;entryY=0.5;entryDx=0;entryDy=0;" parent="1" source="7QshRmXqY3w23GVf20kj-32" target="7QshRmXqY3w23GVf20kj-1" edge="1">
          <mxGeometry relative="1" as="geometry">
            <mxPoint x="50" y="269" as="targetPoint" />
          </mxGeometry>
        </mxCell>
        <mxCell id="mlzYNg9NmktDVVgbLRnO-9" style="edgeStyle=orthogonalEdgeStyle;rounded=0;orthogonalLoop=1;jettySize=auto;html=1;exitX=0;exitY=1;exitDx=0;exitDy=0;entryX=0;entryY=0;entryDx=0;entryDy=0;endArrow=none;endFill=0;" edge="1" parent="1" source="7QshRmXqY3w23GVf20kj-21" target="7QshRmXqY3w23GVf20kj-23">
          <mxGeometry relative="1" as="geometry" />
        </mxCell>
        <mxCell id="7QshRmXqY3w23GVf20kj-21" value="Derived + Original KSAT&lt;br&gt;Req Src: False&lt;br&gt;Req Own: True&lt;br&gt;Modifiable:&lt;br&gt;Via Owner if populated&lt;br&gt;1 parent/1 child" style="ellipse;whiteSpace=wrap;html=1;fillColor=#f5f5f5;strokeColor=#66FF66;fontColor=#333333;strokeWidth=5;" parent="1" vertex="1">
          <mxGeometry x="10" y="260" width="160" height="130" as="geometry" />
        </mxCell>
        <mxCell id="7QshRmXqY3w23GVf20kj-6" value="Optional Train/Eval Item&lt;br&gt;(If required in addition to Children)&lt;br&gt;Must be deliberately decided" style="rectangle;whiteSpace=wrap;html=1;dashed=1;strokeColor=#66FF66;strokeWidth=5;" parent="1" vertex="1">
          <mxGeometry x="490" y="260" width="110" height="130" as="geometry" />
        </mxCell>
        <mxCell id="7QshRmXqY3w23GVf20kj-12" value="Child : Parent" style="edgeStyle=orthogonalEdgeStyle;rounded=0;orthogonalLoop=1;jettySize=auto;html=1;exitX=0.5;exitY=0;exitDx=0;exitDy=0;entryX=0.5;entryY=1;entryDx=0;entryDy=0;" parent="1" source="7QshRmXqY3w23GVf20kj-9" target="7QshRmXqY3w23GVf20kj-3" edge="1">
          <mxGeometry relative="1" as="geometry" />
        </mxCell>
        <mxCell id="7QshRmXqY3w23GVf20kj-26" style="edgeStyle=orthogonalEdgeStyle;rounded=0;orthogonalLoop=1;jettySize=auto;html=1;exitX=0.5;exitY=0;exitDx=0;exitDy=0;entryX=1;entryY=0.5;entryDx=0;entryDy=0;" parent="1" source="7QshRmXqY3w23GVf20kj-9" target="7QshRmXqY3w23GVf20kj-21" edge="1">
          <mxGeometry relative="1" as="geometry" />
        </mxCell>
        <mxCell id="7QshRmXqY3w23GVf20kj-30" value="" style="edgeStyle=orthogonalEdgeStyle;rounded=0;orthogonalLoop=1;jettySize=auto;html=1;exitX=0.5;exitY=0;exitDx=0;exitDy=0;entryX=0.5;entryY=1;entryDx=0;entryDy=0;" parent="1" source="7QshRmXqY3w23GVf20kj-29" target="7QshRmXqY3w23GVf20kj-9" edge="1">
          <mxGeometry relative="1" as="geometry">
            <mxPoint x="250" y="610" as="targetPoint" />
          </mxGeometry>
        </mxCell>
        <mxCell id="7QshRmXqY3w23GVf20kj-9" value="Derived KSAT&lt;br&gt;2 parent/1 child" style="ellipse;whiteSpace=wrap;html=1;aspect=fixed;strokeColor=#66FF66;strokeWidth=5;" parent="1" vertex="1">
          <mxGeometry x="190" y="460" width="80" height="80" as="geometry" />
        </mxCell>
        <mxCell id="7QshRmXqY3w23GVf20kj-29" value="Derived KSAT&lt;br&gt;1 parent" style="ellipse;whiteSpace=wrap;html=1;aspect=fixed;strokeWidth=5;strokeColor=#66FF66;" parent="1" vertex="1">
          <mxGeometry x="190" y="620" width="80" height="80" as="geometry" />
        </mxCell>
        <mxCell id="7QshRmXqY3w23GVf20kj-28" value="" style="edgeStyle=orthogonalEdgeStyle;rounded=0;orthogonalLoop=1;jettySize=auto;html=1;exitX=0;exitY=0.5;exitDx=0;exitDy=0;entryX=1;entryY=0.5;entryDx=0;entryDy=0;" parent="1" source="7QshRmXqY3w23GVf20kj-27" target="7QshRmXqY3w23GVf20kj-14" edge="1">
          <mxGeometry relative="1" as="geometry">
            <mxPoint x="420" y="530" as="targetPoint" />
          </mxGeometry>
        </mxCell>
        <mxCell id="7QshRmXqY3w23GVf20kj-14" value="Derived KSAT&lt;br&gt;1 parent" style="ellipse;whiteSpace=wrap;html=1;aspect=fixed;strokeColor=#FF0000;strokeWidth=5;" parent="1" vertex="1">
          <mxGeometry x="290" y="460" width="80" height="80" as="geometry" />
        </mxCell>
        <mxCell id="7QshRmXqY3w23GVf20kj-27" value="Required Train/Eval Item:&amp;nbsp; All children must be mapped to train/eval items" style="rectangle;whiteSpace=wrap;html=1;aspect=fixed;strokeColor=#FF3333;strokeWidth=5;" parent="1" vertex="1">
          <mxGeometry x="450" y="440" width="120" height="120" as="geometry" />
        </mxCell>
        <mxCell id="7QshRmXqY3w23GVf20kj-15" value="" style="endArrow=classic;html=1;exitX=0.5;exitY=0;exitDx=0;exitDy=0;entryX=0.5;entryY=1;entryDx=0;entryDy=0;" parent="1" source="7QshRmXqY3w23GVf20kj-14" target="7QshRmXqY3w23GVf20kj-3" edge="1">
          <mxGeometry width="50" height="50" relative="1" as="geometry">
            <mxPoint x="400" y="420" as="sourcePoint" />
            <mxPoint x="450" y="370" as="targetPoint" />
          </mxGeometry>
        </mxCell>
        <mxCell id="mlzYNg9NmktDVVgbLRnO-8" style="edgeStyle=orthogonalEdgeStyle;rounded=0;orthogonalLoop=1;jettySize=auto;html=1;exitX=1;exitY=1;exitDx=0;exitDy=0;entryX=0.5;entryY=1;entryDx=0;entryDy=0;endArrow=none;endFill=0;" edge="1" parent="1" source="7QshRmXqY3w23GVf20kj-16" target="7QshRmXqY3w23GVf20kj-18">
          <mxGeometry relative="1" as="geometry" />
        </mxCell>
        <mxCell id="7QshRmXqY3w23GVf20kj-16" value="Original KSAT&lt;br&gt;Rew Src: No&lt;br&gt;Req Own: True&lt;br&gt;Modifiable: No" style="ellipse;whiteSpace=wrap;html=1;fillColor=#f5f5f5;strokeColor=#FFFF66;fontColor=#333333;strokeWidth=5;perimeterSpacing=0;" parent="1" vertex="1">
          <mxGeometry x="410" y="129" width="120" height="80" as="geometry" />
        </mxCell>
        <mxCell id="7QshRmXqY3w23GVf20kj-18" value="&lt;h1&gt;&lt;span&gt;KSAT wo Documatation&lt;/span&gt;&lt;/h1&gt;&lt;p&gt;&lt;span style=&quot;font-size: 12px ; font-weight: normal ; line-height: 90%&quot;&gt;This KSAT has a &amp;lt;Req_own&amp;gt; who is the authority to change this KSAT.&amp;nbsp; Because no other documentation is referenced by &amp;lt;Req_Src&amp;gt; this KSAT is the requirement itself.&lt;/span&gt;&lt;/p&gt;" style="text;html=1;strokeColor=#000000;fillColor=#ffffff;spacing=5;spacingTop=-20;whiteSpace=wrap;overflow=hidden;rounded=0;shadow=0;" parent="1" vertex="1">
          <mxGeometry x="540" y="50" width="290" height="120" as="geometry" />
        </mxCell>
        <mxCell id="mlzYNg9NmktDVVgbLRnO-7" style="edgeStyle=orthogonalEdgeStyle;rounded=0;orthogonalLoop=1;jettySize=auto;html=1;exitX=0.5;exitY=1;exitDx=0;exitDy=0;entryX=0;entryY=0;entryDx=0;entryDy=0;endArrow=none;endFill=0;" edge="1" parent="1" source="7QshRmXqY3w23GVf20kj-19" target="7QshRmXqY3w23GVf20kj-1">
          <mxGeometry relative="1" as="geometry" />
        </mxCell>
        <mxCell id="7QshRmXqY3w23GVf20kj-19" value="&lt;h1&gt;&lt;span&gt;KSAT w Documatation&lt;/span&gt;&lt;/h1&gt;&lt;p&gt;&lt;span style=&quot;font-size: 12px ; font-weight: normal ; line-height: 90%&quot;&gt;This KSAT has a &amp;lt;req_src&amp;gt; which is owned by &amp;lt;req_own&amp;gt; so this KSAT updates when the documentation updates.&lt;/span&gt;&lt;/p&gt;" style="text;html=1;strokeColor=#000000;fillColor=#ffffff;spacing=5;spacingTop=-20;whiteSpace=wrap;overflow=hidden;rounded=0;shadow=0;" parent="1" vertex="1">
          <mxGeometry x="10" y="10" width="290" height="100" as="geometry" />
        </mxCell>
        <mxCell id="7QshRmXqY3w23GVf20kj-23" value="&lt;h1&gt;Derived KSAT w Owner&lt;/h1&gt;&lt;div&gt;This KSAT was derived from a parent KSAT.&amp;nbsp; Additionally an authority identified in &amp;lt;req_own&amp;gt; has stated they want this as an original KSAT.&amp;nbsp; This KSAT may be copied if it must be altered but the original must persist under the control of the &amp;lt;req_own&amp;gt;&lt;/div&gt;" style="text;html=1;strokeColor=#000000;fillColor=#ffffff;spacing=5;spacingTop=-20;whiteSpace=wrap;overflow=hidden;rounded=0;shadow=0;" parent="1" vertex="1">
          <mxGeometry x="10" y="400" width="170" height="210" as="geometry" />
        </mxCell>
        <mxCell id="7QshRmXqY3w23GVf20kj-32" value="Train/Eval Item&lt;br&gt;" style="rectangle;whiteSpace=wrap;html=1;dashed=1;strokeColor=#66FF66;strokeWidth=5;" parent="1" vertex="1">
          <mxGeometry x="20" y="134" width="50" height="70" as="geometry" />
        </mxCell>
        <mxCell id="7QshRmXqY3w23GVf20kj-35" value="&lt;p style=&quot;line-height: 30%&quot;&gt;&lt;/p&gt;&lt;h3&gt;KSAT are fully satisfied if all children and train/eval items are met.&lt;/h3&gt;&lt;h3&gt;KSAT are partially satisfied if some children and/or items are met.&lt;/h3&gt;&lt;h3&gt;KSAT are not satisfied if their train/eval items are not met.&lt;/h3&gt;&lt;div&gt;&lt;span style=&quot;font-size: 12px ; font-weight: normal&quot;&gt;&lt;br&gt;&lt;/span&gt;&lt;/div&gt;&lt;p&gt;&lt;/p&gt;" style="text;html=1;strokeColor=#000000;fillColor=#ffffff;spacing=5;spacingTop=-20;whiteSpace=wrap;overflow=hidden;rounded=0;shadow=0;" parent="1" vertex="1">
          <mxGeometry x="310" y="590" width="490" height="120" as="geometry" />
        </mxCell>
        <mxCell id="mlzYNg9NmktDVVgbLRnO-3" value="" style="edgeStyle=orthogonalEdgeStyle;rounded=0;orthogonalLoop=1;jettySize=auto;html=1;entryX=1;entryY=0.5;entryDx=0;entryDy=0;exitX=0.5;exitY=1;exitDx=0;exitDy=0;exitPerimeter=0;" edge="1" parent="1" source="mlzYNg9NmktDVVgbLRnO-4" target="7QshRmXqY3w23GVf20kj-1">
          <mxGeometry relative="1" as="geometry">
            <mxPoint x="355" y="129" as="sourcePoint" />
            <mxPoint x="345" y="209" as="targetPoint" />
          </mxGeometry>
        </mxCell>
        <mxCell id="mlzYNg9NmktDVVgbLRnO-4" value="&lt;br&gt;&lt;br&gt;&amp;lt;req_src&amp;gt;&lt;br&gt;Title&lt;br&gt;&amp;lt;req_own&amp;gt;&lt;br&gt;OPR" style="shape=note;whiteSpace=wrap;html=1;backgroundOutline=1;darkOpacity=0.05;strokeColor=#000000;align=center;" vertex="1" parent="1">
          <mxGeometry x="320" y="49" width="70" height="90" as="geometry" />
        </mxCell>
        <mxCell id="mlzYNg9NmktDVVgbLRnO-6" value="" style="endArrow=none;html=1;" edge="1" parent="1">
          <mxGeometry width="50" height="50" relative="1" as="geometry">
            <mxPoint x="320" y="380" as="sourcePoint" />
            <mxPoint x="370" y="330" as="targetPoint" />
          </mxGeometry>
        </mxCell>
      </root>
    </mxGraphModel>
  </diagram>
</mxfile>
