[{
	"_id": {
		"$oid": "5ee92513580c86e868bd6f66"
	},
	"KSATs": [
		{
			"ksat_id": {
				"$oid": "5f457f1e1ea90ba9adb32e4f"
			},
			"item_proficiency": "3",
			"url": "https://90cos.gitlab.io/cyv/admin/roles-and-responsibility/SEE/training.html"
		},
		{
			"ksat_id": {
				"$oid": "5f457f1e1ea90ba9adb32e51"
			},
			"item_proficiency": "3",
			"url": "https://90cos.gitlab.io/cyv/admin/roles-and-responsibility/SEE/training.html"
		},
		{
			"ksat_id": {
				"$oid": "5f457f1e1ea90ba9adb32e55"
			},
			"item_proficiency": "3",
			"url": "https://90cos.gitlab.io/cyv/admin/roles-and-responsibility/SEE/training.html"
		},
		{
			"ksat_id": {
				"$oid": "5f457f1e1ea90ba9adb32e52"
			},
			"item_proficiency": "3",
			"url": "https://90cos.gitlab.io/cyv/admin/roles-and-responsibility/SEE/training.html"
		},
		{
			"ksat_id": {
				"$oid": "5f457f1e1ea90ba9adb32e53"
			},
			"item_proficiency": "3",
			"url": "https://90cos.gitlab.io/cyv/admin/roles-and-responsibility/SEE/training.html"
		},
		{
			"ksat_id": {
				"$oid": "5f457f1e1ea90ba9adb32e54"
			},
			"item_proficiency": "3",
			"url": "https://90cos.gitlab.io/cyv/admin/roles-and-responsibility/SEE/training.html"
		},
		{
			"ksat_id": {
				"$oid": "5f457f1e1ea90ba9adb32e56"
			},
			"item_proficiency": "3",
			"url": "https://90cos.gitlab.io/cyv/admin/roles-and-responsibility/SEE/training.html"
		},
		{
			"ksat_id": {
				"$oid": "5f457f1e1ea90ba9adb32e58"
			},
			"item_proficiency": "3",
			"url": "https://90cos.gitlab.io/cyv/admin/roles-and-responsibility/SEE/training.html"
		},
		{
			"ksat_id": {
				"$oid": "5f457f1e1ea90ba9adb32e5a"
			},
			"item_proficiency": "3",
			"url": "https://90cos.gitlab.io/cyv/admin/roles-and-responsibility/SEE/training.html"
		},
		{
			"ksat_id": {
				"$oid": "5f457f1e1ea90ba9adb32e59"
			},
			"item_proficiency": "3",
			"url": "https://90cos.gitlab.io/cyv/admin/roles-and-responsibility/SEE/training.html"
		},
		{
			"ksat_id": {
				"$oid": "5f457f1e1ea90ba9adb32e57"
			},
			"item_proficiency": "3",
			"url": "https://90cos.gitlab.io/cyv/admin/roles-and-responsibility/SEE/training.html"
		},
		{
			"ksat_id": {
				"$oid": "5f457f1e1ea90ba9adb32e5d"
			},
			"item_proficiency": "3",
			"url": "https://90cos.gitlab.io/cyv/admin/roles-and-responsibility/SEE/training.html"
		},
		{
			"ksat_id": {
				"$oid": "5f457f1e1ea90ba9adb32e5f"
			},
			"item_proficiency": "3",
			"url": "https://90cos.gitlab.io/cyv/admin/roles-and-responsibility/SEE/training.html"
		},
		{
			"ksat_id": {
				"$oid": "5f457f1e1ea90ba9adb32e5b"
			},
			"item_proficiency": "3",
			"url": "https://90cos.gitlab.io/cyv/admin/roles-and-responsibility/SEE/training.html"
		},
		{
			"ksat_id": {
				"$oid": "5f457f1e1ea90ba9adb32e5c"
			},
			"item_proficiency": "3",
			"url": "https://90cos.gitlab.io/cyv/admin/roles-and-responsibility/SEE/training.html"
		},
		{
			"ksat_id": {
				"$oid": "5f457f1e1ea90ba9adb32e5e"
			},
			"item_proficiency": "3",
			"url": "https://90cos.gitlab.io/cyv/admin/roles-and-responsibility/SEE/training.html"
		},
		{
			"ksat_id": {
				"$oid": "5f457f1e1ea90ba9adb32e65"
			},
			"item_proficiency": "3",
			"url": "https://90cos.gitlab.io/cyv/admin/roles-and-responsibility/SEE/training.html"
		},
		{
			"ksat_id": {
				"$oid": "5f457f1e1ea90ba9adb32e66"
			},
			"item_proficiency": "3",
			"url": "https://90cos.gitlab.io/cyv/admin/roles-and-responsibility/SEE/training.html"
		},
		{
			"ksat_id": {
				"$oid": "5f457f1e1ea90ba9adb32e61"
			},
			"item_proficiency": "3",
			"url": "https://90cos.gitlab.io/cyv/admin/roles-and-responsibility/SEE/training.html"
		},
		{
			"ksat_id": {
				"$oid": "5f457f1e1ea90ba9adb32e60"
			},
			"item_proficiency": "3",
			"url": "https://90cos.gitlab.io/cyv/admin/roles-and-responsibility/SEE/training.html"
		},
		{
			"ksat_id": {
				"$oid": "5f457f1e1ea90ba9adb32e63"
			},
			"item_proficiency": "3",
			"url": "https://90cos.gitlab.io/cyv/admin/roles-and-responsibility/SEE/training.html"
		},
		{
			"ksat_id": {
				"$oid": "5f457f1e1ea90ba9adb32e64"
			},
			"item_proficiency": "3",
			"url": "https://90cos.gitlab.io/cyv/admin/roles-and-responsibility/SEE/training.html"
		},
		{
			"ksat_id": {
				"$oid": "5f457f1e1ea90ba9adb32e68"
			},
			"item_proficiency": "3",
			"url": "https://90cos.gitlab.io/cyv/admin/roles-and-responsibility/SEE/training.html"
		},
		{
			"ksat_id": {
				"$oid": "5f457f1e1ea90ba9adb32e67"
			},
			"item_proficiency": "3",
			"url": "https://90cos.gitlab.io/cyv/admin/roles-and-responsibility/SEE/training.html"
		},
		{
			"ksat_id": {
				"$oid": "5f457f1e1ea90ba9adb32e69"
			},
			"item_proficiency": "3",
			"url": "https://90cos.gitlab.io/cyv/admin/roles-and-responsibility/SEE/training.html"
		}
	],
	"course": "SEE",
	"module": "see-basics",
	"topic": "SEE 101",
	"subject": "see_training",
	"lecture_time": 60,
	"perf_demo_time": 0,
	"references": [],
	"lesson_objectives": [],
	"performance_objectives": [],
	"module_id": "SEE_Training",
	"network": "NIPR",
	"work-roles": [
		"SEE"
	],
	"map_for": "training",
	"topic_path": "./",
	"created_on": "2020-06-16",
	"updated_on": "2020-06-23"
}]

