{
	"name": "Knowledge System Dev",
	"dockerComposeFile": ["../docker-compose.yml", "docker-compose.extend.yml"],

	"service": "knowledge-system-dev",
	"workspaceFolder": "/workspace/knowledge-system-dev",
	"shutdownAction": "stopCompose",

	"extensions": [
		"gruntfuggly.todo-tree",
		"ms-python.python",
		"ms-python.vscode-pylance",
		"streetsidesoftware.code-spell-checker"
	],

	"remoteUser": "node"
}
