{
    "_id": "BD_RE_0001",
    "rel-link_id": "5ee9250c761cf87371cf32cd",
    "question_name": "NOSCHEMABasic_MagicNum",
    "question_path": "performance/Reverse_Engineering/NOSCHEMABasic_MagicNum",
    "question_type": "performance_dev",
    "topic": "Reverse Engineering",
    "disabled": false,
    "provisioned": 0,
    "attempts": 0,
    "passes": 0,
    "failures": 0,
    "question": {
        "filepath": "performance/Reverse_Engineering/NOSCHEMABasic_MagicNum/Instructions.txt"
    },
    "support_files": [
        "performance/Reverse_Engineering/NOSCHEMABasic_MagicNum/BD_RE_2_magicnum.exe"
    ],
    "tests": [],
    "solution": "None Provided",
    "dependencies": {
        "libraries": [],
        "req_software": [
            "IDA Pro",
            "WinDBG"
        ]
    }
}