{
    "_id": "BD_NET_0034",
    "rel-link_id": "5ee9250b761cf87371cf3269",
    "question_name": "KeyServ_REST",
    "question_path": "performance/Networking/KeyServ_REST",
    "question_type": "performance_dev",
    "topic": "Networking",
    "disabled": false,
    "provisioned": 0,
    "attempts": 0,
    "passes": 0,
    "failures": 0,
    "question": {
        "filepath": "performance/Networking/KeyServ_REST/client.py"
    },
    "support_files": [
        "performance/Networking/KeyServ_REST/helper_stuff.py",
        "performance/Networking/KeyServ_REST/server.py",
        "performance/Networking/KeyServ_REST/websrv_config.json"
    ],
    "tests": [
        {
            "filepath": "performance/Networking/KeyServ_REST/runtest.py"
        }
    ],
    "solution": "performance/Networking/KeyServ_REST/Solution/client.py",
    "dependencies": {
        "libraries": [
            "flask",
            "django"
        ],
        "req_software": [
            "Python 3.7"
        ]
    }
}