{
    "_id": "BD_C_0095",
    "rel-link_id": "5ee9250c761cf87371cf329c",
    "question_name": "c_queue",
    "question_path": "performance/C_Programming/c_queue",
    "question_type": "performance_dev",
    "topic": "C Programming",
    "disabled": false,
    "provisioned": 0,
    "attempts": 0,
    "passes": 0,
    "failures": 0,
    "question": {
        "filepath": "performance/C_Programming/queue/TestCode.c",
        "headerpath": "performance/C_Programming/queue/TestCode.h"
    },
    "support_files": [],
    "tests": [
        {
            "filepath": "performance/C_Programming/queue/testcases.cpp"
        }
    ],
    "solution": "performance/C_Programming/queue/Solution/TestCode.c",
    "dependencies": {
        "libraries": [
            "gmock-1.7.0"
        ],
        "req_software": [
            "MS Visual Studio 2017"
        ]
    }
}