{
    "_id": "BD_PY_0133",
    "rel-link_id": "5ee9250c761cf87371cf32a0",
    "question_name": "python_recursion",
    "question_path": "performance/Python/python_recursion",
    "question_type": "performance_dev",
    "topic": "Python",
    "disabled": false,
    "provisioned": 0,
    "attempts": 0,
    "passes": 0,
    "failures": 0,
    "question": {
        "filepath": "performance/Python/python_recursion/testfile.py"
    },
    "support_files": [],
    "tests": [
        {
            "filepath": "performance/Python/python_recursion/runtests.py"
        }
    ],
    "solution": "performance/Python/python_recursion/Solution/testfile.py",
    "dependencies": {
        "libraries": [],
        "req_software": [
            "Python 3.7"
        ]
    }
}