{
    "_id": "BD_C_0110",
    "rel-link_id": "5ee9250c761cf87371cf327c",
    "question_name": "search_file",
    "question_path": "performance/C_Programming/search_file",
    "question_type": "performance_dev",
    "topic": "C Programming",
    "disabled": false,
    "provisioned": 0,
    "attempts": 0,
    "passes": 0,
    "failures": 0,
    "question": {
        "filepath": "performance/C_Programming/search_file/TestCode.c",
        "headerpath": "performance/C_Programming/search_file/TestCode.h"
    },
    "support_files": [
        "performance/C_Programming/search_file/test.txt",
        "performance/C_Programming/search_file/test2.txt",
        "performance/C_Programming/search_file/test4.txt",
        "performance/C_Programming/search_file/test5.txt",
        "performance/C_Programming/search_file/test6.txt"
    ],
    "tests": [
        {
            "filepath": "performance/C_Programming/search_file/testcases.cpp"
        }
    ],
    "solution": "performance/C_Programming/search_file/Solution/TestCode.c",
    "dependencies": {
        "libraries": [
            "gmock-1.7.0"
        ],
        "req_software": [
            "MS Visual Studio 2017"
        ]
    }
}