{
    "_id": "BD_PY_0132",
    "rel-link_id": "5ee9250c761cf87371cf32bc",
    "question_name": "python_file_tasks",
    "question_path": "performance/Python/python_file_tasks",
    "question_type": "performance_dev",
    "topic": "Python",
    "disabled": false,
    "provisioned": 0,
    "attempts": 0,
    "passes": 0,
    "failures": 0,
    "question": {
        "filepath": "performance/Python/python_file_tasks/testfile.py"
    },
    "support_files": [
        "performance/Python/python_file_tasks/original_files/*"
    ],
    "tests": [
        {
            "filepath": "performance/Python/python_file_tasks/runtests.py"
        }
    ],
    "solution": "performance/Python/python_file_tasks/Solution/testfile.py",
    "dependencies": {
        "libraries": [],
        "req_software": [
            "Python 3.7"
        ]
    }
}