{
    "uid": "BD_PY_FUNC_CLOS",
    "TRN_EVL_ID": "IDF",
    "NETWORK": "COMMERCIAL",
    "KSATs": [
        [
            "K0026",
            "B"
        ],
        [
            "K0027",
            "B"
        ]
    ],
    "course": "IDF",
    "module": "Python",
    "topic": "functions",
    "subject": "closures_iterators_generators",
    "lecture_time": 45,
    "perf_demo_time": 0,
    "references": [],
    "lesson_objectives": [
        {
            "description": "Describe the purpose and use of iterators in Python",
            "proficiency_level": "B",
            "KSATs": [
                "K0026"
            ],
            "MSBs": []
        },
        {
            "description": "Describe the purpose and use of generators in Python",
            "proficiency_level": "B",
            "KSATs": [
                "K0027"
            ],
            "MSBs": []
        }
    ],
    "performance_objectives": [],
    "workroles": [
        "basic-dev"
    ]
}