{
    "uid": "BD_PY_FLCON_IF",
    "TRN_EVL_ID": "IDF",
    "NETWORK": "COMMERCIAL",
    "KSATs": [
        [
            "S0082",
            "3"
        ],
        [
            "K0713",
            "C"
        ]
    ],
    "course": "IDF",
    "module": "Python",
    "topic": "flow_control",
    "subject": "if_elif_else",
    "lecture_time": 15,
    "perf_demo_time": 90,
    "references": [],
    "lesson_objectives": [
        {
            "description": "Comprehend If, Elif, Else statements in Python",
            "proficiency_level": "B",
            "KSATs": [
                "K0713"
            ],
            "MSBs": [
                {
                    "description": "Describe If, Elif, Else syntax",
                    "proficiency_level": "B",
                    "KSATs": [
                        "K0713"
                    ]
                },
                {
                    "description": "Given Python Code, predict the behavior of code involving If, Elif, Else syntax.",
                    "proficiency_level": "B",
                    "KSATs": [
                        "K0713"
                    ]
                }
            ]
        }
    ],
    "performance_objectives": [
        {
            "description": "Control the execution of a program with conditional If, Elif, Else statements.",
            "KSATs": [
                "S0082"
            ]
        }
    ],
    "workroles": [
        "basic-dev"
    ]
}