{
    "uid": "ASM_control_flow",
    "TRN_EVL_ID": "IDF",
    "NETWORK": "Commercial",
    "KSATs": [
        [
            "K0237",
            "B"
        ],
        [
            "K0238",
            "B"
        ],
        [
            "K0239",
            "B"
        ],
        [
            "K0774",
            "B"
        ],
        [
            "K0775",
            "B"
        ],
        [
            "K0810",
            "B"
        ]
    ],
    "course": "IDF",
    "module": "Assembly",
    "topic": "ASM_Control_flow",
    "subject": "Flags",
    "lecture_time": 0,
    "perf_demo_time": 0,
    "references": [],
    "lesson_objectives": [],
    "performance_objectives": [],
    "workroles": [
        "basic-dev"
    ]
}