[
	{
		"name": "test",
		"shape": "normal",
		"width": 1,
		"height": 1,
		"plotOffset": [382, 177],
		"src": "fond_balcon.png",
		"spawn": [560,294],
		"boundaries": [
			[433,227],
			[633,327],
			[532,377],
			[332,277]
		],
		"backgroundSize" : [500,300],
		"backgroundSize" : [1000,500],
		"surface": "concrete"
	},{
		"name": "balcon",
		"shape": "normal",
		"width": 4,
		"height": 2,
		"plotOffset": [382, 227],
		"src": "fond_balcon.png",
		"spawn": [560,294],
		"boundaries": [
			[433,227],
			[633,327],
			[532,377],
			[332,277]
		],
		"backgroundSize" : [1000,500],
		"surface": "concrete"
	},
	{
		"name": "ferme",
		"shape": "horizontal",
		"width": 16,
		"height": 27,
		"plotOffset": [9,351],
		"src": "fond_ferme.png",
		"spawn": [1500,500],
		"backgroundSize" : [1920,1080],
		"surface": "field"
	}
]