﻿# Tiled2Unity generated file. Do not modify by hand.
# Wavefront file for 'mapa-prueba_mesh_0002.obj'

# Vertices (Count = 20)
v -11 -3 0
v -12 -3 0
v -12 -2 0
v -11 -2 0
v -17 -3 0
v -18 -3 0
v -18 -2 0
v -17 -2 0
v -4 -5 0
v -5 -5 0
v -5 -4 0
v -4 -4 0
v -16 -6 0
v -17 -6 0
v -17 -5 0
v -16 -5 0
v -10 -9 0
v -11 -9 0
v -11 -8 0
v -10 -8 0

# Texture cooridinates (Count = 4)
vt 0.175 0.8333333
vt 0.2 0.8333333
vt 0.2 0.8611111
vt 0.175 0.8611111

# Normal
vn 0 0 -1

# Mesh description
g mapa-prueba_mesh_0002

# Faces
f 1/1/1 2/2/1 3/3/1 4/4/1
f 5/1/1 6/2/1 7/3/1 8/4/1
f 9/1/1 10/2/1 11/3/1 12/4/1
f 13/1/1 14/2/1 15/3/1 16/4/1
f 17/1/1 18/2/1 19/3/1 20/4/1

