{
	"info": {
		"_postman_id": "ed3ab419-3708-4b34-982a-511a0b26f2fd",
		"name": "account",
		"schema": "https://schema.getpostman.com/json/collection/v2.1.0/collection.json"
	},
	"item": [
		{
			"name": "localhost:8000/account/",
			"protocolProfileBehavior": {
				"disableBodyPruning": true
			},
			"request": {
				"method": "GET",
				"header": [],
				"body": {
					"mode": "raw",
					"raw": "",
					"options": {
						"raw": {
							"language": "json"
						}
					}
				},
				"url": {
					"raw": "localhost:8000/account/",
					"host": [
						"localhost"
					],
					"port": "8000",
					"path": [
						"account",
						""
					]
				}
			},
			"response": [
				{
					"name": "localhost:8000/account/",
					"originalRequest": {
						"method": "GET",
						"header": [],
						"body": {
							"mode": "raw",
							"raw": "",
							"options": {
								"raw": {
									"language": "json"
								}
							}
						},
						"url": {
							"raw": "localhost:8000/account/",
							"host": [
								"localhost"
							],
							"port": "8000",
							"path": [
								"account",
								""
							]
						}
					},
					"status": "OK",
					"code": 200,
					"_postman_previewlanguage": "json",
					"header": [
						{
							"key": "Content-Type",
							"value": "application/json"
						},
						{
							"key": "Transfer-Encoding",
							"value": "chunked"
						},
						{
							"key": "Date",
							"value": "Thu, 14 Oct 2021 09:08:49 GMT"
						},
						{
							"key": "Keep-Alive",
							"value": "timeout=60"
						},
						{
							"key": "Connection",
							"value": "keep-alive"
						}
					],
					"cookie": [],
					"body": "[\n    {\n        \"id\": 2,\n        \"marketingSalary\": 31,\n        \"mdSalary\": null,\n        \"marketer_id\": null,\n        \"marketer_salaryCoefficient\": null,\n        \"marketingdirector_id\": null,\n        \"marketingdirector_salaryCoefficient\": null\n    },\n    {\n        \"id\": 3,\n        \"marketingSalary\": null,\n        \"mdSalary\": null,\n        \"marketer_id\": null,\n        \"marketer_salaryCoefficient\": null,\n        \"marketingdirector_id\": null,\n        \"marketingdirector_salaryCoefficient\": null\n    },\n    {\n        \"id\": 4,\n        \"marketingSalary\": null,\n        \"mdSalary\": null,\n        \"marketer_id\": null,\n        \"marketer_salaryCoefficient\": null,\n        \"marketingdirector_id\": null,\n        \"marketingdirector_salaryCoefficient\": null\n    },\n    {\n        \"id\": 5,\n        \"marketingSalary\": null,\n        \"mdSalary\": null,\n        \"marketer_id\": null,\n        \"marketer_salaryCoefficient\": null,\n        \"marketingdirector_id\": null,\n        \"marketingdirector_salaryCoefficient\": null\n    },\n    {\n        \"id\": 6,\n        \"marketingSalary\": null,\n        \"mdSalary\": null,\n        \"marketer_id\": null,\n        \"marketer_salaryCoefficient\": null,\n        \"marketingdirector_id\": null,\n        \"marketingdirector_salaryCoefficient\": null\n    },\n    {\n        \"id\": 7,\n        \"marketingSalary\": null,\n        \"mdSalary\": null,\n        \"marketer_id\": null,\n        \"marketer_salaryCoefficient\": null,\n        \"marketingdirector_id\": null,\n        \"marketingdirector_salaryCoefficient\": null\n    },\n    {\n        \"id\": 8,\n        \"marketingSalary\": null,\n        \"mdSalary\": 2000,\n        \"marketer_id\": null,\n        \"marketer_salaryCoefficient\": null,\n        \"marketingdirector_id\": null,\n        \"marketingdirector_salaryCoefficient\": null\n    },\n    {\n        \"id\": 9,\n        \"marketingSalary\": 23,\n        \"mdSalary\": null,\n        \"marketer_id\": null,\n        \"marketer_salaryCoefficient\": 5,\n        \"marketingdirector_id\": null,\n        \"marketingdirector_salaryCoefficient\": null\n    },\n    {\n        \"id\": 10,\n        \"marketingSalary\": 23,\n        \"mdSalary\": null,\n        \"marketer_id\": null,\n        \"marketer_salaryCoefficient\": 5,\n        \"marketingdirector_id\": null,\n        \"marketingdirector_salaryCoefficient\": null\n    },\n    {\n        \"id\": 11,\n        \"marketingSalary\": 23,\n        \"mdSalary\": null,\n        \"marketer_id\": null,\n        \"marketer_salaryCoefficient\": 5,\n        \"marketingdirector_id\": null,\n        \"marketingdirector_salaryCoefficient\": null\n    },\n    {\n        \"id\": 12,\n        \"marketingSalary\": 23,\n        \"mdSalary\": null,\n        \"marketer_id\": null,\n        \"marketer_salaryCoefficient\": null,\n        \"marketingdirector_id\": null,\n        \"marketingdirector_salaryCoefficient\": null\n    },\n    {\n        \"id\": 13,\n        \"marketingSalary\": 23,\n        \"mdSalary\": null,\n        \"marketer_id\": null,\n        \"marketer_salaryCoefficient\": null,\n        \"marketingdirector_id\": null,\n        \"marketingdirector_salaryCoefficient\": null\n    },\n    {\n        \"id\": 14,\n        \"marketingSalary\": null,\n        \"mdSalary\": null,\n        \"marketer_id\": null,\n        \"marketer_salaryCoefficient\": null,\n        \"marketingdirector_id\": null,\n        \"marketingdirector_salaryCoefficient\": null\n    },\n    {\n        \"id\": 15,\n        \"marketingSalary\": null,\n        \"mdSalary\": null,\n        \"marketer_id\": null,\n        \"marketer_salaryCoefficient\": 5,\n        \"marketingdirector_id\": null,\n        \"marketingdirector_salaryCoefficient\": null\n    },\n    {\n        \"id\": 16,\n        \"marketingSalary\": null,\n        \"mdSalary\": null,\n        \"marketer_id\": null,\n        \"marketer_salaryCoefficient\": 5,\n        \"marketingdirector_id\": null,\n        \"marketingdirector_salaryCoefficient\": null\n    },\n    {\n        \"id\": 17,\n        \"marketingSalary\": null,\n        \"mdSalary\": null,\n        \"marketer_id\": null,\n        \"marketer_salaryCoefficient\": 5,\n        \"marketingdirector_id\": null,\n        \"marketingdirector_salaryCoefficient\": null\n    },\n    {\n        \"id\": 18,\n        \"marketingSalary\": null,\n        \"mdSalary\": null,\n        \"marketer_id\": null,\n        \"marketer_salaryCoefficient\": 5,\n        \"marketingdirector_id\": null,\n        \"marketingdirector_salaryCoefficient\": null\n    },\n    {\n        \"id\": 19,\n        \"marketingSalary\": 2000,\n        \"mdSalary\": null,\n        \"marketer_id\": null,\n        \"marketer_salaryCoefficient\": 5,\n        \"marketingdirector_id\": null,\n        \"marketingdirector_salaryCoefficient\": null\n    },\n    {\n        \"id\": 20,\n        \"marketingSalary\": 2000,\n        \"mdSalary\": null,\n        \"marketer_id\": null,\n        \"marketer_salaryCoefficient\": 5,\n        \"marketingdirector_id\": null,\n        \"marketingdirector_salaryCoefficient\": null\n    },\n    {\n        \"id\": 21,\n        \"marketingSalary\": 2000,\n        \"mdSalary\": null,\n        \"marketer_id\": null,\n        \"marketer_salaryCoefficient\": 5,\n        \"marketingdirector_id\": null,\n        \"marketingdirector_salaryCoefficient\": null\n    },\n    {\n        \"id\": 22,\n        \"marketingSalary\": 2000,\n        \"mdSalary\": null,\n        \"marketer_id\": null,\n        \"marketer_salaryCoefficient\": 5,\n        \"marketingdirector_id\": null,\n        \"marketingdirector_salaryCoefficient\": null\n    },\n    {\n        \"id\": 23,\n        \"marketingSalary\": 2000,\n        \"mdSalary\": null,\n        \"marketer_id\": null,\n        \"marketer_salaryCoefficient\": 5,\n        \"marketingdirector_id\": null,\n        \"marketingdirector_salaryCoefficient\": null\n    },\n    {\n        \"id\": 24,\n        \"marketingSalary\": null,\n        \"mdSalary\": null,\n        \"marketer_id\": null,\n        \"marketer_salaryCoefficient\": null,\n        \"marketingdirector_id\": null,\n        \"marketingdirector_salaryCoefficient\": null\n    },\n    {\n        \"id\": 25,\n        \"marketingSalary\": null,\n        \"mdSalary\": null,\n        \"marketer_id\": null,\n        \"marketer_salaryCoefficient\": null,\n        \"marketingdirector_id\": null,\n        \"marketingdirector_salaryCoefficient\": null\n    },\n    {\n        \"id\": 26,\n        \"marketingSalary\": null,\n        \"mdSalary\": null,\n        \"marketer_id\": null,\n        \"marketer_salaryCoefficient\": null,\n        \"marketingdirector_id\": null,\n        \"marketingdirector_salaryCoefficient\": null\n    },\n    {\n        \"id\": 27,\n        \"marketingSalary\": null,\n        \"mdSalary\": null,\n        \"marketer_id\": null,\n        \"marketer_salaryCoefficient\": null,\n        \"marketingdirector_id\": null,\n        \"marketingdirector_salaryCoefficient\": null\n    },\n    {\n        \"id\": 28,\n        \"marketingSalary\": 2000,\n        \"mdSalary\": 3000,\n        \"marketer_id\": null,\n        \"marketer_salaryCoefficient\": null,\n        \"marketingdirector_id\": null,\n        \"marketingdirector_salaryCoefficient\": null\n    },\n    {\n        \"id\": 29,\n        \"marketingSalary\": 2000,\n        \"mdSalary\": 3000,\n        \"marketer_id\": null,\n        \"marketer_salaryCoefficient\": null,\n        \"marketingdirector_id\": null,\n        \"marketingdirector_salaryCoefficient\": null\n    },\n    {\n        \"id\": 30,\n        \"marketingSalary\": 2000,\n        \"mdSalary\": 3000,\n        \"marketer_id\": 5,\n        \"marketer_salaryCoefficient\": 5,\n        \"marketingdirector_id\": null,\n        \"marketingdirector_salaryCoefficient\": null\n    },\n    {\n        \"id\": 31,\n        \"marketingSalary\": 2000,\n        \"mdSalary\": 3000,\n        \"marketer_id\": 5,\n        \"marketer_salaryCoefficient\": 5,\n        \"marketingdirector_id\": null,\n        \"marketingdirector_salaryCoefficient\": null\n    },\n    {\n        \"id\": 32,\n        \"marketingSalary\": 31,\n        \"mdSalary\": null,\n        \"marketer_id\": null,\n        \"marketer_salaryCoefficient\": null,\n        \"marketingdirector_id\": null,\n        \"marketingdirector_salaryCoefficient\": null\n    }\n]"
				}
			]
		},
		{
			"name": "localhost:8000/account/",
			"request": {
				"method": "PUT",
				"header": [],
				"body": {
					"mode": "raw",
					"raw": "{\"id\":\"2\",\"mdSalary\":\"9000\"}",
					"options": {
						"raw": {
							"language": "json"
						}
					}
				},
				"url": {
					"raw": "localhost:8000/account/",
					"host": [
						"localhost"
					],
					"port": "8000",
					"path": [
						"account",
						""
					]
				}
			},
			"response": [
				{
					"name": "localhost:8000/account/",
					"originalRequest": {
						"method": "PUT",
						"header": [],
						"body": {
							"mode": "raw",
							"raw": "{\"id\":\"2\",\"mdSalary\":\"9000\"}",
							"options": {
								"raw": {
									"language": "json"
								}
							}
						},
						"url": {
							"raw": "localhost:8000/account/",
							"host": [
								"localhost"
							],
							"port": "8000",
							"path": [
								"account",
								""
							]
						}
					},
					"status": "OK",
					"code": 200,
					"_postman_previewlanguage": "json",
					"header": [
						{
							"key": "Content-Type",
							"value": "application/json"
						},
						{
							"key": "Transfer-Encoding",
							"value": "chunked"
						},
						{
							"key": "Date",
							"value": "Thu, 14 Oct 2021 09:10:53 GMT"
						},
						{
							"key": "Keep-Alive",
							"value": "timeout=60"
						},
						{
							"key": "Connection",
							"value": "keep-alive"
						}
					],
					"cookie": [],
					"body": "{\n    \"id\": 2,\n    \"marketingSalary\": 31,\n    \"mdSalary\": 9000,\n    \"marketer_id\": null,\n    \"marketer_salaryCoefficient\": null,\n    \"marketingdirector_id\": null,\n    \"marketingdirector_salaryCoefficient\": null\n}"
				}
			]
		},
		{
			"name": "localhost:8000/account/",
			"request": {
				"method": "DELETE",
				"header": [],
				"body": {
					"mode": "raw",
					"raw": "{\"id\":\"2\",\"mdSalary\":\"9000\"}",
					"options": {
						"raw": {
							"language": "json"
						}
					}
				},
				"url": {
					"raw": "localhost:8000/account/2",
					"host": [
						"localhost"
					],
					"port": "8000",
					"path": [
						"account",
						"2"
					]
				}
			},
			"response": [
				{
					"name": "localhost:8000/account/",
					"originalRequest": {
						"method": "DELETE",
						"header": [],
						"body": {
							"mode": "raw",
							"raw": "{\"id\":\"2\",\"mdSalary\":\"9000\"}",
							"options": {
								"raw": {
									"language": "json"
								}
							}
						},
						"url": {
							"raw": "localhost:8000/account/2",
							"host": [
								"localhost"
							],
							"port": "8000",
							"path": [
								"account",
								"2"
							]
						}
					},
					"status": "OK",
					"code": 200,
					"_postman_previewlanguage": "plain",
					"header": [
						{
							"key": "Content-Length",
							"value": "0"
						},
						{
							"key": "Date",
							"value": "Thu, 14 Oct 2021 09:11:35 GMT"
						},
						{
							"key": "Keep-Alive",
							"value": "timeout=60"
						},
						{
							"key": "Connection",
							"value": "keep-alive"
						}
					],
					"cookie": [],
					"body": null
				}
			]
		},
		{
			"name": "localhost:8000/account/",
			"request": {
				"method": "POST",
				"header": [],
				"body": {
					"mode": "raw",
					"raw": "{\"mdSalary\":\"9000\",\"marketingSalary\":\"5000\",\"marketer_salaryCoefficient\":5}",
					"options": {
						"raw": {
							"language": "json"
						}
					}
				},
				"url": {
					"raw": "localhost:8000/account/",
					"host": [
						"localhost"
					],
					"port": "8000",
					"path": [
						"account",
						""
					]
				}
			},
			"response": [
				{
					"name": "localhost:8000/account/",
					"originalRequest": {
						"method": "POST",
						"header": [],
						"body": {
							"mode": "raw",
							"raw": "{\"mdSalary\":\"9000\",\"marketingSalary\":\"5000\",\"marketer_salaryCoefficient\":5}",
							"options": {
								"raw": {
									"language": "json"
								}
							}
						},
						"url": {
							"raw": "localhost:8000/account/",
							"host": [
								"localhost"
							],
							"port": "8000",
							"path": [
								"account",
								""
							]
						}
					},
					"status": "OK",
					"code": 200,
					"_postman_previewlanguage": "json",
					"header": [
						{
							"key": "Content-Type",
							"value": "application/json"
						},
						{
							"key": "Transfer-Encoding",
							"value": "chunked"
						},
						{
							"key": "Date",
							"value": "Thu, 14 Oct 2021 09:13:05 GMT"
						},
						{
							"key": "Keep-Alive",
							"value": "timeout=60"
						},
						{
							"key": "Connection",
							"value": "keep-alive"
						}
					],
					"cookie": [],
					"body": "{\n    \"id\": 35,\n    \"marketingSalary\": 5000,\n    \"mdSalary\": 9000,\n    \"marketer_id\": null,\n    \"marketer_salaryCoefficient\": 5,\n    \"marketingdirector_id\": null,\n    \"marketingdirector_salaryCoefficient\": null\n}"
				}
			]
		}
	]
}