<?xml version="1.0" encoding="UTF-8" standalone="no"?>
<svg
   xmlns:dc="http://purl.org/dc/elements/1.1/"
   xmlns:cc="http://creativecommons.org/ns#"
   xmlns:rdf="http://www.w3.org/1999/02/22-rdf-syntax-ns#"
   xmlns:svg="http://www.w3.org/2000/svg"
   xmlns="http://www.w3.org/2000/svg"
   xmlns:sodipodi="http://sodipodi.sourceforge.net/DTD/sodipodi-0.dtd"
   xmlns:inkscape="http://www.inkscape.org/namespaces/inkscape"
   version="1.1"
   id="svg2"
   viewBox="0 0 150.00001 65"
   height="65"
   width="150"
   inkscape:version="0.91 r13725"
   sodipodi:docname="elenq.svg">
  <sodipodi:namedview
     pagecolor="#ffffff"
     bordercolor="#666666"
     borderopacity="1"
     objecttolerance="10"
     gridtolerance="10"
     guidetolerance="10"
     inkscape:pageopacity="0"
     inkscape:pageshadow="2"
     inkscape:window-width="1920"
     inkscape:window-height="1021"
     id="namedview24"
     showgrid="false"
     inkscape:zoom="2.1404536"
     inkscape:cx="-92.643246"
     inkscape:cy="137.16596"
     inkscape:window-x="0"
     inkscape:window-y="0"
     inkscape:window-maximized="1"
     inkscape:current-layer="svg2"
     units="px" />
  <defs
     id="defs4" />
  <metadata
     id="metadata7">
    <rdf:RDF>
      <cc:Work
         rdf:about="">
        <dc:format>image/svg+xml</dc:format>
        <dc:type
           rdf:resource="http://purl.org/dc/dcmitype/StillImage" />
        <dc:title></dc:title>
      </cc:Work>
    </rdf:RDF>
  </metadata>
  <g
     transform="matrix(0.97169724,0,0,0.97169724,2.1994931,-958.87913)"
     id="layer1">
    <g
       transform="translate(-161.98599,807.24042)"
       id="g3429">
      <g
         id="flowRoot3336"
         style="font-style:normal;font-weight:normal;font-size:40px;line-height:125%;font-family:sans-serif;letter-spacing:0px;word-spacing:0px;fill:#000000;fill-opacity:1;stroke:none;stroke-width:1px;stroke-linecap:butt;stroke-linejoin:miter;stroke-opacity:1"
         transform="translate(-13.571429,-11.785714)">
        <path
           id="path3489"
           style="font-style:normal;font-variant:normal;font-weight:100;font-stretch:normal;font-size:75px;font-family:Armata;-inkscape-font-specification:'Armata Thin'"
           d="m 175.55742,234.47886 27.525,0 0,-2.7 -24.3,0 0,-17.25 20.55,0 0,-2.7 -20.55,0 0,-15.9 24.3,0 0,-2.7 -27.525,0 0,41.25 z"
           inkscape:connector-curvature="0" />
        <path
           id="path3491"
           style="font-style:normal;font-variant:normal;font-weight:100;font-stretch:normal;font-size:75px;font-family:Armata;-inkscape-font-specification:'Armata Thin'"
           d="m 208.22344,234.47886 3.225,0 0,-41.25 -3.225,0 0,41.25 z"
           inkscape:connector-curvature="0" />
        <path
           id="path3493"
           style="font-style:normal;font-variant:normal;font-weight:100;font-stretch:normal;font-size:75px;font-family:Armata;-inkscape-font-specification:'Armata Thin'"
           d="m 216.6375,219.70386 c 0,11.25 8.7,15.6 16.5,15.6 11.85,0 15.3,-4.725 16.05,-9.225 l -3.6,0 c -0.75,1.875 -2.175,6 -12.45,6 -5.925,0 -12.45,-3.6 -12.975,-11.025 l 29.025,0 0,-3.225 c -0.75,-10.425 -6.45,-15.75 -16.05,-15.75 -9.6,0 -16.5,7.2 -16.5,17.625 z m 3.675,-1.875 c 1.05,-7.875 5.175,-12.6 13.125,-12.6 7.95,0 11.4,5.1 12.15,12.6 l -25.275,0 z"
           inkscape:connector-curvature="0" />
        <path
           id="path3495"
           style="font-style:normal;font-variant:normal;font-weight:100;font-stretch:normal;font-size:75px;font-family:Armata;-inkscape-font-specification:'Armata Thin'"
           d="m 254.5875,234.47886 3.225,0 0,-25.875 c 1.575,-2.025 5.025,-3.225 10.2,-3.225 3.6,0 8.1,1.35 8.1,7.65 l 0,21.45 3.45,0 0,-21.45 c 0,-8.25 -6.15,-10.95 -11.55,-10.95 -5.55,0 -9.075,1.35 -10.2,4.05 l 0,-3.225 -3.225,0 0,31.575 z"
           inkscape:connector-curvature="0" />
        <path
           id="path3497"
           style="font-style:normal;font-variant:normal;font-weight:100;font-stretch:normal;font-size:75px;font-family:Armata;-inkscape-font-specification:'Armata Thin'"
           d="m 284.53125,213.85386 c 0,11.175 9.3,21.45 20.625,21.45 4.8,0 9.15,-1.875 12.675,-4.8 l 4.8,3.975 3.75,0 -6.6,-5.775 c 3.675,-3.975 6,-9.3 6,-14.85 0,-11.1 -9.225,-21.375 -20.625,-21.375 -11.4,0 -20.625,10.2 -20.625,21.375 z m 3.3,0 c 0,-9.15 7.575,-18.3 17.325,-18.3 9.75,0 17.325,9.15 17.325,18.3 0,9.15 -7.575,18.375 -17.325,18.375 -9.75,0 -17.325,-9.225 -17.325,-18.375 z"
           inkscape:connector-curvature="0" />
      </g>
      <g
         id="text3346"
         style="font-style:normal;font-weight:normal;font-size:40px;line-height:125%;font-family:sans-serif;letter-spacing:0px;word-spacing:0px;fill:#000000;fill-opacity:1;stroke:none;stroke-width:1px;stroke-linecap:butt;stroke-linejoin:miter;stroke-opacity:1">
        <path
           id="path3500"
           style="font-style:normal;font-variant:normal;font-weight:100;font-stretch:normal;font-size:23.75px;font-family:Armata;-inkscape-font-specification:'Armata Thin'"
           d="m 176.40771,232.67678 4.0375,0 0,12.18375 1.02125,0 0,-12.18375 4.06125,0 0,-0.87875 -9.12,0 0,0.87875 z"
           inkscape:connector-curvature="0" />
        <path
           id="path3502"
           style="font-style:normal;font-variant:normal;font-weight:100;font-stretch:normal;font-size:23.75px;font-family:Armata;-inkscape-font-specification:'Armata Thin'"
           d="m 187.0132,244.86053 8.71625,0 0,-0.855 -7.695,0 0,-5.4625 6.5075,0 0,-0.855 -6.5075,0 0,-5.035 7.695,0 0,-0.855 -8.71625,0 0,13.0625 z"
           inkscape:connector-curvature="0" />
        <path
           id="path3504"
           style="font-style:normal;font-variant:normal;font-weight:100;font-stretch:normal;font-size:23.75px;font-family:Armata;-inkscape-font-specification:'Armata Thin'"
           d="m 197.23869,238.32928 c 0,4.275 1.97125,6.7925 5.62875,6.7925 2.8025,0 5.15375,-1.49625 5.15375,-3.63375 l -1.14,0 c 0,1.30625 -1.5675,2.6125 -4.01375,2.6125 -3.15875,0 -4.5125,-3.06375 -4.5125,-5.77125 0,-3.11125 1.82875,-5.77125 4.6075,-5.77125 2.4225,0 3.91875,1.25875 3.91875,2.68375 l 1.14,0 c 0,-2.35125 -2.35125,-3.68125 -5.15375,-3.68125 -3.895,0 -5.62875,3.4675 -5.62875,6.76875 z"
           inkscape:connector-curvature="0" />
        <path
           id="path3506"
           style="font-style:normal;font-variant:normal;font-weight:100;font-stretch:normal;font-size:23.75px;font-family:Armata;-inkscape-font-specification:'Armata Thin'"
           d="m 209.64992,244.86053 1.02125,0 0,-6.3175 6.5075,0 0,6.3175 1.02125,0 0,-13.0625 -1.02125,0 0,5.89 -6.5075,0 0,-5.89 -1.02125,0 0,13.0625 z"
           inkscape:connector-curvature="0" />
        <path
           id="path3508"
           style="font-style:normal;font-variant:normal;font-weight:100;font-stretch:normal;font-size:23.75px;font-family:Armata;-inkscape-font-specification:'Armata Thin'"
           d="m 219.99416,244.86053 1.045,0 0,-11.115 7.19625,11.115 1.02125,0 0,-13.0625 -1.02125,0 0,11.23375 -7.19625,-11.23375 -1.045,0 0,13.0625 z"
           inkscape:connector-curvature="0" />
        <path
           id="path3510"
           style="font-style:normal;font-variant:normal;font-weight:100;font-stretch:normal;font-size:23.75px;font-family:Armata;-inkscape-font-specification:'Armata Thin'"
           d="m 230.8917,238.32928 c 0,3.53875 2.945,6.7925 6.53125,6.7925 3.58625,0 6.53125,-3.25375 6.53125,-6.7925 0,-3.515 -2.92125,-6.76875 -6.53125,-6.76875 -3.61,0 -6.53125,3.23 -6.53125,6.76875 z m 1.045,0 c 0,-2.8975 2.39875,-5.795 5.48625,-5.795 3.0875,0 5.48625,2.8975 5.48625,5.795 0,2.8975 -2.39875,5.81875 -5.48625,5.81875 -3.0875,0 -5.48625,-2.92125 -5.48625,-5.81875 z"
           inkscape:connector-curvature="0" />
        <path
           id="path3512"
           style="font-style:normal;font-variant:normal;font-weight:100;font-stretch:normal;font-size:23.75px;font-family:Armata;-inkscape-font-specification:'Armata Thin'"
           d="m 245.55213,244.86053 7.90875,0 0,-1.02125 -6.8875,0 0,-12.04125 -1.02125,0 0,13.0625 z"
           inkscape:connector-curvature="0" />
        <path
           id="path3514"
           style="font-style:normal;font-variant:normal;font-weight:100;font-stretch:normal;font-size:23.75px;font-family:Armata;-inkscape-font-specification:'Armata Thin'"
           d="m 254.92002,238.32928 c 0,3.53875 2.945,6.7925 6.53125,6.7925 3.58625,0 6.53125,-3.25375 6.53125,-6.7925 0,-3.515 -2.92125,-6.76875 -6.53125,-6.76875 -3.61,0 -6.53125,3.23 -6.53125,6.76875 z m 1.045,0 c 0,-2.8975 2.39875,-5.795 5.48625,-5.795 3.0875,0 5.48625,2.8975 5.48625,5.795 0,2.8975 -2.39875,5.81875 -5.48625,5.81875 -3.0875,0 -5.48625,-2.92125 -5.48625,-5.81875 z"
           inkscape:connector-curvature="0" />
        <path
           id="path3516"
           style="font-style:normal;font-variant:normal;font-weight:100;font-stretch:normal;font-size:23.75px;font-family:Armata;-inkscape-font-specification:'Armata Thin'"
           d="m 269.5092,238.32928 c 0,4.275 1.97125,6.7925 5.62875,6.7925 1.63875,0 3.0875,-0.5225 4.01375,-1.3775 l 0,1.11625 1.02125,0 0,-6.4125 -5.225,0 0,1.02125 4.20375,0 0,2.01875 c 0,1.30625 -1.5675,2.6125 -4.01375,2.6125 -3.15875,0 -4.5125,-3.06375 -4.5125,-5.77125 0,-3.11125 1.82875,-5.77125 4.6075,-5.77125 2.4225,0 3.91875,1.25875 3.91875,2.68375 l 1.02125,0 c 0,-2.35125 -2.2325,-3.68125 -5.035,-3.68125 -3.895,0 -5.62875,3.4675 -5.62875,6.76875 z"
           inkscape:connector-curvature="0" />
        <path
           id="path3518"
           style="font-style:normal;font-variant:normal;font-weight:100;font-stretch:normal;font-size:23.75px;font-family:Armata;-inkscape-font-specification:'Armata Thin'"
           d="m 281.68182,231.79803 4.75,7.62375 0,5.43875 1.02125,0 0,-5.43875 4.77375,-7.62375 -1.14,0 -4.1325,6.65 -4.10875,-6.65 -1.16375,0 z"
           inkscape:connector-curvature="0" />
      </g>
    </g>
  </g>
</svg>
