{
  "name": "feat-dashboard",
  "$schema": "../../../node_modules/nx/schemas/project-schema.json",
  "sourceRoot": "libs/web/feat-dashboard/src",
  "projectType": "library",
  "tags": [],
  "targets": {
    "lint": {
      "executor": "@nx/eslint:lint",
      "outputs": ["{options.outputFile}"]
    },
    "test": {
      "executor": "@nx/jest:jest",
      "outputs": ["{workspaceRoot}/coverage/{projectRoot}"],
      "options": {
        "jestConfig": "libs/web/feat-dashboard/jest.config.ts"
      }
    }
  }
}
