	M114 Tag3 Lernstandsanalyse 
	---------------------------
	      X hoch 0 = ?
	
	       1 (dez) =      ???? (bin)
	      10 (dez) =      ???? (bin)
	     126 (dez) = ???? ???? (bin)
	    1298 (dez) = ???? ???? (bin)
		
	       4 (dez) =         ? (hex)	 
	      15 (dez) =         ? (hex)
	      32 (dez) =        ?? (hex)
	    1298 (dez) =       ??? (hex)
		
	    0001 (bin) =         ? (dez)
	    1111 (bin) =         ? (dez)	
	 10'1010 (bin) =        ?? (dez)		
	101'1001 (bin) =        ?? (dez)
	
	3 (hex) =   ? (dez)  =   ???? (bin)
	5 (hex) =   ? (dez)  =   ???? (bin)
	A (hex) =   ? (dez)  =   ???? (bin)
	F (hex) =   ? (dez)  =   ???? (bin)
			
	5AF3 (hex) =    ??'??? (dez)
	5AF3 (hex) = ???? ???? (bin) 
	--> was fällt hier auf?
	
	
	wobei 16 hoch 2 = 256
	wobei 16 hoch 3 =4096
	
	
	für die Ehrgeizigen und Schnellen
	   23'283 (dez) =      ???? (hex)
	1011'1011 (bin) =       ??? (dez)
	

Lösungen:

https://www.youtube.com/watch?v=cKvAUzqDdJI (15:50 min)
https://www.youtube.com/watch?v=-6Je-FuAufk ( 6:34 min)
https://www.youtube.com/watch?v=6WsI95N0QKU ( 4:35 min)