



Adam Adler
Bahnhofstrasse 1
8000 Zuerich

CHE-111.222.333 MWST




Zürich, den 21.03.2022                           Autoleasing AG
                                                 Gewerbestrasse 100
                                                 5000 Aarau

Kundennummer:      K821
Auftragsnummer:    A003
	 
Rechnung Nr       21003
-----------------------
  1   Einrichten E-Mailclients              6      25.00  CHF      150.00  0.00%
  2   Konfig & Schulung Scanningcenter      1    1200.00  CHF     1200.00  0.00%
                                                              -----------       
                                                Total CHF         1350.00

                                                MWST  CHF            0.00
















Zahlungsziel ohne Abzug 30 Tage (30.08.2020)

Einzahlungsschein











    1350 . 00                    1350 . 00     Autoleasing AG
                                               Gewerbestrasse 100
0 00000 00000 00000                            5000 Aarau

Autoleasing AG
Gewerbestrasse 100
5000 Aarau