module gitlab.com/edgetic/oss/raritan-pdu-exporter

go 1.15

require (
	github.com/goji/httpauth v0.0.0-20160601135302-2da839ab0f4d
	github.com/gorilla/mux v1.8.0
	github.com/iancoleman/strcase v0.1.1
	github.com/jessevdk/go-flags v1.4.1-0.20200711081900-c17162fe8fd7
	github.com/mitchellh/mapstructure v1.3.3
	github.com/prometheus/client_golang v1.7.1
	golang.org/x/sys v0.0.0-20200828081204-131dc92a58d5 // indirect
	k8s.io/apimachinery v0.19.0
	k8s.io/klog v1.0.0
	k8s.io/klog/v2 v2.3.0
)
