{
 "cells": [
  {
   "cell_type": "markdown",
   "metadata": {},
   "source": [
    "# 6D pose estimation using Point Pair Features(PPF)\n",
    "Point Pair Features is a widely used method for 6D pose estimation from point clouds. In this notebook, we first explain how PPF works. Then we test the pose estimation performance using the OpenCV implementation. \n",
    "\n",
    "## PPF algorithm\n",
    "<img src=\"../../description/PPF.png\" alt=\"Drawing\" style=\"width: 1000px;\"/>\n",
    "\n",
    "Point Pair Features are defined as follows:\n",
    "\n",
    "$\\bf{F}(m1,m2)=(||\\bf{d}||_2,<(\\bf{n1},\\bf{d}),<(\\bf{n2},\\bf{d}),<(\\bf{n1},\\bf{n2}))$\n",
    "\n",
    "where m1 and m2 are two selected points on the model (or scene), $\\bf{d}$ is the difference vector, $\\bf{n1}$ and $\\bf{n2}$ are the normals at m1 and m2. \n",
    "\n",
    "<img src=\"../../description/ppf_matching.jpg\" alt=\"Drawing\" style=\"width: 1000px;\"/>\n",
    "\n",
    "- During the training stage, PPF of model is extracted. Feature vectors are quantized and indexed. \n",
    "- In the test stage, same features are extracted from the scene and compared to the model features. For each point pair in the scene, first calculates its PPF $\\bf{F}(s_r,s_i)$, then find the corresponding point pairs $(m_r,m_i)$ in the model by looking up the hashtable. The pose can be calculated by aligning point pair in the scene and model. Each corresponding point pair votes for a certain pose. The pose with higher votes have more confidence "
   ]
  },
  {
   "cell_type": "markdown",
   "metadata": {},
   "source": [
    "## PPF performance of OpenCV implementation"
   ]
  },
  {
   "cell_type": "markdown",
   "metadata": {},
   "source": [
    "There are multiple open source implementations for PPF. \n",
    "- OpenCV python and C++ implementation https://github.com/opencv/opencv_contrib/tree/master/modules/surface_matching\n",
    "- matlab implementation https://github.com/guglu/ppf-matching\n",
    "- PCL C++ implementation https://github.com/PointCloudLibrary/pcl/blob/master/apps/src/ppf_object_recognition.cpp\n",
    "\n",
    "We use OpenCV implmentation below, because it's the only python implementation. \n",
    "\n",
    "Import dependencies"
   ]
  },
  {
   "cell_type": "code",
   "execution_count": 1,
   "metadata": {},
   "outputs": [
    {
     "name": "stdout",
     "output_type": "stream",
     "text": [
      "Jupyter environment detected. Enabling Open3D WebVisualizer.\n",
      "[Open3D INFO] WebRTC GUI backend enabled.\n",
      "[Open3D INFO] WebRTCWindowSystem: HTTP handshake server disabled.\n",
      "opencv version 4.5.3\n"
     ]
    }
   ],
   "source": [
    "import cv2 as cv\n",
    "import open3d as o3d\n",
    "import numpy as np\n",
    "import copy\n",
    "#https://docs.opencv.org/3.4/d9/d25/group__surface__matching.html\n",
    "\n",
    "print('opencv version',cv.__version__)"
   ]
  },
  {
   "cell_type": "markdown",
   "metadata": {},
   "source": [
    "Load model and scene"
   ]
  },
  {
   "cell_type": "code",
   "execution_count": 2,
   "metadata": {
    "pycharm": {
     "name": "#%%\n"
    }
   },
   "outputs": [
    {
     "name": "stdout",
     "output_type": "stream",
     "text": [
      "Loading model...\n",
      "Loading scene...\n"
     ]
    }
   ],
   "source": [
    "modelname = \"frog\"\n",
    "scenename = \"scene_with_frog\"\n",
    "folder=\"../../data/PPFmatching/\"\n",
    "\n",
    "print('Loading model...')\n",
    "pc = cv.ppf_match_3d.loadPLYSimple(folder+\"%s.ply\" % modelname, 1)\n",
    "\n",
    "print('Loading scene...')\n",
    "pcTest = cv.ppf_match_3d.loadPLYSimple(folder+\"%s.ply\" % scenename, 1)"
   ]
  },
  {
   "cell_type": "code",
   "execution_count": 3,
   "metadata": {
    "pycharm": {
     "name": "#%%\n"
    }
   },
   "outputs": [],
   "source": [
    "def load_point_cloud(filename, voxel_size=0.0):\n",
    "    pcd = o3d.io.read_point_cloud(filename)\n",
    "    pcd_down = pcd.voxel_down_sample(voxel_size=voxel_size)\n",
    "    return pcd_down"
   ]
  },
  {
   "cell_type": "markdown",
   "metadata": {},
   "source": [
    "Visualize model with open3d"
   ]
  },
  {
   "cell_type": "code",
   "execution_count": 4,
   "metadata": {
    "pycharm": {
     "name": "#%%\n"
    },
    "scrolled": true
   },
   "outputs": [],
   "source": [
    "model_pcd = load_point_cloud(folder+\"%s.ply\" % modelname, 0.01)\n",
    "o3d.visualization.draw_geometries([model_pcd])"
   ]
  },
  {
   "cell_type": "markdown",
   "metadata": {},
   "source": [
    "Visualize scene with open3d"
   ]
  },
  {
   "cell_type": "code",
   "execution_count": 5,
   "metadata": {
    "pycharm": {
     "name": "#%%\n"
    }
   },
   "outputs": [],
   "source": [
    "model_scene = load_point_cloud(folder+\"%s.ply\" % scenename, 0.01)\n",
    "o3d.visualization.draw_geometries([model_scene])"
   ]
  },
  {
   "cell_type": "markdown",
   "metadata": {},
   "source": [
    "Visualize model and scene in the same window. Model in yellow, scene in cyan"
   ]
  },
  {
   "cell_type": "code",
   "execution_count": 6,
   "metadata": {
    "pycharm": {
     "name": "#%%\n"
    }
   },
   "outputs": [],
   "source": [
    "def draw_point_clouds(source, target):\n",
    "    source_temp = copy.deepcopy(source)\n",
    "    target_temp = copy.deepcopy(target)\n",
    "    source_temp.paint_uniform_color([1, 0.706, 0])\n",
    "    target_temp.paint_uniform_color([0, 0.651, 0.929])\n",
    "    o3d.visualization.draw_geometries([source_temp, target_temp])\n",
    "    \n",
    "draw_point_clouds(model_pcd, model_scene)"
   ]
  },
  {
   "cell_type": "markdown",
   "metadata": {},
   "source": [
    "**Parameter Tuning**\n",
    "\n",
    "**relativeSamplingStep** Models are first sampled uniformly in order to improve efficiency. $\\bf{relativeSamplingStep}$ is the sampling distance relative to the object's diameter.For example, if RelativeSamplingStep is set to 0.05 and the diameter of model is 1m (1000mm), the points sampled from the object's surface will be approximately 50 mm apart. From another point of view, if the sampling RelativeSamplingStep is set to 0.05, at most 20x20x20=8000 model points are generated (depending on how the model fills in the volume). Consequently this results in at most 8000x8000 pairs. Decreasing this value leads to a denser model, and a more accurate pose estimation but the larger the model, the slower the training. `Increasing the value leads to a less accurate pose computation but a smaller model and faster model generation and matching. Beware of the memory consumption when using small values`.\n",
    "\n",
    "**relativeDistanceStep**\tThe discretization distance of the point pair distance relative to the model's diameter. This value has a direct impact on the hashtable. Using small values would lead to too fine discretization, and thus ambiguity in the bins of hashtable. Too large values would lead to no discrimination over the feature vectors and different point pair features would be assigned to the same bin. This argument defaults to the value of RelativeSamplingStep. `For noisy scenes, the value can be increased to improve the robustness of the matching against noisy points`.\n",
    "\n",
    "**relativeSceneDistance**\n",
    "Set the distance threshold relative to the diameter of the model. This parameter is equivalent to relativeSamplingStep in the training stage. This parameter acts like a prior sampling with the relativeSceneSampleStep parameter.\n",
    "\n",
    "**relativeSceneSampleStep** The ratio of scene points to be used for the matching after sampling with relativeSceneDistance. For example, if this value is set to 1.0/5.0, every 5th point from the scene is used for pose estimation. This parameter allows an easy trade-off between speed and accuracy of the matching. `Increasing the value leads to less points being used and in turn to a faster but less accurate pose computation. Decreasing the value has the inverse effect`.\n"
   ]
  },
  {
   "cell_type": "markdown",
   "metadata": {},
   "source": [
    "Train model(Compute model feature)"
   ]
  },
  {
   "cell_type": "code",
   "execution_count": 7,
   "metadata": {
    "pycharm": {
     "is_executing": true
    }
   },
   "outputs": [
    {
     "name": "stdout",
     "output_type": "stream",
     "text": [
      "Training...\n"
     ]
    }
   ],
   "source": [
    "RelativeSamplingStep=0.05  # 0.025 - 0.05\n",
    "RelativeDistanceStep=0.05  # 0.025 - 0.05\n",
    "detector = cv.ppf_match_3d_PPF3DDetector(RelativeSamplingStep, RelativeDistanceStep)\n",
    "\n",
    "print('Training...')\n",
    "detector.trainModel(pc)"
   ]
  },
  {
   "cell_type": "markdown",
   "metadata": {},
   "source": [
    "Match model feature with scene feature"
   ]
  },
  {
   "cell_type": "code",
   "execution_count": 8,
   "metadata": {
    "pycharm": {
     "is_executing": true,
     "name": "#%%\n"
    }
   },
   "outputs": [
    {
     "name": "stdout",
     "output_type": "stream",
     "text": [
      "Matching...\n"
     ]
    }
   ],
   "source": [
    "relativeSceneSampleStep=1.0/5.0 # <1\n",
    "relativeSceneDistance=RelativeSamplingStep\n",
    "print('Matching...')\n",
    "results = detector.match(pcTest, relativeSceneSampleStep, relativeSceneDistance)"
   ]
  },
  {
   "cell_type": "code",
   "execution_count": 9,
   "metadata": {
    "pycharm": {
     "is_executing": true
    }
   },
   "outputs": [
    {
     "name": "stdout",
     "output_type": "stream",
     "text": [
      "Poses without ICP: \n",
      "\n",
      "-- Pose to Model Index 2: NumVotes = 146, Residual = 0.000000\n",
      "[[ 0.91439395 -0.26088393  0.30898315 -0.19051383]\n",
      " [ 0.27350163  0.9616847   0.00258864  0.02261011]\n",
      " [-0.29787223  0.08215485  0.95087855  0.03415042]\n",
      " [ 0.          0.          0.          1.        ]]\n",
      "\n",
      "\n",
      "-- Pose to Model Index 302: NumVotes = 109, Residual = 0.000000\n",
      "[[ 0.88605078 -0.32414332  0.32973433 -0.23054711]\n",
      " [ 0.35354704  0.93428351 -0.0315978   0.0410516 ]\n",
      " [-0.29799011  0.14465491  0.94295093  0.04822475]\n",
      " [ 0.          0.          0.          1.        ]]\n",
      "\n",
      "\n",
      "-- Pose to Model Index 786: NumVotes = 77, Residual = 0.000000\n",
      "[[ 0.66268645  0.40481564  0.23019609 -0.18425497]\n",
      " [-0.45624385  0.48415395  0.46201275 -0.41986152]\n",
      " [ 0.09331394 -0.50767955  0.62415804  0.05049156]\n",
      " [ 0.          0.          0.          1.        ]]\n",
      "\n",
      "\n",
      "-- Pose to Model Index 171: NumVotes = 60, Residual = 0.000000\n",
      "[[-0.41901833 -0.61831785  0.66491102 -0.29246506]\n",
      " [ 0.78911965  0.11423533  0.60352338 -0.90596783]\n",
      " [-0.44912561  0.77758171  0.44006007  0.58929582]\n",
      " [ 0.          0.          0.          1.        ]]\n",
      "\n",
      "\n",
      "-- Pose to Model Index 72: NumVotes = 57, Residual = 0.000000\n",
      "[[ 0.93517559 -0.24785245  0.25301341 -0.15858166]\n",
      " [ 0.24142853  0.96876385  0.05664689 -0.02215574]\n",
      " [-0.25915032  0.00810987  0.96580295  0.00502304]\n",
      " [ 0.          0.          0.          1.        ]]\n",
      "\n",
      "\n",
      "-- Pose to Model Index 115: NumVotes = 56, Residual = 0.000000\n",
      "[[-0.76301998 -0.30948685  0.56746665 -0.43076379]\n",
      " [-0.36895249 -0.51231518 -0.77550449  0.51452366]\n",
      " [ 0.53073022 -0.80109366  0.27672078  0.54312236]\n",
      " [ 0.          0.          0.          1.        ]]\n",
      "\n",
      "\n",
      "-- Pose to Model Index 48: NumVotes = 56, Residual = 0.000000\n",
      "[[ 0.97281493 -0.0577534   0.22426691 -0.06720626]\n",
      " [ 0.06991695  0.99646034 -0.04667334  0.05776998]\n",
      " [-0.22077754  0.06108458  0.97340945  0.00715241]\n",
      " [ 0.          0.          0.          1.        ]]\n",
      "\n",
      "\n",
      "-- Pose to Model Index 111: NumVotes = 53, Residual = 0.000000\n",
      "[[-0.43999099 -0.52870944  0.72586105 -0.36055386]\n",
      " [ 0.62419182  0.40104755  0.6704815  -0.83420348]\n",
      " [-0.64559469  0.74808235  0.1535588   0.8618966 ]\n",
      " [ 0.          0.          0.          1.        ]]\n",
      "\n",
      "\n",
      "-- Pose to Model Index 57: NumVotes = 51, Residual = 0.000000\n",
      "[[ 0.8828513  -0.25256098  0.39596279 -0.26609551]\n",
      " [ 0.2992489   0.95229934 -0.05980013  0.08708032]\n",
      " [-0.36197193  0.17128606  0.91631731  0.04693718]\n",
      " [ 0.          0.          0.          1.        ]]\n",
      "\n",
      "\n",
      "-- Pose to Model Index 515: NumVotes = 48, Residual = 0.000000\n",
      "[[-0.6111262  -0.73444014  0.29516513 -0.21438754]\n",
      " [ 0.79137595 -0.55950102  0.24633862 -0.15155461]\n",
      " [-0.01577578  0.38413056  0.92314399 -0.05739768]\n",
      " [ 0.          0.          0.          1.        ]]\n",
      "\n",
      "\n",
      "-- Pose to Model Index 14: NumVotes = 47, Residual = 0.000000\n",
      "[[ 0.67979822  0.70696902  0.19511327 -0.63891278]\n",
      " [-0.69339178  0.7062202  -0.1430415   0.06813272]\n",
      " [-0.23891884 -0.03805058  0.97029374  0.25784087]\n",
      " [ 0.          0.          0.          1.        ]]\n",
      "\n",
      "\n",
      "-- Pose to Model Index 819: NumVotes = 46, Residual = 0.000000\n",
      "[[ 0.58772646  0.4186486   0.69232287 -1.16845911]\n",
      " [-0.45195724  0.87963576 -0.1482416   0.17570945]\n",
      " [-0.6710531  -0.22577483  0.70619648  0.5497668 ]\n",
      " [ 0.          0.          0.          1.        ]]\n",
      "\n",
      "\n",
      "-- Pose to Model Index 422: NumVotes = 44, Residual = 0.000000\n",
      "[[ 0.14604105  0.81768433  0.55683422 -0.43408604]\n",
      " [-0.55180132 -0.39984477  0.73187393 -0.57663163]\n",
      " [ 0.8210891  -0.4141455   0.39280555  0.29503812]\n",
      " [ 0.          0.          0.          1.        ]]\n",
      "\n",
      "\n",
      "-- Pose to Model Index 539: NumVotes = 44, Residual = 0.000000\n",
      "[[ 0.97261158 -0.10458578  0.20757776 -0.06828772]\n",
      " [ 0.10399286  0.99448234  0.01379751 -0.01809645]\n",
      " [-0.20787544  0.00816699  0.97812121 -0.00988962]\n",
      " [ 0.          0.          0.          1.        ]]\n",
      "\n",
      "\n",
      "-- Pose to Model Index 171: NumVotes = 43, Residual = 0.000000\n",
      "[[ 0.8345873  -0.42977876  0.3446074  -0.8920816 ]\n",
      " [ 0.3382806   0.89356295  0.29514655 -0.16360181]\n",
      " [-0.43477613 -0.12975156  0.89114211  0.39094626]\n",
      " [ 0.          0.          0.          1.        ]]\n",
      "\n",
      "\n",
      "-- Pose to Model Index 3: NumVotes = 43, Residual = 0.000000\n",
      "[[-0.06048889 -0.91067258 -0.40867659  0.24413064]\n",
      " [ 0.66658541 -0.34160373  0.6625487  -0.53206844]\n",
      " [-0.74297038 -0.23234102  0.62770428  0.07084499]\n",
      " [ 0.          0.          0.          1.        ]]\n",
      "\n",
      "\n",
      "-- Pose to Model Index 177: NumVotes = 43, Residual = 0.000000\n",
      "[[-0.20029344  0.75731521  0.62157558 -0.43292608]\n",
      " [ 0.40042566 -0.51574665  0.75740655 -0.62102653]\n",
      " [ 0.89417103  0.40059838 -0.19994777  1.00357933]\n",
      " [ 0.          0.          0.          1.        ]]\n",
      "\n",
      "\n",
      "-- Pose to Model Index 177: NumVotes = 43, Residual = 0.000000\n",
      "[[-0.31319784 -0.91549976 -0.2525219   0.18879333]\n",
      " [ 0.85160398 -0.38842719  0.35198719 -0.22336438]\n",
      " [-0.42033056 -0.10480702  0.90129779 -0.09124685]\n",
      " [ 0.          0.          0.          1.        ]]\n",
      "\n",
      "\n",
      "-- Pose to Model Index 177: NumVotes = 41, Residual = 0.000000\n",
      "[[ 0.53509309 -0.34443312  0.77138914 -0.37016015]\n",
      " [ 0.13051787 -0.86844097 -0.47830469  0.04034385]\n",
      " [ 0.83464991  0.3566176  -0.41974208  1.29520798]\n",
      " [ 0.          0.          0.          1.        ]]\n",
      "\n",
      "\n",
      "-- Pose to Model Index 284: NumVotes = 41, Residual = 0.000000\n",
      "[[ 0.7481696  -0.50972554  0.42476126 -0.0661086 ]\n",
      " [ 0.08337701  0.70732655  0.70195258 -0.83205501]\n",
      " [-0.65824807 -0.48976425  0.57169962  0.16691998]\n",
      " [ 0.          0.          0.          1.        ]]\n",
      "\n",
      "\n",
      "-- Pose to Model Index 422: NumVotes = 40, Residual = 0.000000\n",
      "[[-0.37928016 -0.39503688  0.83671526 -0.43241668]\n",
      " [ 0.38182137 -0.89051948 -0.24736105 -0.22269662]\n",
      " [ 0.84282798  0.22565663  0.4885899   0.52122329]\n",
      " [ 0.          0.          0.          1.        ]]\n",
      "\n",
      "\n",
      "-- Pose to Model Index 87: NumVotes = 39, Residual = 0.000000\n",
      "[[-0.92772948 -0.07568092  0.36550021 -0.2232104 ]\n",
      " [-0.16936705 -0.78725925 -0.59290613  0.28550459]\n",
      " [ 0.3326151  -0.61196019  0.71754576  0.12750061]\n",
      " [ 0.          0.          0.          1.        ]]\n",
      "\n",
      "\n",
      "-- Pose to Model Index 111: NumVotes = 39, Residual = 0.000000\n",
      "[[-0.81029639 -0.42852722  0.39973014 -0.10408125]\n",
      " [ 0.50600745 -0.16756434  0.84609613 -0.89571501]\n",
      " [-0.29559471  0.88785506  0.35261475  0.55624247]\n",
      " [ 0.          0.          0.          1.        ]]\n",
      "\n",
      "\n",
      "-- Pose to Model Index 284: NumVotes = 38, Residual = 0.000000\n",
      "[[ 0.77223254 -0.45295482  0.44552086 -0.09868215]\n",
      " [ 0.0256984   0.72292713  0.6904462  -0.67971984]\n",
      " [-0.63482005 -0.52173585  0.56990807  0.09447803]\n",
      " [ 0.          0.          0.          1.        ]]\n",
      "\n",
      "\n",
      "-- Pose to Model Index 114: NumVotes = 38, Residual = 0.000000\n",
      "[[ 0.15952528  0.92209991  0.35253855 -0.38385967]\n",
      " [-0.85559122 -0.04900164  0.51532758 -0.30944126]\n",
      " [ 0.49245848 -0.38383667  0.78112359 -0.08742895]\n",
      " [ 0.          0.          0.          1.        ]]\n",
      "\n",
      "\n",
      "-- Pose to Model Index 180: NumVotes = 38, Residual = 0.000000\n",
      "[[ 0.01754014 -0.83241286 -0.5538783   0.42530709]\n",
      " [ 0.84833381 -0.28079658  0.44886861 -0.29943964]\n",
      " [-0.52917114 -0.4777469   0.70123876  0.04647342]\n",
      " [ 0.          0.          0.          1.        ]]\n",
      "\n",
      "\n",
      "-- Pose to Model Index 719: NumVotes = 37, Residual = 0.000000\n",
      "[[ 0.33067621 -0.44417548  0.83268325 -0.45959549]\n",
      " [ 0.61691717 -0.56596863 -0.5468937   0.25647075]\n",
      " [ 0.71418936  0.69454133  0.08686711  0.81521705]\n",
      " [ 0.          0.          0.          1.        ]]\n",
      "\n",
      "\n",
      "-- Pose to Model Index 284: NumVotes = 37, Residual = 0.000000\n",
      "[[ 0.74723326 -0.49728697  0.44084931 -0.09240049]\n",
      " [ 0.28822746  0.84023856  0.45926474 -0.48681692]\n",
      " [-0.59880496 -0.21611301  0.77118596 -0.09389357]\n",
      " [ 0.          0.          0.          1.        ]]\n",
      "\n",
      "\n",
      "-- Pose to Model Index 825: NumVotes = 37, Residual = 0.000000\n",
      "[[-0.39222508  0.9121139  -0.11919611 -0.013114  ]\n",
      " [-0.90668701 -0.36148627  0.21736225 -0.10443995]\n",
      " [ 0.15517137  0.19332849  0.96878581 -0.13545292]\n",
      " [ 0.          0.          0.          1.        ]]\n",
      "\n",
      "\n",
      "-- Pose to Model Index 177: NumVotes = 36, Residual = 0.000000\n",
      "[[ 0.61198594 -0.08024354 -0.78678725  0.17491561]\n",
      " [ 0.20175325  0.97776419  0.05720847 -0.0502851 ]\n",
      " [ 0.76470179 -0.19374767  0.61456733  0.63113336]\n",
      " [ 0.          0.          0.          1.        ]]\n",
      "\n",
      "\n",
      "-- Pose to Model Index 177: NumVotes = 36, Residual = 0.000000\n",
      "[[ 0.63278275 -0.49898665  0.59211343 -0.23188589]\n",
      " [ 0.64335338  0.76433711 -0.0434189  -0.0551718 ]\n",
      " [-0.43090882  0.40841291  0.80468409  0.06166537]\n",
      " [ 0.          0.          0.          1.        ]]\n",
      "\n",
      "\n",
      "-- Pose to Model Index 284: NumVotes = 36, Residual = 0.000000\n",
      "[[ 0.44386905  0.8950909   0.04233851 -0.38687375]\n",
      " [-0.6910156   0.3118237   0.65212225 -0.97188018]\n",
      " [ 0.57050654 -0.31871345  0.75693066  0.41805256]\n",
      " [ 0.          0.          0.          1.        ]]\n",
      "\n",
      "\n",
      "-- Pose to Model Index 284: NumVotes = 36, Residual = 0.000000\n",
      "[[-0.41500704 -0.88951811 -0.19111956 -0.48474317]\n",
      " [ 0.30598008  0.06137113 -0.95005777  0.9340169 ]\n",
      " [ 0.85682282 -0.45275944  0.24670538  0.97436614]\n",
      " [ 0.          0.          0.          1.        ]]\n",
      "\n",
      "\n",
      "-- Pose to Model Index 177: NumVotes = 36, Residual = 0.000000\n",
      "[[ 0.33589315  0.9143986   0.22594466 -0.23363714]\n",
      " [-0.82707675  0.17155332  0.53526956 -0.27069803]\n",
      " [ 0.45068818 -0.36666696  0.81390141 -0.11237982]\n",
      " [ 0.          0.          0.          1.        ]]\n",
      "\n",
      "\n",
      "-- Pose to Model Index 180: NumVotes = 36, Residual = 0.000000\n",
      "[[ 0.75104203 -0.4588458   0.4747593  -0.10816868]\n",
      " [ 0.20901738  0.84730399  0.48824961 -0.58942588]\n",
      " [-0.62629673 -0.26746304  0.73226766  0.12448366]\n",
      " [ 0.          0.          0.          1.        ]]\n",
      "\n",
      "\n",
      "-- Pose to Model Index 177: NumVotes = 36, Residual = 0.000000\n",
      "[[ 0.28409908  0.93157526  0.22683747 -0.16918602]\n",
      " [-0.82425288  0.11644192  0.55411955 -0.29880397]\n",
      " [ 0.48979067 -0.34439629  0.80093464 -0.09277606]\n",
      " [ 0.          0.          0.          1.        ]]\n",
      "\n",
      "\n",
      "-- Pose to Model Index 284: NumVotes = 35, Residual = 0.000000\n",
      "[[ 0.74168782 -0.5335221   0.40651366 -0.05426968]\n",
      " [ 0.23265762  0.77306844  0.59011492 -0.66755482]\n",
      " [-0.62910223 -0.34310255  0.69750343  0.12138862]\n",
      " [ 0.          0.          0.          1.        ]]\n",
      "\n",
      "\n",
      "-- Pose to Model Index 180: NumVotes = 35, Residual = 0.000000\n",
      "[[ 0.30541561  0.93178433  0.19621232  0.12776652]\n",
      " [-0.81892677  0.15188303  0.55343517 -0.32993675]\n",
      " [ 0.48588089 -0.32971126  0.80945058 -0.1006258 ]\n",
      " [ 0.          0.          0.          1.        ]]\n",
      "\n",
      "\n",
      "-- Pose to Model Index 284: NumVotes = 35, Residual = 0.000000\n",
      "[[ 0.74452095 -0.50686433  0.43448487 -0.08626878]\n",
      " [ 0.35955977  0.85280372  0.37873816 -0.42009421]\n",
      " [-0.56249918 -0.12575521  0.81717826  0.05123702]\n",
      " [ 0.          0.          0.          1.        ]]\n",
      "\n",
      "\n",
      "-- Pose to Model Index 463: NumVotes = 35, Residual = 0.000000\n",
      "[[-0.22776348 -0.78864383 -0.57110832  0.63412317]\n",
      " [ 0.9304192  -0.34922493  0.11118481  0.01100708]\n",
      " [-0.28713048 -0.50604631  0.81331004 -0.12439071]\n",
      " [ 0.          0.          0.          1.        ]]\n",
      "\n",
      "\n",
      "-- Pose to Model Index 171: NumVotes = 35, Residual = 0.000000\n",
      "[[-0.56685229 -0.40414976  0.71787286 -0.35160932]\n",
      " [ 0.81776452 -0.38149836  0.43095266 -0.71853498]\n",
      " [ 0.09969791  0.83133746  0.54675256  0.45858005]\n",
      " [ 0.          0.          0.          1.        ]]\n",
      "\n",
      "\n",
      "-- Pose to Model Index 284: NumVotes = 35, Residual = 0.000000\n",
      "[[-0.36571179 -0.88023302 -0.30239828  0.22516182]\n",
      " [ 0.45006871  0.11714053 -0.8852775   0.44964892]\n",
      " [ 0.81467358 -0.45985642  0.35332567  0.79665517]\n",
      " [ 0.          0.          0.          1.        ]]\n",
      "\n",
      "\n",
      "-- Pose to Model Index 177: NumVotes = 35, Residual = 0.000000\n",
      "[[ 0.06962871  0.89294117  0.44475602 -0.447594  ]\n",
      " [ 0.46304914 -0.42382805  0.77843129 -0.63180103]\n",
      " [ 0.88359342  0.15174272 -0.44298625  1.21188265]\n",
      " [ 0.          0.          0.          1.        ]]\n",
      "\n",
      "\n",
      "-- Pose to Model Index 794: NumVotes = 35, Residual = 0.000000\n",
      "[[ 0.09521182  0.54160609  0.83522305 -1.07771229]\n",
      " [-0.84381298 -0.40122493  0.35636808 -0.20171965]\n",
      " [ 0.52812343 -0.73870251  0.4188129   0.20416108]\n",
      " [ 0.          0.          0.          1.        ]]\n",
      "\n",
      "\n",
      "-- Pose to Model Index 177: NumVotes = 34, Residual = 0.000000\n",
      "[[-0.18572377 -0.89984873 -0.3946884   0.39036293]\n",
      " [ 0.53732895  0.2432896  -0.80751952  0.93615631]\n",
      " [ 0.822669   -0.36205307  0.43833011  0.23713879]\n",
      " [ 0.          0.          0.          1.        ]]\n",
      "\n",
      "\n",
      "-- Pose to Model Index 177: NumVotes = 34, Residual = 0.000000\n",
      "[[-0.37233665 -0.89791475 -0.23476483 -0.38985673]\n",
      " [ 0.60875864 -0.04534468 -0.79205857  0.58648041]\n",
      " [ 0.70055574 -0.43782755  0.56349684  0.64793257]\n",
      " [ 0.          0.          0.          1.        ]]\n",
      "\n",
      "\n",
      "-- Pose to Model Index 177: NumVotes = 34, Residual = 0.000000\n",
      "[[ 0.29533456  0.93263713  0.20728118  0.05272306]\n",
      " [-0.82869378  0.14209972  0.54136337 -0.29556261]\n",
      " [ 0.47544098 -0.33165594  0.81483754 -0.10017009]\n",
      " [ 0.          0.          0.          1.        ]]\n",
      "\n",
      "\n",
      "-- Pose to Model Index 177: NumVotes = 34, Residual = 0.000000\n",
      "[[-0.2887763  -0.9157399  -0.27933614  0.07297149]\n",
      " [ 0.83902653 -0.38259131  0.38685705 -0.25552254]\n",
      " [-0.46113202 -0.12265529  0.87881337 -0.07708869]\n",
      " [ 0.          0.          0.          1.        ]]\n",
      "\n",
      "\n",
      "-- Pose to Model Index 170: NumVotes = 34, Residual = 0.000000\n",
      "[[-0.70316145  0.67642714 -0.21911254  0.42427137]\n",
      " [-0.23929486 -0.51531595 -0.82291399  0.82034227]\n",
      " [-0.66955355 -0.52620889  0.52421584  0.11110699]\n",
      " [ 0.          0.          0.          1.        ]]\n",
      "\n",
      "\n",
      "-- Pose to Model Index 111: NumVotes = 33, Residual = 0.000000\n",
      "[[-0.54914688  0.83378167  0.05697212  0.10066494]\n",
      " [-0.55790879 -0.31498717 -0.76780262  0.31812181]\n",
      " [-0.62223427 -0.45342166  0.63814835  0.51115742]\n",
      " [ 0.          0.          0.          1.        ]]\n",
      "\n",
      "\n",
      "-- Pose to Model Index 111: NumVotes = 33, Residual = 0.000000\n",
      "[[-0.39539897 -0.57304983  0.71782557 -0.33674243]\n",
      " [ 0.80877193  0.15322053  0.56781286 -0.88773522]\n",
      " [-0.43537067  0.80506979  0.40288338  0.62158149]\n",
      " [ 0.          0.          0.          1.        ]]\n",
      "\n",
      "\n",
      "-- Pose to Model Index 463: NumVotes = 33, Residual = 0.000000\n",
      "[[ 0.02364664  0.94470195  0.32707655 -0.69317308]\n",
      " [-0.8104632   0.20966405 -0.54698299  0.37861768]\n",
      " [-0.58531209 -0.2521492   0.77060401  0.47538056]\n",
      " [ 0.          0.          0.          1.        ]]\n",
      "\n",
      "\n",
      "-- Pose to Model Index 26: NumVotes = 33, Residual = 0.000000\n",
      "[[ 0.89930018 -0.15838142  0.40764508 -0.23530485]\n",
      " [-0.03585326  0.90228043  0.42965633 -0.37200475]\n",
      " [-0.43585976 -0.40100542  0.80574247  0.04494977]\n",
      " [ 0.          0.          0.          1.        ]]\n",
      "\n",
      "\n",
      "-- Pose to Model Index 284: NumVotes = 32, Residual = 0.000000\n",
      "[[ 0.45186893  0.88492587  0.11278598  0.1072736 ]\n",
      " [-0.67925828  0.25934692  0.68654742 -1.0053159 ]\n",
      " [ 0.57829288 -0.38684026  0.71828404  0.4802136 ]\n",
      " [ 0.          0.          0.          1.        ]]\n",
      "\n",
      "\n",
      "-- Pose to Model Index 452: NumVotes = 32, Residual = 0.000000\n",
      "[[-0.71846111  0.06489461 -0.69253326  0.1505511 ]\n",
      " [ 0.4709655  -0.68729912 -0.55300219  0.4397628 ]\n",
      " [-0.51186436 -0.72346984  0.46323457  0.73148875]\n",
      " [ 0.          0.          0.          1.        ]]\n",
      "\n",
      "\n",
      "-- Pose to Model Index 422: NumVotes = 32, Residual = 0.000000\n",
      "[[-0.53596508 -0.55108737 -0.63956558  0.14323291]\n",
      " [ 0.83045996 -0.48046349 -0.28194165 -0.17800914]\n",
      " [-0.15191343 -0.68224449  0.71516765  0.41615221]\n",
      " [ 0.          0.          0.          1.        ]]\n",
      "\n",
      "\n",
      "-- Pose to Model Index 177: NumVotes = 32, Residual = 0.000000\n",
      "[[-0.03757233  0.8779437   0.47728731 -0.35252128]\n",
      " [-0.88770577 -0.2486487   0.38749489 -0.80787213]\n",
      " [ 0.45887557 -0.40913161  0.788698    0.3901002 ]\n",
      " [ 0.          0.          0.          1.        ]]\n",
      "\n",
      "\n",
      "-- Pose to Model Index 461: NumVotes = 32, Residual = 0.000000\n",
      "[[-0.64405521 -0.44343665  0.62334327 -0.25050206]\n",
      " [ 0.76428282 -0.40775697  0.49960586 -0.8036258 ]\n",
      " [ 0.03262901  0.79818431  0.60152901  0.38002752]\n",
      " [ 0.          0.          0.          1.        ]]\n",
      "\n",
      "\n",
      "-- Pose to Model Index 177: NumVotes = 32, Residual = 0.000000\n",
      "[[ 0.16524185 -0.70655697 -0.68809329  0.07622546]\n",
      " [ 0.59365279  0.62839261 -0.50269185  0.15320977]\n",
      " [ 0.78757317 -0.32542277  0.52328627  0.64390252]\n",
      " [ 0.          0.          0.          1.        ]]\n",
      "\n",
      "\n",
      "-- Pose to Model Index 180: NumVotes = 31, Residual = 0.000000\n",
      "[[ 0.37121399  0.92666064  0.0591628  -0.44985915]\n",
      " [-0.83826568  0.30703495  0.45059981 -0.40074456]\n",
      " [ 0.39938806 -0.21686309  0.89076348  0.39353648]\n",
      " [ 0.          0.          0.          1.        ]]\n",
      "\n",
      "\n",
      "-- Pose to Model Index 386: NumVotes = 31, Residual = 0.000000\n",
      "[[-0.04137818 -0.72923625  0.68300976 -0.38998862]\n",
      " [ 0.6958752   0.46950351  0.54343736 -0.49497309]\n",
      " [-0.71696971  0.497776    0.48803022  0.34812698]\n",
      " [ 0.          0.          0.          1.        ]]\n",
      "\n",
      "\n",
      "-- Pose to Model Index 177: NumVotes = 31, Residual = 0.000000\n",
      "[[ 0.23004642  0.95041601  0.20925597 -0.5645905 ]\n",
      " [-0.82181045  0.07455016  0.56486268 -0.88625462]\n",
      " [ 0.52125447 -0.30191338  0.79821181  0.4072496 ]\n",
      " [ 0.          0.          0.          1.        ]]\n",
      "\n",
      "\n",
      "-- Pose to Model Index 323: NumVotes = 31, Residual = 0.000000\n",
      "[[ 0.61374815 -0.38540281  0.68904128 -0.29450304]\n",
      " [ 0.05892401 -0.84795932 -0.52677599  0.06098935]\n",
      " [ 0.78729992  0.36390887 -0.49772398  1.54437284]\n",
      " [ 0.          0.          0.          1.        ]]\n",
      "\n",
      "\n",
      "-- Pose to Model Index 14: NumVotes = 31, Residual = 0.000000\n",
      "[[-0.85471305 -0.4227553  -0.30123672  0.00949236]\n",
      " [ 0.5071996  -0.80366733 -0.31123527  0.20585446]\n",
      " [-0.11051775 -0.41880399  0.90132627 -0.0150016 ]\n",
      " [ 0.          0.          0.          1.        ]]\n",
      "\n",
      "\n",
      "-- Pose to Model Index 422: NumVotes = 31, Residual = 0.000000\n",
      "[[-0.17625299 -0.80080446 -0.57240467  0.0996761 ]\n",
      " [ 0.98012188 -0.19658127 -0.02677521 -0.39443048]\n",
      " [-0.09108233 -0.56574555  0.819534    0.33979639]\n",
      " [ 0.          0.          0.          1.        ]]\n",
      "\n",
      "\n",
      "-- Pose to Model Index 63: NumVotes = 31, Residual = 0.000000\n",
      "[[-0.422376   -0.42813854  0.79893423 -1.06082404]\n",
      " [ 0.81724282 -0.56112358  0.13135639 -0.03570684]\n",
      " [ 0.3920621   0.70840505  0.58689828  0.31410653]\n",
      " [ 0.          0.          0.          1.        ]]\n",
      "\n",
      "\n",
      "-- Pose to Model Index 284: NumVotes = 31, Residual = 0.000000\n",
      "[[ 0.60549404 -0.37747005  0.7006378  -0.32241422]\n",
      " [ 0.09261891 -0.84096051 -0.53311084  0.20384906]\n",
      " [ 0.79044209  0.38768775 -0.47423571  1.38818362]\n",
      " [ 0.          0.          0.          1.        ]]\n",
      "\n",
      "\n",
      "-- Pose to Model Index 180: NumVotes = 30, Residual = 0.000000\n",
      "[[ 0.62459382 -0.23146266  0.74586031 -0.31488449]\n",
      " [-0.54943386 -0.80896027  0.20905912 -0.66993516]\n",
      " [ 0.55498197 -0.54037795 -0.632445    1.54642348]\n",
      " [ 0.          0.          0.          1.        ]]\n",
      "\n",
      "\n",
      "-- Pose to Model Index 514: NumVotes = 30, Residual = 0.000000\n",
      "[[-0.30963113  0.79812537  0.51684084 -0.6078618 ]\n",
      " [-0.87725496 -0.44946646  0.16853378 -0.34345434]\n",
      " [ 0.36681371 -0.40121789  0.83932825  0.09437232]\n",
      " [ 0.          0.          0.          1.        ]]\n",
      "\n",
      "\n",
      "-- Pose to Model Index 245: NumVotes = 29, Residual = 0.000000\n",
      "[[ 0.58589304 -0.23089517 -0.77679905  0.52891957]\n",
      " [ 0.65917561  0.69336838  0.29108042 -0.23418047]\n",
      " [ 0.47139883 -0.68258898  0.55844017  0.27844409]\n",
      " [ 0.          0.          0.          1.        ]]\n",
      "\n",
      "\n",
      "-- Pose to Model Index 59: NumVotes = 29, Residual = 0.000000\n",
      "[[ 0.0582959  -0.65452249  0.75379168 -0.59527757]\n",
      " [ 0.41269543  0.70333493  0.57879397 -0.46831616]\n",
      " [-0.90900169  0.27734506  0.31111998  0.50108638]\n",
      " [ 0.          0.          0.          1.        ]]\n",
      "\n",
      "\n",
      "-- Pose to Model Index 178: NumVotes = 29, Residual = 0.000000\n",
      "[[-0.37373752  0.52985398  0.76129825 -0.61702207]\n",
      " [-0.7663763  -0.63874753  0.06832978 -0.54650742]\n",
      " [ 0.52248218 -0.55790353  0.64479145  0.50771227]\n",
      " [ 0.          0.          0.          1.        ]]\n",
      "\n",
      "\n",
      "-- Pose to Model Index 605: NumVotes = 29, Residual = 0.000000\n",
      "[[ 0.97342105 -0.07530143 -0.21628952  0.03777845]\n",
      " [ 0.20354515  0.71734832  0.66631881 -0.62555215]\n",
      " [ 0.10498016 -0.69263344  0.71360919  0.12822295]\n",
      " [ 0.          0.          0.          1.        ]]\n",
      "\n",
      "\n",
      "-- Pose to Model Index 177: NumVotes = 29, Residual = 0.000000\n",
      "[[-0.06792203  0.85879998  0.50778853 -0.72442557]\n",
      " [-0.86442774 -0.30478317  0.39983985 -0.76406114]\n",
      " [ 0.49814786 -0.41178856  0.76307201  0.42535814]\n",
      " [ 0.          0.          0.          1.        ]]\n",
      "\n",
      "\n",
      "-- Pose to Model Index 284: NumVotes = 29, Residual = 0.000000\n",
      "[[ 0.55773323  0.75720817 -0.33995504  0.40788528]\n",
      " [-0.47278141  0.62645521  0.61970284 -0.82815287]\n",
      " [ 0.68221066 -0.18490445  0.70738884  0.51034192]\n",
      " [ 0.          0.          0.          1.        ]]\n",
      "\n",
      "\n",
      "-- Pose to Model Index 181: NumVotes = 28, Residual = 0.000000\n",
      "[[-0.7688868  -0.15592963  0.62007987 -1.21318515]\n",
      " [-0.43745977 -0.57899183 -0.68803882  0.5877643 ]\n",
      " [ 0.46630681 -0.80028396  0.37696623  0.80841273]\n",
      " [ 0.          0.          0.          1.        ]]\n",
      "\n",
      "\n",
      "-- Pose to Model Index 166: NumVotes = 28, Residual = 0.000000\n",
      "[[ 0.55101995 -0.54540888  0.63159019 -0.54207747]\n",
      " [ 0.25876065  0.83122211  0.49204952 -0.432231  ]\n",
      " [-0.79335991 -0.10769841  0.59915032  0.33716485]\n",
      " [ 0.          0.          0.          1.        ]]\n",
      "\n",
      "\n",
      "-- Pose to Model Index 514: NumVotes = 28, Residual = 0.000000\n",
      "[[-0.25782369 -0.77301002 -0.57963994  0.40493055]\n",
      " [ 0.78154399 -0.51958258  0.34528674 -0.20563153]\n",
      " [-0.56808092 -0.36399101  0.73810203 -0.01513469]\n",
      " [ 0.          0.          0.          1.        ]]\n",
      "\n",
      "\n",
      "-- Pose to Model Index 830: NumVotes = 28, Residual = 0.000000\n",
      "[[-0.69782497  0.67868657 -0.22896472  0.41665797]\n",
      " [-0.71298235 -0.62759295  0.31270314 -0.1776906 ]\n",
      " [ 0.06853078  0.38145987  0.92184158 -0.08190206]\n",
      " [ 0.          0.          0.          1.        ]]\n",
      "\n",
      "\n",
      "-- Pose to Model Index 63: NumVotes = 28, Residual = 0.000000\n",
      "[[-0.62785951 -0.7657031  -0.13961087 -0.06160653]\n",
      " [ 0.60010454 -0.59046709  0.53965096 -0.43200459]\n",
      " [-0.49564804  0.25504387  0.83023229 -0.03853456]\n",
      " [ 0.          0.          0.          1.        ]]\n",
      "\n",
      "\n",
      "-- Pose to Model Index 104: NumVotes = 28, Residual = 0.000000\n",
      "[[ 0.63683754 -0.54739896  0.54294781 -0.33924994]\n",
      " [ 0.77099214  0.4548945  -0.44569285  0.05495338]\n",
      " [-0.00301217  0.70244243  0.71173419  0.44798692]\n",
      " [ 0.          0.          0.          1.        ]]\n",
      "\n",
      "\n",
      "-- Pose to Model Index 284: NumVotes = 28, Residual = 0.000000\n",
      "[[ 0.24373539 -0.5059169  -0.82743045  0.84470969]\n",
      " [ 0.53421727  0.78209764 -0.32083513  0.05023039]\n",
      " [ 0.80944732 -0.36382876  0.46089442  0.73179917]\n",
      " [ 0.          0.          0.          1.        ]]\n",
      "\n",
      "\n",
      "-- Pose to Model Index 461: NumVotes = 28, Residual = 0.000000\n",
      "[[-0.63053941  0.68210889 -0.37033432  0.19979399]\n",
      " [-0.77529227 -0.53099863  0.3419976  -0.24568075]\n",
      " [ 0.03663258  0.5027603   0.86364931  0.02250781]\n",
      " [ 0.          0.          0.          1.        ]]\n",
      "\n",
      "\n",
      "-- Pose to Model Index 177: NumVotes = 28, Residual = 0.000000\n",
      "[[ 0.43316745 -0.248279   -0.86644302  0.62021653]\n",
      " [ 0.87412953 -0.11859071  0.47099236 -0.31541345]\n",
      " [-0.21968961 -0.96140199  0.16565837  0.53087405]\n",
      " [ 0.          0.          0.          1.        ]]\n",
      "\n",
      "\n",
      "-- Pose to Model Index 422: NumVotes = 27, Residual = 0.000000\n",
      "[[-0.08384618 -0.83547243 -0.54309819  0.48558676]\n",
      " [ 0.9788512  -0.17111561  0.11211498 -0.61455325]\n",
      " [-0.18660156 -0.5222119   0.83215058  0.3280594 ]\n",
      " [ 0.          0.          0.          1.        ]]\n",
      "\n",
      "\n",
      "-- Pose to Model Index 660: NumVotes = 27, Residual = 0.000000\n",
      "[[-0.76546989  0.08820771  0.63739724 -0.60068836]\n",
      " [-0.33714339 -0.89868999 -0.28051852  0.09554929]\n",
      " [ 0.54807862 -0.42962274  0.71765878  0.22021953]\n",
      " [ 0.          0.          0.          1.        ]]\n",
      "\n",
      "\n",
      "-- Pose to Model Index 680: NumVotes = 27, Residual = 0.000000\n",
      "[[-0.18331469  0.94863099 -0.25786619  0.52729133]\n",
      " [-0.93604112 -0.08828696  0.34063535 -0.25203976]\n",
      " [ 0.30037102  0.30381682  0.90414191 -0.09092071]\n",
      " [ 0.          0.          0.          1.        ]]\n",
      "\n",
      "\n",
      "-- Pose to Model Index 14: NumVotes = 27, Residual = 0.000000\n",
      "[[-0.27718453  0.09377216  0.95622985 -0.77634123]\n",
      " [-0.89561859 -0.38557821 -0.22180349  0.04430389]\n",
