{
  "name": "fodot",
  "rules": {
    "source_file": {
      "type": "REPEAT1",
      "content": {
        "type": "SYMBOL",
        "name": "block"
      }
    },
    "block": {
      "type": "CHOICE",
      "members": [
        {
          "type": "SEQ",
          "members": [
            {
              "type": "STRING",
              "value": "vocabulary"
            },
            {
              "type": "SYMBOL",
              "name": "block_voc"
            }
          ]
        },
        {
          "type": "SEQ",
          "members": [
            {
              "type": "STRING",
              "value": "theory"
            },
            {
              "type": "SYMBOL",
              "name": "block_theory"
            }
          ]
        },
        {
          "type": "SEQ",
          "members": [
            {
              "type": "STRING",
              "value": "structure"
            },
            {
              "type": "SYMBOL",
              "name": "block_structure"
            }
          ]
        }
      ]
    },
    "block_voc": {
      "type": "SEQ",
      "members": [
        {
          "type": "CHOICE",
          "members": [
            {
              "type": "SYMBOL",
              "name": "block_name"
            },
            {
              "type": "BLANK"
            }
          ]
        },
        {
          "type": "STRING",
          "value": "{"
        },
        {
          "type": "REPEAT",
          "content": {
            "type": "SYMBOL",
            "name": "declaration"
          }
        },
        {
          "type": "STRING",
          "value": "}"
        }
      ]
    },
    "block_name": {
      "type": "PATTERN",
      "value": "[\\w\\d]+"
    },
    "declaration": {
      "type": "CHOICE",
      "members": [
        {
          "type": "SYMBOL",
          "name": "type_declaration"
        },
        {
          "type": "SYMBOL",
          "name": "prop_declaration"
        },
        {
          "type": "SYMBOL",
          "name": "constant_declaration"
        },
        {
          "type": "SYMBOL",
          "name": "predicate_declaration"
        },
        {
          "type": "SYMBOL",
          "name": "function_declaration"
        }
      ]
    },
    "type_declaration": {
      "type": "SEQ",
      "members": [
        {
          "type": "STRING",
          "value": "type"
        },
        {
          "type": "SYMBOL",
          "name": "symbol_name"
        },
        {
          "type": "CHOICE",
          "members": [
            {
              "type": "SYMBOL",
              "name": "symbol_interpretation"
            },
            {
              "type": "BLANK"
            }
          ]
        }
      ]
    },
    "prop_declaration": {
      "type": "SEQ",
      "members": [
        {
          "type": "CHOICE",
          "members": [
            {
              "type": "SYMBOL",
              "name": "symbol_name"
            },
            {
              "type": "SYMBOL",
              "name": "symbol_names"
            }
          ]
        },
        {
          "type": "STRING",
          "value": ":"
        },
        {
          "type": "CHOICE",
          "members": [
            {
              "type": "STRING",
              "value": "("
            },
            {
              "type": "BLANK"
            }
          ]
        },
        {
          "type": "CHOICE",
          "members": [
            {
              "type": "STRING",
              "value": ")"
            },
            {
              "type": "BLANK"
            }
          ]
        },
        {
          "type": "STRING",
          "value": "->"
        },
        {
          "type": "STRING",
          "value": "Bool"
        }
      ]
    },
    "constant_declaration": {
      "type": "SEQ",
      "members": [
        {
          "type": "CHOICE",
          "members": [
            {
              "type": "SYMBOL",
              "name": "symbol_name"
            },
            {
              "type": "SYMBOL",
              "name": "symbol_names"
            }
          ]
        },
        {
          "type": "STRING",
          "value": ":"
        },
        {
          "type": "CHOICE",
          "members": [
            {
              "type": "STRING",
              "value": "("
            },
            {
              "type": "BLANK"
            }
          ]
        },
        {
          "type": "CHOICE",
          "members": [
            {
              "type": "STRING",
              "value": ")"
            },
            {
              "type": "BLANK"
            }
          ]
        },
        {
          "type": "STRING",
          "value": "->"
        },
        {
          "type": "CHOICE",
          "members": [
            {
              "type": "SYMBOL",
              "name": "builtin_type"
            },
            {
              "type": "SYMBOL",
              "name": "symbol_name"
            }
          ]
        }
      ]
    },
    "predicate_declaration": {
      "type": "SEQ",
      "members": [
        {
          "type": "CHOICE",
          "members": [
            {
              "type": "SYMBOL",
              "name": "symbol_name"
            },
            {
              "type": "SYMBOL",
              "name": "symbol_names"
            }
          ]
        },
        {
          "type": "STRING",
          "value": ":"
        },
        {
          "type": "CHOICE",
          "members": [
            {
              "type": "STRING",
              "value": "("
            },
            {
              "type": "BLANK"
            }
          ]
        },
        {
          "type": "REPEAT1",
          "content": {
            "type": "SEQ",
            "members": [
              {
                "type": "SYMBOL",
                "name": "symbol_name"
              },
              {
                "type": "CHOICE",
                "members": [
                  {
                    "type": "STRING",
                    "value": "*"
                  },
                  {
                    "type": "BLANK"
                  }
                ]
              }
            ]
          }
        },
        {
          "type": "CHOICE",
          "members": [
            {
              "type": "STRING",
              "value": ")"
            },
            {
              "type": "BLANK"
            }
          ]
        },
        {
          "type": "STRING",
          "value": "->"
        },
        {
          "type": "STRING",
          "value": "Bool"
        }
      ]
    },
    "function_declaration": {
      "type": "SEQ",
      "members": [
        {
          "type": "CHOICE",
          "members": [
            {
              "type": "SYMBOL",
              "name": "symbol_name"
            },
            {
              "type": "SYMBOL",
              "name": "symbol_names"
            }
          ]
        },
        {
          "type": "STRING",
          "value": ":"
        },
        {
          "type": "CHOICE",
          "members": [
            {
              "type": "STRING",
              "value": "("
            },
            {
              "type": "BLANK"
            }
          ]
        },
        {
          "type": "REPEAT1",
          "content": {
            "type": "SEQ",
            "members": [
              {
                "type": "SYMBOL",
                "name": "symbol_name"
              },
              {
                "type": "CHOICE",
                "members": [
                  {
                    "type": "STRING",
                    "value": "*"
                  },
                  {
                    "type": "BLANK"
                  }
                ]
              }
            ]
          }
        },
        {
          "type": "CHOICE",
          "members": [
            {
              "type": "STRING",
              "value": ")"
            },
            {
              "type": "BLANK"
            }
          ]
        },
        {
          "type": "STRING",
          "value": "->"
        },
        {
          "type": "CHOICE",
          "members": [
            {
              "type": "SYMBOL",
              "name": "builtin_type"
            },
            {
              "type": "SYMBOL",
              "name": "symbol_name"
            }
          ]
        }
      ]
    },
    "symbol_name": {
      "type": "PREC",
      "value": 20,
      "content": {
        "type": "PATTERN",
        "value": "[\\w\\d]+"
      }
    },
    "symbol_names": {
      "type": "SEQ",
      "members": [
        {
          "type": "SYMBOL",
          "name": "symbol_name"
        },
        {
          "type": "REPEAT1",
          "content": {
            "type": "SEQ",
            "members": [
              {
                "type": "STRING",
                "value": ","
              },
              {
                "type": "SYMBOL",
                "name": "symbol_name"
              }
            ]
          }
        }
      ]
    },
    "builtin_type": {
      "type": "CHOICE",
      "members": [
        {
          "type": "STRING",
          "value": "Int"
        },
        {
          "type": "STRING",
          "value": "Real"
        },
        {
          "type": "STRING",
          "value": "Date"
        }
      ]
    },
    "block_theory": {
      "type": "SEQ",
      "members": [
        {
          "type": "CHOICE",
          "members": [
            {
              "type": "SEQ",
              "members": [
                {
                  "type": "SYMBOL",
                  "name": "block_name"
                },
                {
                  "type": "STRING",
                  "value": ":"
                },
                {
                  "type": "SYMBOL",
                  "name": "block_name"
                }
              ]
            },
            {
              "type": "BLANK"
            }
          ]
        },
        {
          "type": "STRING",
          "value": "{"
        },
        {
          "type": "REPEAT",
          "content": {
            "type": "CHOICE",
            "members": [
              {
                "type": "SEQ",
                "members": [
                  {
                    "type": "SYMBOL",
                    "name": "formula"
                  },
                  {
                    "type": "STRING",
                    "value": "."
                  }
                ]
              },
              {
                "type": "SYMBOL",
                "name": "definition"
              }
            ]
          }
        },
        {
          "type": "STRING",
          "value": "}"
        }
      ]
    },
    "formula": {
      "type": "CHOICE",
      "members": [
        {
          "type": "SYMBOL",
          "name": "land"
        },
        {
          "type": "SYMBOL",
          "name": "lor"
        },
        {
          "type": "SYMBOL",
          "name": "neg"
        },
        {
          "type": "SYMBOL",
          "name": "_brackets"
        },
        {
          "type": "SYMBOL",
          "name": "rimplication"
        },
        {
          "type": "SYMBOL",
          "name": "limplication"
        },
        {
          "type": "SYMBOL",
          "name": "equivalence"
        },
        {
          "type": "SYMBOL",
          "name": "universal"
        },
        {
          "type": "SYMBOL",
          "name": "existential"
        },
        {
          "type": "SYMBOL",
          "name": "in_operator"
        },
        {
          "type": "SYMBOL",
          "name": "_term_formula"
        }
      ]
    },
    "_term_formula": {
      "type": "CHOICE",
      "members": [
        {
          "type": "SYMBOL",
          "name": "applied_symbol"
        },
        {
          "type": "SYMBOL",
          "name": "type_element"
        },
        {
          "type": "SYMBOL",
          "name": "count"
        },
        {
          "type": "SYMBOL",
          "name": "sum_agg"
        },
        {
          "type": "SYMBOL",
          "name": "ite"
        },
        {
          "type": "SYMBOL",
          "name": "sum"
        },
        {
          "type": "SYMBOL",
          "name": "subtraction"
        },
        {
          "type": "SYMBOL",
          "name": "multiplication"
        },
        {
          "type": "SYMBOL",
          "name": "division"
        },
        {
          "type": "SYMBOL",
          "name": "_comparison"
        }
      ]
    },
    "applied_symbol": {
      "type": "SEQ",
      "members": [
        {
          "type": "SYMBOL",
          "name": "symbol_name"
        },
        {
          "type": "STRING",
          "value": "("
        },
        {
          "type": "CHOICE",
          "members": [
            {
              "type": "SEQ",
              "members": [
                {
                  "type": "REPEAT",
                  "content": {
                    "type": "SEQ",
                    "members": [
                      {
                        "type": "SYMBOL",
                        "name": "formula"
                      },
                      {
                        "type": "STRING",
                        "value": ","
                      }
                    ]
                  }
                },
                {
                  "type": "SYMBOL",
                  "name": "formula"
                }
              ]
            },
            {
              "type": "BLANK"
            }
          ]
        },
        {
          "type": "STRING",
          "value": ")"
        }
      ]
    },
    "land": {
      "type": "PREC_LEFT",
      "value": 7,
      "content": {
        "type": "SEQ",
        "members": [
          {
            "type": "SYMBOL",
            "name": "formula"
          },
          {
            "type": "STRING",
            "value": "&"
          },
          {
            "type": "SYMBOL",
            "name": "formula"
          }
        ]
      }
    },
    "lor": {
      "type": "PREC_LEFT",
      "value": 8,
      "content": {
        "type": "SEQ",
        "members": [
          {
            "type": "SYMBOL",
            "name": "formula"
          },
          {
            "type": "STRING",
            "value": "|"
          },
          {
            "type": "SYMBOL",
            "name": "formula"
          }
        ]
      }
    },
    "neg": {
      "type": "PREC_LEFT",
      "value": 17,
      "content": {
        "type": "SEQ",
        "members": [
          {
            "type": "STRING",
            "value": "~"
          },
          {
            "type": "SYMBOL",
            "name": "formula"
          }
        ]
      }
    },
    "_brackets": {
      "type": "SEQ",
      "members": [
        {
          "type": "STRING",
          "value": "("
        },
        {
          "type": "SYMBOL",
          "name": "formula"
        },
        {
          "type": "STRING",
          "value": ")"
        }
      ]
    },
    "rimplication": {
      "type": "PREC_RIGHT",
      "value": 6,
      "content": {
        "type": "SEQ",
        "members": [
          {
            "type": "SYMBOL",
            "name": "formula"
          },
          {
            "type": "STRING",
            "value": "=>"
          },
          {
            "type": "SYMBOL",
            "name": "formula"
          }
        ]
      }
    },
    "limplication": {
      "type": "PREC_LEFT",
      "value": 6,
      "content": {
        "type": "SEQ",
        "members": [
          {
            "type": "SYMBOL",
            "name": "formula"
          },
          {
            "type": "STRING",
            "value": "<="
          },
          {
            "type": "SYMBOL",
            "name": "formula"
          }
        ]
      }
    },
    "equivalence": {
      "type": "PREC_LEFT",
      "value": 6,
      "content": {
        "type": "SEQ",
        "members": [
          {
            "type": "SYMBOL",
            "name": "formula"
          },
          {
            "type": "STRING",
            "value": "<=>"
          },
          {
            "type": "SYMBOL",
            "name": "formula"
          }
        ]
      }
    },
    "sum": {
      "type": "PREC_LEFT",
      "value": 11,
      "content": {
        "type": "SEQ",
        "members": [
          {
            "type": "SYMBOL",
            "name": "formula"
          },
          {
            "type": "STRING",
            "value": "+"
          },
          {
            "type": "SYMBOL",
            "name": "formula"
          }
        ]
      }
    },
    "subtraction": {
      "type": "PREC_LEFT",
      "value": 11,
      "content": {
        "type": "SEQ",
        "members": [
          {
            "type": "SYMBOL",
            "name": "formula"
          },
          {
            "type": "STRING",
            "value": "-"
          },
          {
            "type": "SYMBOL",
            "name": "formula"
          }
        ]
      }
    },
    "multiplication": {
      "type": "PREC_LEFT",
      "value": 12,
      "content": {
        "type": "SEQ",
        "members": [
          {
            "type": "SYMBOL",
            "name": "formula"
          },
          {
            "type": "STRING",
            "value": "*"
          },
          {
            "type": "SYMBOL",
            "name": "formula"
          }
        ]
      }
    },
    "division": {
      "type": "PREC_LEFT",
      "value": 12,
      "content": {
        "type": "SEQ",
        "members": [
          {
            "type": "SYMBOL",
            "name": "formula"
          },
          {
            "type": "STRING",
            "value": "/"
          },
          {
            "type": "SYMBOL",
            "name": "formula"
          }
        ]
      }
    },
    "_comparison": {
      "type": "PREC_LEFT",
      "value": 9,
      "content": {
        "type": "CHOICE",
        "members": [
          {
            "type": "SYMBOL",
            "name": "equality"
          },
          {
            "type": "SYMBOL",
            "name": "ge"
          },
          {
            "type": "SYMBOL",
            "name": "le"
          },
          {
            "type": "SYMBOL",
            "name": "geq"
          },
          {
            "type": "SYMBOL",
            "name": "leq"
          },
          {
            "type": "SYMBOL",
            "name": "inequality"
          }
        ]
      }
    },
    "equality": {
      "type": "PREC_LEFT",
      "value": 9,
      "content": {
        "type": "SEQ",
        "members": [
          {
            "type": "SYMBOL",
            "name": "formula"
          },
          {
            "type": "STRING",
            "value": "="
          },
          {
            "type": "SYMBOL",
            "name": "formula"
          }
        ]
      }
    },
    "inequality": {
      "type": "PREC_LEFT",
      "value": 9,
      "content": {
        "type": "SEQ",
        "members": [
          {
            "type": "SYMBOL",
            "name": "formula"
          },
          {
            "type": "STRING",
            "value": "~="
          },
          {
            "type": "SYMBOL",
            "name": "formula"
          }
        ]
      }
    },
    "ge": {
      "type": "PREC_LEFT",
      "value": 9,
      "content": {
        "type": "SEQ",
        "members": [
          {
            "type": "SYMBOL",
            "name": "formula"
          },
          {
            "type": "STRING",
            "value": ">"
          },
          {
            "type": "SYMBOL",
            "name": "formula"
          }
        ]
      }
    },
    "le": {
      "type": "PREC_LEFT",
      "value": 9,
      "content": {
        "type": "SEQ",
        "members": [
          {
            "type": "SYMBOL",
            "name": "formula"
          },
          {
            "type": "STRING",
            "value": "<"
          },
          {
            "type": "SYMBOL",
            "name": "formula"
          }
        ]
      }
    },
    "geq": {
      "type": "PREC_LEFT",
      "value": 9,
      "content": {
        "type": "SEQ",
        "members": [
          {
            "type": "SYMBOL",
            "name": "formula"
          },
          {
            "type": "STRING",
            "value": ">="
          },
          {
            "type": "SYMBOL",
            "name": "formula"
          }
        ]
      }
    },
    "leq": {
      "type": "PREC_LEFT",
      "value": 9,
      "content": {
        "type": "SEQ",
        "members": [
          {
            "type": "SYMBOL",
            "name": "formula"
          },
          {
            "type": "STRING",
            "value": "=<"
          },
          {
            "type": "SYMBOL",
            "name": "formula"
          }
        ]
      }
    },
    "quantification": {
      "type": "PREC_LEFT",
      "value": 5,
      "content": {
        "type": "SEQ",
        "members": [
          {
            "type": "CHOICE",
            "members": [
              {
                "type": "REPEAT",
                "content": {
                  "type": "SEQ",
                  "members": [
                    {
                      "type": "SYMBOL",
                      "name": "variable"
                    },
                    {
                      "type": "STRING",
                      "value": ","
                    }
                  ]
                }
              },
              {
                "type": "BLANK"
              }
            ]
          },
          {
            "type": "SYMBOL",
            "name": "variable"
          },
          {
            "type": "STRING",
            "value": "in"
          },
          {
            "type": "SYMBOL",
            "name": "symbol_name"
          }
        ]
      }
    },
    "_repeated_quantification": {
      "type": "SEQ",
      "members": [
        {
          "type": "SYMBOL",
          "name": "quantification"
        },
        {
          "type": "CHOICE",
          "members": [
            {
              "type": "REPEAT",
              "content": {
                "type": "SEQ",
                "members": [
                  {
                    "type": "STRING",
                    "value": ","
                  },
                  {
                    "type": "SYMBOL",
                    "name": "quantification"
                  }
                ]
              }
            },
            {
              "type": "BLANK"
            }
          ]
        }
      ]
    },
    "universal": {
      "type": "PREC_LEFT",
      "value": 5,
      "content": {
        "type": "SEQ",
        "members": [
          {
            "type": "STRING",
            "value": "!"
          },
          {
            "type": "SYMBOL",
            "name": "_repeated_quantification"
          },
          {
            "type": "STRING",
            "value": ":"
          },
          {
            "type": "SYMBOL",
            "name": "formula"
          }
        ]
      }
    },
    "existential": {
      "type": "PREC_LEFT",
      "value": 5,
      "content": {
        "type": "SEQ",
        "members": [
          {
            "type": "STRING",
            "value": "?"
          },
          {
            "type": "SYMBOL",
            "name": "_repeated_quantification"
          },
          {
            "type": "STRING",
            "value": ":"
          },
          {
            "type": "SYMBOL",
            "name": "formula"
          }
        ]
      }
    },
    "count": {
      "type": "SEQ",
      "members": [
        {
          "type": "STRING",
          "value": "#{"
        },
        {
          "type": "SYMBOL",
          "name": "_repeated_quantification"
        },
        {
          "type": "STRING",
          "value": ":"
        },
        {
          "type": "SYMBOL",
          "name": "formula"
        },
        {
          "type": "STRING",
          "value": "}"
        }
      ]
    },
    "sum_agg": {
      "type": "PREC",
      "value": 20,
      "content": {
        "type": "SEQ",
        "members": [
          {
            "type": "STRING",
            "value": "sum{{"
          },
          {
            "type": "SYMBOL",
            "name": "_term_formula"
          },
          {
            "type": "STRING",
            "value": "|"
          },
          {
            "type": "SYMBOL",
            "name": "_repeated_quantification"
          },
          {
            "type": "STRING",
            "value": ":"
          },
          {
            "type": "SYMBOL",
            "name": "formula"
          },
          {
            "type": "STRING",
            "value": "}}"
          }
        ]
      }
    },
    "ite": {
      "type": "SEQ",
      "members": [
        {
          "type": "STRING",
          "value": "if"
        },
        {
          "type": "SYMBOL",
          "name": "formula"
        },
        {
          "type": "STRING",
          "value": "then"
        },
        {
          "type": "SYMBOL",
          "name": "formula"
        },
        {
          "type": "STRING",
          "value": "else"
        },
        {
          "type": "SYMBOL",
          "name": "formula"
        }
      ]
    },
    "variable": {
      "type": "PATTERN",
      "value": "[\\w\\d]+"
    },
    "in_operator": {
      "type": "PREC_LEFT",
      "value": 6,
      "content": {
        "type": "SEQ",
        "members": [
          {
            "type": "SYMBOL",
            "name": "formula"
          },
          {
            "type": "STRING",
            "value": "in"
          },
          {
            "type": "STRING",
            "value": "{"
          },
          {
            "type": "SYMBOL",
            "name": "type_element"
          },
          {
            "type": "CHOICE",
            "members": [
              {
                "type": "REPEAT",
                "content": {
                  "type": "SEQ",
                  "members": [
                    {
                      "type": "STRING",
                      "value": ","
                    },
                    {
                      "type": "SYMBOL",
                      "name": "type_element"
                    }
                  ]
                }
              },
              {
                "type": "BLANK"
              }
            ]
          },
          {
            "type": "STRING",
            "value": "}"
          }
        ]
      }
    },
    "definition": {
      "type": "SEQ",
      "members": [
        {
          "type": "STRING",
          "value": "{"
        },
        {
          "type": "REPEAT1",
          "content": {
            "type": "SYMBOL",
            "name": "definitional_rule"
          }
        },
        {
          "type": "STRING",
          "value": "}"
        }
      ]
    },
    "definitional_rule": {
      "type": "SEQ",
      "members": [
        {
          "type": "SYMBOL",
          "name": "formula"
        },
        {
          "type": "STRING",
          "value": "<-"
        },
        {
          "type": "SYMBOL",
          "name": "formula"
        },
        {
          "type": "STRING",
          "value": "."
        }
      ]
    },
    "block_structure": {
      "type": "SEQ",
      "members": [
        {
          "type": "CHOICE",
          "members": [
            {
              "type": "SEQ",
              "members": [
                {
                  "type": "SYMBOL",
                  "name": "block_name"
                },
                {
                  "type": "STRING",
                  "value": ":"
                },
                {
                  "type": "SYMBOL",
                  "name": "block_name"
                }
              ]
            },
            {
              "type": "BLANK"
            }
          ]
        },
        {
          "type": "STRING",
          "value": "{"
        },
        {
          "type": "REPEAT",
          "content": {
            "type": "SYMBOL",
            "name": "structure_interpretation"
          }
        },
        {
          "type": "STRING",
          "value": "}"
        }
      ]
    },
    "structure_interpretation": {
      "type": "SEQ",
      "members": [
        {
          "type": "SYMBOL",
          "name": "symbol_name"
        },
        {
          "type": "SYMBOL",
          "name": "symbol_interpretation"
        },
        {
          "type": "STRING",
          "value": "."
        }
      ]
    },
    "symbol_interpretation": {
      "type": "SEQ",
      "members": [
        {
          "type": "STRING",
          "value": ":="
        },
        {
          "type": "CHOICE",
          "members": [
            {
              "type": "SEQ",
              "members": [
                {
                  "type": "STRING",
                  "value": "{"
                },
                {
                  "type": "CHOICE",
                  "members": [
                    {
                      "type": "CHOICE",
                      "members": [
                        {
                          "type": "SYMBOL",
                          "name": "element_enumeration"
                        },
                        {
                          "type": "SYMBOL",
                          "name": "range_enumeration"
                        },
                        {
                          "type": "SYMBOL",
                          "name": "predicate_enumeration"
                        },
                        {
                          "type": "SYMBOL",
                          "name": "function_enumeration"
                        }
                      ]
                    },
                    {
                      "type": "BLANK"
                    }
                  ]
                },
                {
                  "type": "STRING",
                  "value": "}"
                },
                {
                  "type": "CHOICE",
                  "members": [
                    {
                      "type": "SEQ",
                      "members": [
                        {
                          "type": "STRING",
                          "value": "else"
                        },
                        {
                          "type": "SYMBOL",
                          "name": "type_element"
                        }
                      ]
                    },
                    {
                      "type": "BLANK"
                    }
                  ]
                }
              ]
            },
            {
              "type": "SEQ",
              "members": [
                {
                  "type": "SYMBOL",
                  "name": "type_element"
                }
              ]
            }
          ]
        }
      ]
    },
    "element_enumeration": {
      "type": "REPEAT1",
      "content": {
        "type": "SEQ",
        "members": [
          {
            "type": "SYMBOL",
            "name": "type_element"
          },
          {
            "type": "CHOICE",
            "members": [
              {
                "type": "STRING",
                "value": ","
              },
              {
                "type": "BLANK"
              }
            ]
          }
        ]
      }
    },
    "range_enumeration": {
      "type": "SEQ",
      "members": [
        {
          "type": "SYMBOL",
          "name": "type_element"
        },
        {
          "type": "STRING",
          "value": ".."
        },
        {
          "type": "SYMBOL",
          "name": "type_element"
        }
      ]
    },
    "predicate_enumeration": {
      "type": "REPEAT1",
      "content": {
        "type": "SEQ",
        "members": [
          {
            "type": "STRING",
            "value": "("
          },
          {
            "type": "SYMBOL",
            "name": "element_enumeration"
          },
          {
            "type": "STRING",
            "value": ")"
          },
          {
            "type": "CHOICE",
            "members": [
              {
                "type": "STRING",
                "value": ","
              },
              {
                "type": "BLANK"
              }
            ]
          }
        ]
      }
    },
    "function_enumeration": {
      "type": "CHOICE",
      "members": [
        {
          "type": "REPEAT1",
          "content": {
            "type": "SEQ",
            "members": [
              {
                "type": "STRING",
                "value": "("
              },
              {
                "type": "SYMBOL",
                "name": "element_enumeration"
              },
              {
                "type": "STRING",
                "value": ")"
              },
              {
                "type": "STRING",
                "value": "->"
              },
              {
                "type": "SYMBOL",
                "name": "type_element"
              },
              {
                "type": "CHOICE",
                "members": [
                  {
                    "type": "STRING",
                    "value": ","
                  },
                  {
                    "type": "BLANK"
                  }
                ]
              }
            ]
          }
        },
        {
          "type": "REPEAT1",
          "content": {
            "type": "SEQ",
            "members": [
              {
                "type": "SYMBOL",
                "name": "element_enumeration"
              },
              {
                "type": "STRING",
                "value": "->"
              },
              {
                "type": "SYMBOL",
                "name": "type_element"
              },
              {
                "type": "CHOICE",
                "members": [
                  {
                    "type": "STRING",
                    "value": ","
                  },
                  {
                    "type": "BLANK"
                  }
                ]
              }
            ]
          }
        }
      ]
    },
    "type_element": {
      "type": "CHOICE",
      "members": [
        {
          "type": "SEQ",
          "members": [
            {
              "type": "STRING",
              "value": "'"
            },
            {
              "type": "SYMBOL",
              "name": "_ext_string"
            },
            {
              "type": "STRING",
              "value": "'"
            }
          ]
        },
        {
          "type": "SYMBOL",
          "name": "_string"
        },
        {
          "type": "SYMBOL",
          "name": "_int"
        },
        {
          "type": "SYMBOL",
          "name": "_float"
        }
      ]
    },
    "_ext_string": {
      "type": "PATTERN",
      "value": "[^']+"
    },
    "_string": {
      "type": "PREC",
      "value": 21,
      "content": {
        "type": "PATTERN",
        "value": "[\\w\\d]+"
      }
    },
    "_int": {
      "type": "PATTERN",
      "value": "-?[\\d]+"
    },
    "_float": {
      "type": "PATTERN",
      "value": "-?[\\d]+\\.[\\d]+"
    },
    "_line_comment": {
      "type": "PATTERN",
      "value": "\\/\\/.*?\\n"
    }
  },
  "extras": [
    {
      "type": "PATTERN",
      "value": "\\s"
    },
    {
      "type": "SYMBOL",
      "name": "_line_comment"
    }
  ],
  "conflicts": [],
  "precedences": [],
  "externals": [],
  "inline": [],
  "supertypes": []
}
