fout,systeem,1
strategisch spel,strategie,2
geld,cash,3
neurose,geest,1
kaartspel,frisbee,0
pepermunt,kauwgom,2
woordenboek,encyclopedie,2
vlieg,mier,2
misdaad,aanval,1
demon,engel,2
handboek,gids,2
vorstin,schaakkoningin,2
Bolzano,theorema,2
tank,auto,2
studiebeurs,lesgeld,2
El Niño,evenaar,2
legende,moraal,1
strand,kust,3
geluk,droefheid,2
slang,hagedis,2
matrix,vector,2
Gmail,Yahoo,2
Coca-Cola,Coke,4
bol,sfeer,4
oneindigheid,nul,1
sexisme,genderdiscriminatie,2
raket,bal,2
Federer,Dylan,1
levensverwachting,statistische maat,1
insigne,waardigheid,1
