Confusion matrices pertaining to best epochs per model.
====================================================================================================
====================================================================================================
2024-01-20 16:20:44.872270
Train alexnet-emo8 -- 0.1:
	 0	 1	 2		#
 0|	26.33	59.14	14.54		7278
 1|	24.29	58.19	17.52		5632
 2|	19.36	57.32	23.32		7784


        00     01     02    
prec    0.263  0.582  0.233
rec     0.400  0.272  0.470
f1      0.318  0.371  0.312
----------------------------------------------------------------------------------------------------
Test alexnet-emo8 -- 0.1:
	 0	 1	 2		#
 0|	27.83	58.10	14.07		1962
 1|	23.70	58.72	17.59		671
 2|	19.39	58.10	22.50		2542


        00     01     02    
prec    0.278  0.587  0.225
rec     0.456  0.131  0.592
f1      0.346  0.214  0.326
====================================================================================================
====================================================================================================
2024-01-20 16:20:53.292946
Train alexnet-emo8 -- 0.1:
	 0	 1	 2		#
 0|	26.81	57.64	15.55		7210
 1|	24.07	58.97	16.96		5842
 2|	19.00	58.13	22.87		7642


        00     01     02    
prec    0.268  0.590  0.229
rec     0.403  0.286  0.453
f1      0.322  0.385  0.304
----------------------------------------------------------------------------------------------------
Test alexnet-emo8 -- 0.1:
	 0	 1	 2		#
 0|	27.07	57.60	15.33		2420
 1|	23.02	59.69	17.29		1290
 2|	16.79	57.82	25.39		1465


        00     01     02    
prec    0.271  0.597  0.254
rec     0.547  0.256  0.385
f1      0.362  0.358  0.306
====================================================================================================
====================================================================================================
2024-01-20 16:21:01.505992
Train alexnet-emo8 -- 0.1:
	 0	 1	 2		#
 0|	26.34	58.20	15.46		7127
 1|	23.60	57.71	18.69		6314
 2|	19.63	58.61	21.76		7253


        00     01     02    
prec    0.263  0.577  0.218
rec     0.392  0.303  0.409
f1      0.315  0.397  0.284
----------------------------------------------------------------------------------------------------
Test alexnet-emo8 -- 0.1:
	 0	 1	 2		#
 0|	26.79	58.65	14.56		2404
 1|	21.00	58.46	20.55		1567
 2|	18.69	56.89	24.42		1204


        00     01     02    
prec    0.268  0.585  0.244
rec     0.538  0.304  0.304
f1      0.358  0.400  0.271
====================================================================================================
====================================================================================================
2024-01-20 16:21:12.995074
Train alexnet-emo8 -- 0.1:
	 0	 1	 2		#
 0|	26.70	58.21	15.09		7171
 1|	23.93	58.59	17.48		5943
 2|	19.18	57.88	22.94		7580


        00     01     02    
prec    0.267  0.586  0.229
rec     0.400  0.289  0.451
f1      0.320  0.387  0.304
----------------------------------------------------------------------------------------------------
Test alexnet-emo8 -- 0.1:
	 0	 1	 2		#
 0|	25.24	58.32	16.44		955
 1|	23.30	57.89	18.81		3897
 2|	15.17	61.30	23.53		323


        00     01     02    
prec    0.252  0.579  0.235
rec     0.201  0.749  0.079
f1      0.224  0.653  0.118
====================================================================================================
====================================================================================================
2024-01-20 16:21:24.908950
Train alexnet-emo8 -- 0.1:
	 0	 1	 2		#
 0|	27.16	57.57	15.27		7091
 1|	23.43	59.62	16.95		5958
 2|	19.22	57.67	23.11		7645


        00     01     02    
prec    0.272  0.596  0.231
rec     0.402  0.295  0.458
f1      0.324  0.395  0.307
----------------------------------------------------------------------------------------------------
Test alexnet-emo8 -- 0.1:
	 0	 1	 2		#
 0|	27.37	56.48	16.15		749
 1|	23.32	58.71	17.97		3996
 2|	14.19	56.28	29.53		430


        00     01     02    
prec    0.274  0.587  0.295
rec     0.171  0.779  0.131
f1      0.211  0.670  0.182
====================================================================================================
====================================================================================================
2024-01-20 16:21:38.523859
Train alexnet-emo8 -- 0.1:
	 0	 1	 2		#
 0|	26.45	58.91	14.65		7434
 1|	23.89	57.71	18.40		5777
 2|	19.31	57.86	22.83		7483


        00     01     02    
prec    0.264  0.577  0.228
rec     0.410  0.277  0.442
f1      0.322  0.374  0.301
----------------------------------------------------------------------------------------------------
Test alexnet-emo8 -- 0.1:
	 0	 1	 2		#
 0|	26.23	58.21	15.56		3240
 1|	20.21	54.26	25.53		282
 2|	17.60	58.80	23.59		1653


        00     01     02    
prec    0.262  0.543  0.236
rec     0.710  0.051  0.404
f1      0.383  0.093  0.298
====================================================================================================
====================================================================================================
2024-01-20 16:21:52.245026
Train alexnet-emo8 -- 0.1:
	 0	 1	 2		#
 0|	26.34	58.82	14.84		7145
 1|	23.93	58.41	17.66		6196
 2|	19.39	57.41	23.20		7353


        00     01     02    
prec    0.263  0.584  0.232
rec     0.393  0.301  0.442
f1      0.315  0.397  0.304
----------------------------------------------------------------------------------------------------
Test alexnet-emo8 -- 0.1:
	 0	 1	 2		#
 0|	27.10	57.63	15.27		2266
 1|	19.89	63.64	16.48		176
 2|	20.09	58.29	21.62		2733


        00     01     02    
prec    0.271  0.636  0.216
rec     0.513  0.037  0.612
f1      0.355  0.070  0.320
====================================================================================================
====================================================================================================
2024-01-20 16:22:03.624142
Train alexnet-emo8 -- 0.1:
	 0	 1	 2		#
 0|	25.76	58.81	15.43		7426
 1|	24.51	57.90	17.60		5864
 2|	19.46	57.82	22.72		7404


        00     01     02    
prec    0.258  0.579  0.227
rec     0.399  0.282  0.436
f1      0.313  0.379  0.299
----------------------------------------------------------------------------------------------------
Test alexnet-emo8 -- 0.1:
	 0	 1	 2		#
 0|	29.92	58.91	11.16		645
 1|	22.41	58.23	19.36		4381
 2|	15.44	53.69	30.87		149


        00     01     02    
prec    0.299  0.582  0.309
rec     0.161  0.847  0.048
f1      0.209  0.690  0.083
====================================================================================================
====================================================================================================
2024-01-20 16:22:17.966655
Train alexnet-emo8 -- 0.1:
	 0	 1	 2		#
 0|	26.95	58.26	14.79		7118
 1|	23.48	58.75	17.78		5755
 2|	19.46	57.73	22.81		7821


        00     01     02    
prec    0.269  0.587  0.228
rec     0.400  0.281  0.462
f1      0.322  0.380  0.305
----------------------------------------------------------------------------------------------------
Test alexnet-emo8 -- 0.1:
	 0	 1	 2		#
 0|	27.44	58.54	14.02		2219
 1|	23.29	57.53	19.18		73
 2|	19.84	57.93	22.23		2883


        00     01     02    
prec    0.274  0.575  0.222
rec     0.508  0.014  0.664
f1      0.356  0.027  0.333
====================================================================================================
====================================================================================================
2024-01-20 16:22:28.110728
Train alexnet-emo8 -- 0.1:
	 0	 1	 2		#
 0|	26.58	58.78	14.64		7389
 1|	23.72	58.08	18.20		5801
 2|	19.34	57.72	22.95		7504


        00     01     02    
prec    0.266  0.581  0.229
rec     0.410  0.280  0.446
f1      0.322  0.378  0.303
----------------------------------------------------------------------------------------------------
Test alexnet-emo8 -- 0.1:
	 0	 1	 2		#
 0|	28.52	58.01	13.47		1136
 1|	25.47	59.06	15.48		1822
 2|	18.49	57.56	23.95		2217


        00     01     02    
prec    0.285  0.591  0.240
rec     0.270  0.357  0.550
f1      0.278  0.445  0.334
====================================================================================================
====================================================================================================
2024-01-20 16:22:41.945891
Train alexnet-emo8 -- 0.01:
	 0	 1	 2		#
 0|	27.06	58.47	14.47		8378
 1|	23.83	59.26	16.91		4062
 2|	18.85	57.39	23.76		8254


        00     01     02    
prec    0.271  0.593  0.238
rec     0.473  0.200  0.508
f1      0.344  0.299  0.324
----------------------------------------------------------------------------------------------------
Test alexnet-emo8 -- 0.01:
	 0	 1	 2		#
 0|	27.65	58.73	13.62		1461
 1|	23.21	59.47	17.32		1853
 2|	19.56	56.48	23.97		1861


        00     01     02    
prec    0.277  0.595  0.240
rec     0.337  0.366  0.462
f1      0.304  0.453  0.316
====================================================================================================
====================================================================================================
2024-01-20 16:23:06.153938
Train alexnet-emo8 -- 0.01:
	 0	 1	 2		#
 0|	27.67	58.34	13.99		8154
 1|	23.43	59.41	17.15		3999
 2|	18.71	57.49	23.80		8541


        00     01     02    
prec    0.277  0.594  0.238
rec     0.471  0.197  0.527
f1      0.349  0.296  0.328
----------------------------------------------------------------------------------------------------
Test alexnet-emo8 -- 0.01:
	 0	 1	 2		#
 0|	28.35	57.82	13.83		1598
 1|	23.46	58.54	18.00		2178
 2|	16.73	58.04	25.23		1399


        00     01     02    
prec    0.283  0.585  0.252
rec     0.378  0.423  0.365
f1      0.324  0.491  0.299
====================================================================================================
====================================================================================================
2024-01-20 16:23:19.354862
Train alexnet-emo8 -- 0.01:
	 0	 1	 2		#
 0|	27.08	58.79	14.12		7979
 1|	23.71	59.12	17.17		4281
 2|	19.15	57.16	23.69		8434


        00     01     02    
prec    0.271  0.591  0.237
rec     0.451  0.210  0.518
f1      0.338  0.310  0.325
----------------------------------------------------------------------------------------------------
Test alexnet-emo8 -- 0.01:
	 0	 1	 2		#
 0|	27.91	57.36	14.73		2655
 1|	18.44	56.98	24.58		179
 2|	18.11	59.21	22.68		2341


        00     01     02    
prec    0.279  0.570  0.227
rec     0.619  0.034  0.550
f1      0.385  0.064  0.321
====================================================================================================
====================================================================================================
2024-01-20 16:23:33.452553
Train alexnet-emo8 -- 0.01:
	 0	 1	 2		#
 0|	27.16	58.36	14.48		8142
 1|	23.48	58.94	17.58		3948
 2|	19.21	57.69	23.09		8604


        00     01     02    
prec    0.272  0.589  0.231
rec     0.461  0.193  0.515
f1      0.342  0.291  0.319
----------------------------------------------------------------------------------------------------
Test alexnet-emo8 -- 0.01:
	 0	 1	 2		#
 0|	26.02	59.58	14.40		2736
 1|	24.06	57.39	18.55		345
 2|	19.25	56.49	24.26		2094


        00     01     02    
prec    0.260  0.574  0.243
rec     0.594  0.066  0.526
f1      0.362  0.118  0.332
====================================================================================================
====================================================================================================
2024-01-20 16:23:47.886987
Train alexnet-emo8 -- 0.01:
	 0	 1	 2		#
 0|	27.30	58.52	14.18		8252
 1|	23.57	58.63	17.80		4235
 2|	18.76	57.65	23.59		8207


        00     01     02    
prec    0.273  0.586  0.236
rec     0.470  0.206  0.502
f1      0.345  0.305  0.321
----------------------------------------------------------------------------------------------------
Test alexnet-emo8 -- 0.01:
	 0	 1	 2		#
 0|	28.10	58.55	13.36		1954
 1|	22.78	58.82	18.40		913
 2|	19.11	57.63	23.27		2308


        00     01     02    
prec    0.281  0.588  0.233
rec     0.458  0.178  0.556
f1      0.348  0.274  0.328
====================================================================================================
====================================================================================================
2024-01-20 16:24:03.703509
Train alexnet-emo8 -- 0.01:
	 0	 1	 2		#
 0|	27.43	58.36	14.22		8390
 1|	24.00	58.32	17.68		3654
 2|	18.65	57.99	23.36		8650


        00     01     02    
prec    0.274  0.583  0.234
rec     0.480  0.177  0.524
f1      0.349  0.272  0.323
----------------------------------------------------------------------------------------------------
Test alexnet-emo8 -- 0.01:
	 0	 1	 2		#
 0|	27.96	58.28	13.76		1781
 1|	22.74	60.12	17.14		840
 2|	19.93	57.48	22.59		2554


        00     01     02    
prec    0.280  0.601  0.226
rec     0.416  0.168  0.597
f1      0.334  0.262  0.328
====================================================================================================
====================================================================================================
2024-01-20 16:24:12.461212
Train alexnet-emo8 -- 0.01:
	 0	 1	 2		#
 0|	27.15	58.32	14.52		7616
 1|	24.42	58.81	16.77		4787
 2|	18.74	57.73	23.53		8291


        00     01     02    
prec    0.272  0.588  0.235
rec     0.432  0.234  0.505
f1      0.333  0.335  0.321
----------------------------------------------------------------------------------------------------
Test alexnet-emo8 -- 0.01:
	 0	 1	 2		#
 0|	27.47	58.46	14.07		2097
 1|	23.13	59.59	17.28		1470
 2|	17.54	56.53	25.93		1608


        00     01     02    
prec    0.275  0.596  0.259
rec     0.481  0.291  0.432
f1      0.350  0.391  0.324
====================================================================================================
====================================================================================================
2024-01-20 16:24:22.824571
Train alexnet-emo8 -- 0.01:
	 0	 1	 2		#
 0|	27.60	58.30	14.10		8077
 1|	23.27	58.63	18.10		4211
 2|	18.82	57.88	23.30		8406


        00     01     02    
prec    0.276  0.586  0.233
rec     0.465  0.205  0.508
f1      0.346  0.304  0.319
----------------------------------------------------------------------------------------------------
Test alexnet-emo8 -- 0.01:
	 0	 1	 2		#
 0|	27.32	58.10	14.58		2229
 1|	21.90	62.24	15.86		580
 2|	19.53	57.27	23.20		2366


        00     01     02    
prec    0.273  0.622  0.232
rec     0.508  0.120  0.568
f1      0.355  0.201  0.330
====================================================================================================
====================================================================================================
2024-01-20 16:24:39.442617
Train alexnet-emo8 -- 0.01:
	 0	 1	 2		#
 0|	27.61	58.34	14.05		8091
 1|	23.26	59.75	16.99		3878
 2|	18.97	57.38	23.66		8725


        00     01     02    
prec    0.276  0.597  0.237
rec     0.466  0.192  0.535
f1      0.347  0.291  0.328
----------------------------------------------------------------------------------------------------
Test alexnet-emo8 -- 0.01:
	 0	 1	 2		#
 0|	29.38	56.68	13.93		1055
 1|	24.60	58.28	17.11		2402
 2|	17.29	58.96	23.75		1718


        00     01     02    
prec    0.294  0.583  0.237
rec     0.259  0.465  0.422
f1      0.275  0.517  0.304
====================================================================================================
====================================================================================================
2024-01-20 16:24:50.082979
Train alexnet-emo8 -- 0.01:
	 0	 1	 2		#
 0|	27.62	58.29	14.09		8154
 1|	23.02	59.10	17.88		4127
 2|	18.89	57.66	23.45		8413


        00     01     02    
prec    0.276  0.591  0.235
rec     0.470  0.203  0.511
f1      0.348  0.302  0.322
----------------------------------------------------------------------------------------------------
Test alexnet-emo8 -- 0.01:
	 0	 1	 2		#
 0|	29.23	58.16	12.61		1293
 1|	24.93	59.25	15.82		1821
 2|	17.76	57.25	24.99		2061


        00     01     02    
prec    0.292  0.593  0.250
rec     0.316  0.358  0.533
f1      0.303  0.447  0.340
====================================================================================================
====================================================================================================
2024-01-20 16:25:21.368707
Train alexnet-emo8 -- 0.001:
	 0	 1	 2		#
 0|	27.31	58.16	14.53		8791
 1|	23.37	59.63	16.99		3384
 2|	18.77	57.66	23.57		8519


        00     01     02    
prec    0.273  0.596  0.236
rec     0.501  0.168  0.520
f1      0.354  0.262  0.324
----------------------------------------------------------------------------------------------------
Test alexnet-emo8 -- 0.001:
	 0	 1	 2		#
 0|	27.75	59.41	12.84		2072
 1|	24.62	58.15	17.23		853
 2|	18.36	57.07	24.58		2250


        00     01     02    
prec    0.278  0.581  0.246
rec     0.480  0.165  0.572
f1      0.352  0.257  0.344
====================================================================================================
====================================================================================================
2024-01-20 16:26:16.827994
Train alexnet-emo8 -- 0.001:
	 0	 1	 2		#
 0|	27.24	58.74	14.02		8586
 1|	24.06	58.03	17.91		3450
 2|	18.73	57.73	23.54		8658


        00     01     02    
prec    0.272  0.580  0.235
rec     0.488  0.166  0.528
f1      0.350  0.258  0.326
----------------------------------------------------------------------------------------------------
Test alexnet-emo8 -- 0.001:
	 0	 1	 2		#
 0|	27.39	58.76	13.85		1964
 1|	23.39	60.62	16.00		1069
 2|	19.14	56.44	24.42		2142


        00     01     02    
prec    0.274  0.606  0.244
rec     0.449  0.215  0.541
f1      0.340  0.318  0.337
====================================================================================================
====================================================================================================
2024-01-20 16:26:42.568110
Train alexnet-emo8 -- 0.001:
	 0	 1	 2		#
 0|	26.92	58.88	14.20		8027
 1|	24.66	59.46	15.89		3796
 2|	19.10	57.04	23.86		8871


        00     01     02    
prec    0.269  0.595  0.239
rec     0.451  0.187  0.548
f1      0.337  0.285  0.333
----------------------------------------------------------------------------------------------------
Test alexnet-emo8 -- 0.001:
	 0	 1	 2		#
 0|	28.53	57.45	14.03		2310
 1|	21.36	59.33	19.31		777
 2|	17.86	58.57	23.56		2088


        00     01     02    
prec    0.285  0.593  0.236
rec     0.550  0.153  0.509
f1      0.376  0.243  0.322
====================================================================================================
====================================================================================================
2024-01-20 16:26:59.125704
Train alexnet-emo8 -- 0.001:
	 0	 1	 2		#
 0|	27.26	58.47	14.27		8338
 1|	24.22	59.02	16.76		3765
 2|	18.69	57.57	23.73		8591


        00     01     02    
prec    0.273  0.590  0.237
rec     0.474  0.185  0.528
f1      0.346  0.281  0.328
----------------------------------------------------------------------------------------------------
Test alexnet-emo8 -- 0.001:
	 0	 1	 2		#
 0|	28.02	59.10	12.88		2166
 1|	21.67	58.82	19.51		1066
 2|	18.53	56.82	24.65		1943


        00     01     02    
prec    0.280  0.588  0.247
rec     0.507  0.208  0.496
f1      0.361  0.308  0.329
====================================================================================================
====================================================================================================
2024-01-20 16:27:30.343212
Train alexnet-emo8 -- 0.001:
	 0	 1	 2		#
 0|	27.35	58.65	14.00		8663
 1|	23.95	59.20	16.85		3382
 2|	18.64	57.35	24.01		8649


        00     01     02    
prec    0.273  0.592  0.240
rec     0.494  0.166  0.538
f1      0.352  0.260  0.332
----------------------------------------------------------------------------------------------------
Test alexnet-emo8 -- 0.001:
	 0	 1	 2		#
 0|	27.03	57.97	14.99		1994
 1|	26.06	58.11	15.82		986
 2|	18.31	58.41	23.28		2195


        00     01     02    
prec    0.270  0.581  0.233
rec     0.450  0.190  0.529
f1      0.338  0.287  0.323
====================================================================================================
====================================================================================================
2024-01-20 16:28:02.525297
Train alexnet-emo8 -- 0.001:
	 0	 1	 2		#
 0|	27.34	58.43	14.22		8591
 1|	24.05	59.03	16.92		3368
 2|	18.68	57.64	23.67		8735


        00     01     02    
prec    0.273  0.590  0.237
rec     0.490  0.165  0.536
f1      0.351  0.258  0.328
----------------------------------------------------------------------------------------------------
Test alexnet-emo8 -- 0.001:
	 0	 1	 2		#
 0|	27.62	58.48	13.91		2064
 1|	23.03	59.50	17.47		1042
 2|	18.75	57.23	24.02		2069


        00     01     02    
prec    0.276  0.595  0.240
rec     0.476  0.206  0.514
f1      0.349  0.306  0.328
====================================================================================================
====================================================================================================
2024-01-20 16:28:40.315615
Train alexnet-emo8 -- 0.001:
	 0	 1	 2		#
 0|	27.36	58.50	14.14		8362
 1|	23.89	59.33	16.78		3659
 2|	18.78	57.42	23.80		8673


        00     01     02    
prec    0.274  0.593  0.238
rec     0.478  0.180  0.535
f1      0.348  0.277  0.329
----------------------------------------------------------------------------------------------------
Test alexnet-emo8 -- 0.001:
	 0	 1	 2		#
 0|	26.99	58.57	14.44		2223
 1|	23.02	58.07	18.92		756
 2|	19.31	57.83	22.86		2196


        00     01     02    
prec    0.270  0.581  0.229
rec     0.501  0.146  0.520
f1      0.351  0.233  0.318
====================================================================================================
====================================================================================================
2024-01-20 16:29:45.450850
Train alexnet-emo8 -- 0.001:
	 0	 1	 2		#
 0|	27.39	58.41	14.20		8675
 1|	23.59	59.91	16.50		3048
 2|	18.91	57.41	23.69		8971


        00     01     02    
prec    0.274  0.599  0.237
rec     0.496  0.152  0.551
f1      0.353  0.242  0.331
----------------------------------------------------------------------------------------------------
Test alexnet-emo8 -- 0.001:
	 0	 1	 2		#
 0|	27.47	58.74	13.79		2031
 1|	24.84	58.98	16.18		958
 2|	18.39	57.32	24.29		2186


        00     01     02    
prec    0.275  0.590  0.243
rec     0.466  0.188  0.550
f1      0.346  0.285  0.337
====================================================================================================
====================================================================================================
2024-01-20 16:29:59.801659
Train alexnet-emo8 -- 0.001:
	 0	 1	 2		#
 0|	27.11	58.55	14.34		8178
 1|	24.69	59.03	16.28		3913
 2|	18.69	57.48	23.83		8603


        00     01     02    
prec    0.271  0.590  0.238
rec     0.463  0.192  0.531
f1      0.342  0.290  0.329
----------------------------------------------------------------------------------------------------
Test alexnet-emo8 -- 0.001:
	 0	 1	 2		#
 0|	26.98	58.35	14.67		2276
 1|	22.31	60.42	17.26		753
 2|	19.38	57.22	23.39		2146


        00     01     02    
prec    0.270  0.604  0.234
rec     0.513  0.151  0.520
f1      0.353  0.242  0.323
====================================================================================================
====================================================================================================
2024-01-20 16:31:08.717377
Train alexnet-emo8 -- 0.001:
	 0	 1	 2		#
 0|	27.50	58.40	14.10		8639
 1|	23.79	58.79	17.43		3317
 2|	18.61	57.77	23.62		8738


        00     01     02    
prec    0.275  0.588  0.236
rec     0.496  0.162  0.535
f1      0.354  0.254  0.328
----------------------------------------------------------------------------------------------------
Test alexnet-emo8 -- 0.001:
	 0	 1	 2		#
 0|	27.04	58.85	14.11		2141
 1|	24.88	59.19	15.93		816
 2|	18.76	57.17	24.08		2218


        00     01     02    
prec    0.270  0.592  0.241
rec     0.483  0.160  0.553
f1      0.347  0.252  0.335
====================================================================================================
====================================================================================================
2024-01-20 16:33:27.387093
Train alexnet-emo8 -- 0.0001:
	 0	 1	 2		#
 0|	26.98	58.47	14.55		8625
 1|	24.11	59.50	16.40		3464
 2|	18.93	57.40	23.67		8605


        00     01     02    
prec    0.270  0.595  0.237
rec     0.486  0.171  0.528
f1      0.347  0.266  0.327
----------------------------------------------------------------------------------------------------
Test alexnet-emo8 -- 0.0001:
	 0	 1	 2		#
 0|	27.81	57.77	14.42		2136
 1|	24.91	60.21	14.88		847
 2|	17.93	57.80	24.27		2192


        00     01     02    
prec    0.278  0.602  0.243
rec     0.496  0.169  0.551
f1      0.356  0.264  0.337
====================================================================================================
====================================================================================================
2024-01-20 16:35:43.541052
Train alexnet-emo8 -- 0.0001:
	 0	 1	 2		#
 0|	27.50	58.10	14.41		7823
 1|	23.90	59.99	16.11		3477
 2|	19.26	57.61	23.13		9394


        00     01     02    
prec    0.275  0.600  0.231
rec     0.449  0.173  0.563
f1      0.341  0.269  0.328
----------------------------------------------------------------------------------------------------
Test alexnet-emo8 -- 0.0001:
	 0	 1	 2		#
 0|	27.28	58.47	14.26		1943
 1|	23.57	59.09	17.34		946
 2|	19.47	57.57	22.97		2286


        00     01     02    
prec    0.273  0.591  0.230
rec     0.442  0.186  0.543
f1      0.337  0.283  0.323
====================================================================================================
====================================================================================================
2024-01-20 16:37:59.070599
Train alexnet-emo8 -- 0.0001:
	 0	 1	 2		#
 0|	27.28	58.24	14.48		8144
 1|	22.94	60.10	16.95		3875
 2|	19.37	57.30	23.33		8675


        00     01     02    
prec    0.273  0.601  0.233
rec     0.464  0.193  0.524
f1      0.344  0.293  0.323
----------------------------------------------------------------------------------------------------
Test alexnet-emo8 -- 0.0001:
	 0	 1	 2		#
 0|	27.12	59.37	13.51		2050
 1|	25.71	56.77	17.52		953
 2|	18.28	57.69	24.03		2172


        00     01     02    
prec    0.271  0.568  0.240
rec     0.464  0.180  0.540
f1      0.342  0.273  0.333
====================================================================================================
====================================================================================================
2024-01-20 16:40:15.617045
Train alexnet-emo8 -- 0.0001:
	 0	 1	 2		#
 0|	27.08	58.24	14.67		8961
 1|	23.57	60.07	16.35		3504
 2|	18.69	57.35	23.96		8229


        00     01     02    
prec    0.271  0.601  0.240
rec     0.507  0.175  0.511
f1      0.353  0.271  0.326
----------------------------------------------------------------------------------------------------
Test alexnet-emo8 -- 0.0001:
	 0	 1	 2		#
 0|	26.25	59.04	14.70		2251
 1|	25.08	58.08	16.84		885
 2|	18.88	57.28	23.84		2039


        00     01     02    
prec    0.263  0.581  0.238
rec     0.493  0.171  0.503
f1      0.343  0.264  0.323
====================================================================================================
====================================================================================================
2024-01-20 16:42:31.810133
Train alexnet-emo8 -- 0.0001:
	 0	 1	 2		#
 0|	27.84	57.86	14.30		7798
 1|	23.06	59.43	17.51		4718
 2|	18.73	57.80	23.47		8178


        00     01     02    
prec    0.278  0.594  0.235
rec     0.453  0.233  0.497
f1      0.345  0.335  0.319
----------------------------------------------------------------------------------------------------
Test alexnet-emo8 -- 0.0001:
	 0	 1	 2		#
 0|	27.44	59.40	13.17		1990
 1|	24.73	57.80	17.47		1225
 2|	17.81	57.19	25.00		1960


        00     01     02    
prec    0.274  0.578  0.250
rec     0.456  0.235  0.507
f1      0.343  0.334  0.335
====================================================================================================
====================================================================================================
2024-01-20 16:44:49.301845
Train alexnet-emo8 -- 0.0001:
	 0	 1	 2		#
 0|	28.11	57.99	13.90		7589
 1|	22.74	59.40	17.87		5199
 2|	18.67	57.60	23.73		7906


        00     01     02    
prec    0.281  0.594  0.237
rec     0.445  0.256  0.486
f1      0.345  0.358  0.319
----------------------------------------------------------------------------------------------------
Test alexnet-emo8 -- 0.0001:
	 0	 1	 2		#
 0|	27.62	58.97	13.41		1879
 1|	22.54	58.56	18.90		1344
 2|	19.26	57.17	23.57		1952


        00     01     02    
prec    0.276  0.586  0.236
rec     0.433  0.261  0.476
f1      0.337  0.361  0.315
====================================================================================================
====================================================================================================
2024-01-20 16:47:07.369266
Train alexnet-emo8 -- 0.0001:
	 0	 1	 2		#
 0|	27.34	58.34	14.32		8602
 1|	23.51	58.83	17.66		3748
 2|	18.67	57.77	23.56		8344


        00     01     02    
prec    0.273  0.588  0.236
rec     0.491  0.183  0.509
f1      0.351  0.279  0.322
----------------------------------------------------------------------------------------------------
Test alexnet-emo8 -- 0.0001:
	 0	 1	 2		#
 0|	26.87	59.42	13.71		2144
 1|	25.08	58.55	16.37		953
 2|	18.43	56.74	24.83		2078


        00     01     02    
prec    0.269  0.586  0.248
rec     0.481  0.185  0.534
f1      0.345  0.282  0.339
====================================================================================================
====================================================================================================
2024-01-20 16:49:24.446986
Train alexnet-emo8 -- 0.0001:
	 0	 1	 2		#
 0|	27.43	58.00	14.57		8680
 1|	24.24	59.91	15.85		3078
 2|	18.62	57.80	23.58		8936


        00     01     02    
prec    0.274  0.599  0.236
rec     0.497  0.153  0.546
f1      0.354  0.244  0.329
----------------------------------------------------------------------------------------------------
Test alexnet-emo8 -- 0.0001:
	 0	 1	 2		#
 0|	27.05	58.99	13.96		2170
 1|	23.15	58.95	17.90		743
 2|	19.41	57.16	23.43		2262


        00     01     02    
prec    0.271  0.590  0.234
rec     0.490  0.145  0.549
f1      0.349  0.233  0.328
====================================================================================================
====================================================================================================
2024-01-20 16:51:40.934161
Train alexnet-emo8 -- 0.0001:
	 0	 1	 2		#
 0|	26.95	58.40	14.66		7689
 1|	24.93	59.00	16.07		3983
 2|	19.13	57.67	23.20		9022


        00     01     02    
prec    0.269  0.590  0.232
rec     0.432  0.195  0.542
f1      0.332  0.293  0.325
----------------------------------------------------------------------------------------------------
Test alexnet-emo8 -- 0.0001:
	 0	 1	 2		#
 0|	27.59	58.37	14.04		2008
 1|	24.10	59.56	16.33		1004
 2|	18.59	57.37	24.04		2163


        00     01     02    
prec    0.276  0.596  0.240
rec     0.462  0.199  0.538
f1      0.346  0.298  0.332
====================================================================================================
====================================================================================================
2024-01-20 16:53:59.368768
Train alexnet-emo8 -- 0.0001:
	 0	 1	 2		#
 0|	27.45	58.53	14.02		8373
 1|	23.26	59.44	17.30		3526
 2|	19.02	57.37	23.60		8795


        00     01     02    
prec    0.274  0.594  0.236
rec     0.480  0.174  0.538
f1      0.349  0.269  0.328
----------------------------------------------------------------------------------------------------
Test alexnet-emo8 -- 0.0001:
	 0	 1	 2		#
 0|	28.58	57.40	14.02		2075
 1|	23.65	58.41	17.94		892
 2|	17.84	58.83	23.32		2208


        00     01     02    
prec    0.286  0.584  0.233
rec     0.495  0.173  0.533
f1      0.362  0.267  0.325
====================================================================================================
====================================================================================================
2024-01-20 16:54:05.811789
Train vgg16-emo8 -- 0.1:
	 0	 1	 2		#
 0|	26.34	59.42	14.24		7365
 1|	24.80	57.96	17.24		6375
 2|	18.26	57.12	24.62		6954


        00     01     02    
prec    0.263  0.580  0.246
rec     0.405  0.307  0.444
f1      0.319  0.401  0.317
----------------------------------------------------------------------------------------------------
Test vgg16-emo8 -- 0.1:
	 0	 1	 2		#
 0|	28.10	57.09	14.81		2559
 1|	20.80	59.10	20.11		1308
 2|	15.83	59.40	24.77		1308


        00     01     02    
prec    0.281  0.591  0.248
rec     0.600  0.257  0.335
f1      0.383  0.358  0.285
====================================================================================================
====================================================================================================
2024-01-20 16:54:35.928342
Train vgg16-emo8 -- 0.1:
	 0	 1	 2		#
 0|	26.85	58.97	14.18		7412
 1|	24.38	58.97	16.64		6140
 2|	18.26	56.72	25.02		7142


        00     01     02    
prec    0.268  0.590  0.250
rec     0.415  0.301  0.463
f1      0.326  0.398  0.325
----------------------------------------------------------------------------------------------------
Test vgg16-emo8 -- 0.1:
	 0	 1	 2		#
 0|	29.12	57.88	13.00		1985
 1|	22.06	61.07	16.86		1192
 2|	17.87	56.76	25.38		1998


        00     01     02    
prec    0.291  0.611  0.254
rec     0.482  0.242  0.525
f1      0.363  0.346  0.342
====================================================================================================
====================================================================================================
2024-01-20 16:54:49.733976
Train vgg16-emo8 -- 0.1:
	 0	 1	 2		#
 0|	27.17	58.70	14.13		7567
 1|	23.59	59.54	16.87		5791
 2|	18.66	56.61	24.73		7336


        00     01     02    
prec    0.272  0.595  0.247
rec     0.429  0.286  0.470
f1      0.333  0.387  0.324
----------------------------------------------------------------------------------------------------
Test vgg16-emo8 -- 0.1:
	 0	 1	 2		#
 0|	26.90	58.58	14.52		2699
 1|	23.35	58.20	18.44		835
 2|	16.88	57.53	25.59		1641


        00     01     02    
prec    0.269  0.582  0.256
rec     0.606  0.161  0.435
f1      0.373  0.253  0.322
====================================================================================================
====================================================================================================
2024-01-20 16:55:01.727623
Train vgg16-emo8 -- 0.1:
	 0	 1	 2		#
 0|	27.43	57.89	14.68		7590
 1|	23.17	59.95	16.89		6259
 2|	18.39	56.93	24.67		6845


        00     01     02    
prec    0.274  0.599  0.247
rec     0.435  0.312  0.438
f1      0.336  0.410  0.316
----------------------------------------------------------------------------------------------------
Test vgg16-emo8 -- 0.1:
	 0	 1	 2		#
 0|	32.92	57.36	9.73		401
 1|	25.70	60.08	14.22		2638
 2|	18.16	55.99	25.84		2136


        00     01     02    
prec    0.329  0.601  0.258
rec     0.110  0.526  0.571
f1      0.165  0.561  0.356
====================================================================================================
====================================================================================================
2024-01-20 16:55:16.327459
Train vgg16-emo8 -- 0.1:
	 0	 1	 2		#
 0|	26.90	58.94	14.16		7782
 1|	25.20	57.81	16.99		5445
 2|	17.76	57.69	24.55		7467


        00     01     02    
prec    0.269  0.578  0.245
rec     0.437  0.261  0.475
f1      0.333  0.360  0.324
----------------------------------------------------------------------------------------------------
Test vgg16-emo8 -- 0.1:
	 0	 1	 2		#
 0|	33.58	53.25	13.17		539
 1|	24.06	59.50	16.44		3491
 2|	15.46	56.51	28.03		1145


        00     01     02    
prec    0.336  0.595  0.280
rec     0.151  0.690  0.332
f1      0.208  0.639  0.304
====================================================================================================
====================================================================================================
2024-01-20 16:55:29.063273
Train vgg16-emo8 -- 0.1:
	 0	 1	 2		#
 0|	27.42	59.03	13.55		7076
 1|	23.05	59.08	17.87		6335
 2|	19.10	56.61	24.29		7283


        00     01     02    
prec    0.274  0.591  0.243
rec     0.405  0.311  0.458
f1      0.327  0.407  0.318
----------------------------------------------------------------------------------------------------
Test vgg16-emo8 -- 0.1:
	 0	 1	 2		#
 0|	33.12	56.25	10.62		160
 1|	24.65	58.52	16.83		4077
 2|	14.93	57.04	28.04		938


        00     01     02    
prec    0.331  0.585  0.280
rec     0.044  0.792  0.272
f1      0.078  0.673  0.276
====================================================================================================
====================================================================================================
2024-01-20 16:55:38.913322
Train vgg16-emo8 -- 0.1:
	 0	 1	 2		#
 0|	26.54	58.15	15.31		7420
 1|	24.06	58.59	17.35		6218
 2|	18.79	57.89	23.31		7056


        00     01     02    
prec    0.265  0.586  0.233
rec     0.411  0.302  0.426
f1      0.322  0.399  0.301
----------------------------------------------------------------------------------------------------
Test vgg16-emo8 -- 0.1:
	 0	 1	 2		#
 0|	28.03	59.98	11.99		1944
 1|	21.28	62.48	16.23		733
 2|	19.90	55.52	24.58		2498


        00     01     02    
prec    0.280  0.625  0.246
rec     0.455  0.152  0.636
f1      0.347  0.245  0.355
====================================================================================================
====================================================================================================
2024-01-20 16:55:48.848511
Train vgg16-emo8 -- 0.1:
	 0	 1	 2		#
 0|	26.99	58.61	14.39		7309
 1|	23.41	59.37	17.22		5836
 2|	19.23	56.88	23.88		7549


        00     01     02    
prec    0.270  0.594  0.239
rec     0.412  0.288  0.467
f1      0.326  0.388  0.316
----------------------------------------------------------------------------------------------------
Test vgg16-emo8 -- 0.1:
	 0	 1	 2		#
 0|	28.16	59.52	12.31		877
 1|	23.61	58.56	17.84		3622
 2|	14.20	54.44	31.36		676


        00     01     02    
prec    0.282  0.586  0.314
rec     0.206  0.704  0.219
f1      0.238  0.640  0.258
====================================================================================================
====================================================================================================
2024-01-20 16:55:59.285669
Train vgg16-emo8 -- 0.1:
	 0	 1	 2		#
 0|	27.44	58.56	14.00		7249
 1|	23.55	58.98	17.47		6470
 2|	18.32	57.09	24.59		6975


        00     01     02    
prec    0.274  0.590  0.246
rec     0.415  0.317  0.444
f1      0.330  0.412  0.317
----------------------------------------------------------------------------------------------------
Test vgg16-emo8 -- 0.1:
	 0	 1	 2		#
 0|	27.53	59.80	12.66		2535
 1|	15.90	61.09	23.01		239
 2|	19.24	56.18	24.57		2401


        00     01     02    
prec    0.275  0.611  0.246
rec     0.583  0.048  0.611
f1      0.374  0.090  0.350
====================================================================================================
====================================================================================================
2024-01-20 16:56:10.180947
Train vgg16-emo8 -- 0.1:
	 0	 1	 2		#
 0|	27.24	58.70	14.05		7088
 1|	23.11	58.63	18.26		6386
 2|	19.17	57.31	23.52		7220


