Confusion matrices pertaining to best epochs per model.
====================================================================================================
====================================================================================================
2024-01-13 19:24:28.705949
Train Exp5bMergerNetwork1+alexnetEmoNet^_OIToFER^ -- 0.1:
	 0	 1	 2	 3	 4	 5	 6	 7		#
 0|	43.88	16.56	4.61	2.93	6.03	2.37	5.17	18.45		3382
 1|	34.50	18.73	5.98	3.64	6.77	2.77	5.58	22.02		2525
 2|	17.27	11.31	16.86	2.86	13.02	4.29	11.43	22.98		2450
 3|	30.29	12.12	6.30	4.74	8.40	3.71	8.84	25.60		2047
 4|	19.76	13.43	11.23	3.30	20.45	4.56	7.03	20.24		2875
 5|	21.68	12.77	9.11	4.15	10.61	6.30	9.23	26.15		2459
 6|	19.67	10.87	12.40	2.98	8.69	3.49	21.05	20.84		2750
 7|	26.32	12.79	8.30	3.31	8.08	3.95	7.53	29.72		2204


        00     01     02     03     04     05     06     07    
prec    0.439  0.187  0.169  0.047  0.205  0.063  0.211  0.297
rec     0.264  0.167  0.215  0.137  0.276  0.194  0.297  0.139
f1      0.330  0.176  0.189  0.070  0.235  0.095  0.246  0.189
----------------------------------------------------------------------------------------------------
Test Exp5bMergerNetwork1+alexnetEmoNet^_OIToFER^ -- 0.1:
	 0	 1	 2	 3	 4	 5	 6	 7		#
 0|	64.24	13.58	1.99	1.99	2.32	0.66	3.31	11.92		302
 1|	36.42	23.46	3.70	2.78	4.63	1.85	5.56	21.60		324
 2|	10.42	8.33	21.35	2.86	11.98	4.43	14.58	26.04		384
 3|	28.70	14.85	7.32	4.02	9.51	3.91	8.14	23.54		2787
 4|	14.11	10.12	14.42	2.15	30.37	5.21	5.52	18.10		326
 5|	24.29	12.41	9.40	2.84	11.35	5.85	8.33	25.53		564
 6|	11.50	7.67	17.42	2.79	9.41	1.39	33.10	16.72		287
 7|	18.72	10.84	13.30	4.43	4.93	5.91	8.37	33.50		203


        00     01     02     03     04     05     06     07    
prec    0.642  0.235  0.214  0.040  0.304  0.059  0.331  0.335
rec     0.138  0.107  0.170  0.629  0.186  0.165  0.195  0.058
f1      0.227  0.147  0.190  0.076  0.231  0.086  0.245  0.098
====================================================================================================
====================================================================================================
2024-01-13 19:27:07.429635
Train Exp5bMergerNetwork1+alexnetEmoNet^_OIToFER^ -- 0.1:
	 0	 1	 2	 3	 4	 5	 6	 7		#
 0|	44.38	16.12	4.28	3.17	5.11	2.48	5.25	19.22		3506
 1|	34.66	18.90	6.18	3.44	8.47	3.07	6.01	19.27		2444
 2|	17.42	11.29	16.37	3.11	11.95	4.03	11.95	23.89		2285
 3|	28.30	13.83	7.38	4.85	8.27	3.42	8.52	25.43		2371
 4|	19.11	13.13	11.38	2.89	21.52	4.67	7.12	20.18		2978
 5|	22.60	13.86	9.79	3.18	10.72	5.40	8.74	25.71		2482
 6|	19.11	9.98	12.27	3.10	8.46	3.95	20.69	22.43		2706
 7|	26.09	11.51	8.12	4.17	7.34	4.43	8.12	30.21		1920


        00     01     02     03     04     05     06     07    
prec    0.444  0.189  0.164  0.049  0.215  0.054  0.207  0.302
rec     0.277  0.163  0.195  0.162  0.301  0.168  0.287  0.123
f1      0.341  0.175  0.178  0.075  0.251  0.082  0.240  0.175
----------------------------------------------------------------------------------------------------
Test Exp5bMergerNetwork1+alexnetEmoNet^_OIToFER^ -- 0.1:
	 0	 1	 2	 3	 4	 5	 6	 7		#
 0|	44.84	17.35	3.11	3.46	4.87	2.70	3.81	19.87		1706
 1|	27.69	13.85	6.15	1.54	15.38	3.08	6.15	26.15		65
 2|	12.81	10.98	19.11	3.32	12.59	3.09	15.10	23.00		874
 3|	18.18	9.09	12.12	11.11	5.05	3.03	10.10	31.31		99
 4|	16.47	12.47	10.82	2.12	31.53	4.94	5.65	16.00		425
 5|	15.49	12.60	9.45	2.89	13.91	11.29	7.35	27.03		381
 6|	14.48	6.70	13.94	2.14	6.43	3.22	30.83	22.25		373
 7|	24.72	13.88	8.85	3.99	9.09	3.67	8.77	27.03		1254


        00     01     02     03     04     05     06     07    
prec    0.448  0.138  0.191  0.111  0.315  0.113  0.308  0.270
rec     0.544  0.013  0.347  0.062  0.251  0.215  0.236  0.287
f1      0.492  0.023  0.246  0.079  0.280  0.148  0.267  0.278
====================================================================================================
====================================================================================================
2024-01-13 19:30:07.505253
Train Exp5bMergerNetwork1+alexnetEmoNet^_OIToFER^ -- 0.1:
	 0	 1	 2	 3	 4	 5	 6	 7		#
 0|	46.24	15.74	3.87	3.04	5.13	2.06	5.02	18.89		3488
 1|	33.41	18.33	6.02	2.81	8.51	3.60	6.45	20.86		2526
 2|	16.20	10.93	18.34	2.81	12.58	4.28	11.87	22.98		2241
 3|	27.81	13.04	8.33	4.67	7.64	3.52	8.37	26.62		2186
 4|	18.76	12.85	11.44	3.10	21.72	4.47	7.46	20.20		2841
 5|	23.11	14.58	8.89	3.85	10.82	6.92	7.41	24.42		2441
 6|	20.25	10.70	11.70	3.29	8.00	3.39	20.94	21.74		2889
 7|	24.52	12.84	7.69	4.38	8.51	3.37	7.98	30.72		2080


        00     01     02     03     04     05     06     07    
prec    0.462  0.183  0.183  0.047  0.217  0.069  0.209  0.307
rec     0.287  0.163  0.214  0.144  0.289  0.211  0.310  0.135
f1      0.354  0.173  0.198  0.070  0.248  0.104  0.250  0.188
----------------------------------------------------------------------------------------------------
Test Exp5bMergerNetwork1+alexnetEmoNet^_OIToFER^ -- 0.1:
	 0	 1	 2	 3	 4	 5	 6	 7		#
 0|	55.12	14.81	1.31	2.83	2.61	2.18	4.36	16.78		459
 1|	43.76	23.56	2.97	2.18	5.15	2.57	3.76	16.04		505
 2|	20.11	13.07	14.39	3.31	11.12	4.31	12.26	21.43		2203
 3|	28.72	11.56	6.39	4.12	6.92	3.94	8.76	29.60		1142
 4|	17.15	12.90	8.83	3.90	27.33	4.24	5.43	20.20		589
 5|	24.14	13.79	10.34	6.90	0.00	0.00	3.45	41.38		29
 6|	18.00	7.00	8.00	4.00	3.00	6.00	33.00	21.00		100
 7|	23.33	10.67	4.67	3.33	4.67	4.00	8.67	40.67		150


        00     01     02     03     04     05     06     07    
prec    0.551  0.236  0.144  0.041  0.273  0.000  0.330  0.407
rec     0.180  0.168  0.659  0.264  0.302  0.000  0.068  0.052
f1      0.271  0.196  0.236  0.071  0.287  0.000  0.112  0.092
====================================================================================================
====================================================================================================
2024-01-13 19:31:56.906093
Train Exp5bMergerNetwork1+alexnetEmoNet^_OIToFER^ -- 0.1:
	 0	 1	 2	 3	 4	 5	 6	 7		#
 0|	44.21	15.02	4.04	3.28	5.32	2.85	5.61	19.69		3443
 1|	34.11	18.49	5.81	3.37	7.71	3.10	5.70	21.71		2580
 2|	16.08	11.12	17.66	2.65	12.40	4.19	11.93	23.98		2339
 3|	28.58	13.67	8.12	4.64	8.59	3.52	7.78	25.10		2327
 4|	19.67	13.08	11.45	2.95	20.96	4.46	7.96	19.48		2715
 5|	22.88	14.30	9.47	2.84	11.58	6.14	8.57	24.22		2461
 6|	18.78	10.56	12.06	3.43	9.06	3.18	20.35	22.58		2737
 7|	27.08	12.97	7.42	4.59	7.56	3.97	7.99	28.42		2090


        00     01     02     03     04     05     06     07    
prec    0.442  0.185  0.177  0.046  0.210  0.061  0.204  0.284
rec     0.271  0.168  0.215  0.152  0.267  0.189  0.285  0.126
f1      0.336  0.176  0.194  0.071  0.235  0.093  0.238  0.174
----------------------------------------------------------------------------------------------------
Test Exp5bMergerNetwork1+alexnetEmoNet^_OIToFER^ -- 0.1:
	 0	 1	 2	 3	 4	 5	 6	 7		#
 0|	51.62	18.83	2.24	2.99	3.99	2.12	3.37	14.84		802
 1|	35.36	18.23	6.26	4.05	9.21	3.50	4.42	18.97		543
 2|	13.75	9.23	20.83	2.36	13.95	5.11	9.82	24.95		509
 3|	30.30	9.09	9.09	0.00	6.06	6.06	3.03	36.36		33
 4|	17.03	14.56	11.94	3.78	24.60	4.37	5.68	18.05		687
 5|	17.25	11.76	6.27	4.71	12.94	10.59	8.24	28.24		255
 6|	18.83	8.85	11.47	3.87	7.23	2.74	25.69	21.32		802
 7|	26.39	13.52	8.41	3.30	7.63	3.69	7.76	29.30		1546


        00     01     02     03     04     05     06     07    
prec    0.516  0.182  0.208  0.000  0.246  0.106  0.257  0.293
rec     0.294  0.139  0.220  0.000  0.317  0.135  0.422  0.384
f1      0.375  0.158  0.214  0.000  0.277  0.119  0.319  0.332
====================================================================================================
====================================================================================================
2024-01-13 19:34:17.809891
Train Exp5bMergerNetwork1+alexnetEmoNet^_OIToFER^ -- 0.1:
	 0	 1	 2	 3	 4	 5	 6	 7		#
 0|	44.67	16.05	4.21	2.77	5.33	2.92	5.01	19.05		3396
 1|	33.62	19.18	6.62	2.96	8.16	3.31	6.66	19.48		2597
 2|	16.83	11.46	17.45	3.06	12.53	3.56	10.88	24.23		2418
 3|	28.79	12.93	7.27	5.58	9.05	3.61	8.23	24.54		2188
 4|	19.03	13.54	11.04	3.15	20.85	4.23	7.88	20.28		2791
 5|	23.00	12.74	8.48	3.70	10.57	6.35	7.91	27.26		2300
 6|	19.46	9.71	12.06	2.97	8.43	3.92	21.48	21.96		2728
 7|	26.47	13.19	8.44	3.91	8.05	3.47	7.78	28.67		2274


        00     01     02     03     04     05     06     07    
prec    0.447  0.192  0.175  0.056  0.209  0.063  0.215  0.287
rec     0.270  0.175  0.220  0.172  0.273  0.182  0.300  0.138
f1      0.337  0.183  0.195  0.084  0.236  0.094  0.250  0.186
----------------------------------------------------------------------------------------------------
Test Exp5bMergerNetwork1+alexnetEmoNet^_OIToFER^ -- 0.1:
	 0	 1	 2	 3	 4	 5	 6	 7		#
 0|	41.13	18.53	3.66	2.93	5.91	2.38	5.00	20.48		1641
 1|	33.10	16.73	6.41	2.85	11.39	4.63	4.98	19.93		281
 2|	14.72	8.68	21.13	2.77	12.45	4.40	15.09	20.75		795
 3|	34.94	12.45	6.02	6.02	8.43	2.81	9.64	19.68		249
 4|	12.39	11.52	12.39	3.49	28.27	5.06	6.81	20.07		573
 5|	24.95	13.88	8.68	5.21	8.24	7.38	6.51	25.16		461
 6|	15.66	8.79	13.46	1.65	7.42	3.02	28.57	21.43		364
 7|	23.49	11.93	7.38	4.31	7.01	3.94	9.23	32.72		813


        00     01     02     03     04     05     06     07    
prec    0.411  0.167  0.211  0.060  0.283  0.074  0.286  0.327
rec     0.480  0.066  0.349  0.084  0.304  0.170  0.213  0.225
f1      0.443  0.095  0.263  0.070  0.293  0.103  0.244  0.267
====================================================================================================
====================================================================================================
2024-01-13 19:40:18.953504
Train Exp5bMergerNetwork1+alexnetEmoNet^_OIToFER^ -- 0.1:
	 0	 1	 2	 3	 4	 5	 6	 7		#
 0|	47.14	15.59	4.02	3.10	5.46	1.97	5.09	17.62		3553
 1|	32.58	19.21	5.92	3.51	7.72	3.74	5.81	21.51		2566
 2|	15.81	11.40	17.78	2.81	12.83	4.03	11.28	24.07		2385
 3|	29.82	12.14	7.57	4.84	7.95	3.72	8.00	25.96		2126
 4|	18.96	13.41	11.28	3.28	21.05	4.68	7.33	20.01		2864
 5|	21.33	14.28	9.47	3.32	12.39	6.47	7.81	24.92		2227
 6|	19.39	9.97	11.79	2.99	7.80	3.33	22.31	22.41		2909
 7|	25.02	13.09	7.90	4.12	7.71	4.07	7.23	30.84		2062


        00     01     02     03     04     05     06     07    
prec    0.471  0.192  0.178  0.048  0.211  0.065  0.223  0.308
rec     0.298  0.174  0.221  0.145  0.283  0.180  0.333  0.135
f1      0.365  0.182  0.197  0.073  0.241  0.095  0.267  0.188
----------------------------------------------------------------------------------------------------
Test Exp5bMergerNetwork1+alexnetEmoNet^_OIToFER^ -- 0.1:
	 0	 1	 2	 3	 4	 5	 6	 7		#
 0|	47.31	15.56	3.24	3.61	4.44	2.31	4.63	18.89		1080
 1|	34.06	20.82	6.83	3.15	8.13	2.71	3.90	20.39		922
 2|	12.01	11.49	20.56	1.79	15.07	3.32	12.13	23.63		783
 3|	30.43	5.43	6.52	8.70	6.52	4.35	9.78	28.26		92
 4|	13.55	10.99	9.52	4.03	35.90	4.40	6.59	15.02		273
 5|	18.08	13.99	7.70	2.20	12.11	7.86	12.42	25.63		636
 6|	16.07	6.93	12.47	3.60	5.82	4.16	33.52	17.45		361
 7|	24.17	10.78	9.32	4.85	8.74	4.17	7.77	30.19		1030


        00     01     02     03     04     05     06     07    
prec    0.473  0.208  0.206  0.087  0.359  0.079  0.335  0.302
rec     0.363  0.270  0.335  0.045  0.184  0.250  0.248  0.263
f1      0.411  0.235  0.255  0.059  0.243  0.120  0.285  0.281
====================================================================================================
====================================================================================================
2024-01-13 19:41:59.451419
Train Exp5bMergerNetwork1+alexnetEmoNet^_OIToFER^ -- 0.1:
	 0	 1	 2	 3	 4	 5	 6	 7		#
 0|	44.07	15.81	4.34	3.53	5.06	2.78	5.51	18.89		3340
 1|	32.73	18.45	6.18	2.65	8.58	3.17	5.82	22.42		2493
 2|	17.48	11.68	15.52	2.57	13.38	4.27	11.90	23.19		2294
 3|	29.43	12.93	8.33	4.12	8.08	3.40	8.57	25.14		2474
 4|	19.95	13.75	11.23	3.32	19.47	4.38	7.77	20.13		2742
 5|	22.07	14.16	8.56	4.16	12.51	5.53	7.95	25.06		2478
 6|	18.67	9.55	13.60	3.30	8.22	3.83	20.53	22.31		2640
 7|	27.61	12.68	8.07	3.77	8.11	3.94	8.29	27.52		2231


        00     01     02     03     04     05     06     07    
prec    0.441  0.185  0.155  0.041  0.195  0.055  0.205  0.275
rec     0.262  0.162  0.185  0.144  0.250  0.171  0.278  0.130
f1      0.329  0.173  0.169  0.064  0.219  0.084  0.236  0.177
----------------------------------------------------------------------------------------------------
Test Exp5bMergerNetwork1+alexnetEmoNet^_OIToFER^ -- 0.1:
	 0	 1	 2	 3	 4	 5	 6	 7		#
 0|	49.89	18.61	2.58	3.59	3.70	1.23	3.81	16.59		892
 1|	35.39	22.25	5.09	1.07	6.17	5.63	6.17	18.23		373
 2|	8.12	10.36	18.49	3.64	15.97	6.44	11.20	25.77		357
 3|	0.00	0.00	0.00	0.00	0.00	0.00	0.00	0.00		0
 4|	20.46	14.88	10.23	2.75	20.46	3.96	7.91	19.35		1163
 5|	23.77	13.73	9.72	2.93	10.34	4.94	8.49	26.08		648
 6|	15.05	7.37	13.95	3.29	7.84	4.86	24.14	23.51		638
 7|	28.21	10.40	9.22	5.15	5.88	3.25	8.14	29.75		1106


        00     01     02     03     04     05     06     07    
prec    0.499  0.223  0.185  0.000  0.205  0.049  0.241  0.297
rec     0.317  0.117  0.137  0.000  0.447  0.160  0.316  0.279
f1      0.387  0.153  0.158  0.000  0.281  0.075  0.274  0.288
====================================================================================================
====================================================================================================
2024-01-13 19:45:50.219602
Train Exp5bMergerNetwork1+alexnetEmoNet^_OIToFER^ -- 0.1:
	 0	 1	 2	 3	 4	 5	 6	 7		#
 0|	45.74	16.40	3.70	2.85	5.48	2.40	4.88	18.55		3542
 1|	35.73	17.81	6.56	3.22	7.83	3.14	5.88	19.83		2516
 2|	15.84	11.38	18.21	3.46	11.83	4.42	11.56	23.30		2197
 3|	26.54	13.99	6.99	4.96	8.33	4.37	7.54	27.28		2016
 4|	18.75	14.04	11.06	3.15	22.11	3.95	7.69	19.24		2885
 5|	22.63	13.04	9.52	3.67	10.82	5.85	7.80	26.68		2616
 6|	18.55	9.95	12.07	3.11	8.59	3.80	22.41	21.52		2793
 7|	26.66	11.94	8.37	3.67	7.15	3.67	8.09	30.47		2127


        00     01     02     03     04     05     06     07    
prec    0.457  0.178  0.182  0.050  0.221  0.058  0.224  0.305
rec     0.288  0.158  0.208  0.141  0.299  0.191  0.321  0.137
f1      0.354  0.167  0.194  0.073  0.254  0.090  0.264  0.189
----------------------------------------------------------------------------------------------------
Test Exp5bMergerNetwork1+alexnetEmoNet^_OIToFER^ -- 0.1:
	 0	 1	 2	 3	 4	 5	 6	 7		#
 0|	51.85	13.85	2.77	2.90	3.56	2.64	4.09	18.34		758
 1|	28.86	19.09	7.26	3.42	10.15	3.31	6.10	21.82		1902
 2|	11.80	9.92	21.72	2.95	15.15	4.83	12.33	21.31		746
 3|	16.67	33.33	0.00	0.00	16.67	0.00	0.00	33.33		6
 4|	12.56	8.04	9.55	2.51	37.69	8.04	5.53	16.08		199
 5|	32.65	14.29	4.08	2.04	8.16	14.29	2.04	22.45		49
 6|	17.29	6.77	13.91	3.20	8.65	3.20	28.76	18.23		532
 7|	24.57	10.86	6.60	4.67	7.51	4.16	8.53	33.10		985


        00     01     02     03     04     05     06     07    
prec    0.518  0.191  0.217  0.000  0.377  0.143  0.288  0.331
rec     0.280  0.511  0.337  0.000  0.141  0.035  0.314  0.276
f1      0.363  0.278  0.264  0.000  0.205  0.056  0.300  0.301
====================================================================================================
====================================================================================================
2024-01-13 19:48:29.616953
Train Exp5bMergerNetwork1+alexnetEmoNet^_OIToFER^ -- 0.1:
	 0	 1	 2	 3	 4	 5	 6	 7		#
 0|	44.02	16.11	4.26	3.34	5.25	2.38	5.25	19.39		3564
 1|	33.96	17.19	5.98	3.18	8.82	3.45	6.02	21.39		2641
 2|	18.33	11.26	16.54	2.58	12.70	4.02	11.13	23.44		2291
 3|	28.66	13.46	7.26	4.11	7.58	4.06	9.27	25.60		2191
 4|	16.30	14.10	12.73	3.43	21.51	4.58	7.31	20.04		2859
 5|	23.43	14.17	8.81	3.70	10.59	5.57	8.93	24.80		2407
 6|	19.10	9.55	12.40	3.33	8.69	3.60	21.16	22.17		2670
 7|	27.36	12.52	7.97	3.96	7.39	3.96	7.64	29.19		2069


        00     01     02     03     04     05     06     07    
prec    0.440  0.172  0.165  0.041  0.215  0.056  0.212  0.292
rec     0.279  0.160  0.197  0.127  0.288  0.168  0.290  0.128
f1      0.342  0.166  0.180  0.062  0.246  0.084  0.245  0.178
----------------------------------------------------------------------------------------------------
Test Exp5bMergerNetwork1+alexnetEmoNet^_OIToFER^ -- 0.1:
	 0	 1	 2	 3	 4	 5	 6	 7		#
 0|	47.55	15.88	3.48	3.21	4.46	2.23	3.57	19.63		1121
 1|	32.74	23.60	6.85	3.55	7.36	3.55	5.84	16.50		394
 2|	9.27	7.26	27.42	1.21	7.66	2.82	18.15	26.21		248
 3|	27.94	8.09	5.15	5.15	8.09	3.68	5.88	36.03		136
 4|	18.39	13.13	10.60	3.11	24.32	4.96	6.13	19.36		1028
 5|	21.83	12.18	9.64	3.30	10.41	8.12	5.33	29.19		394
 6|	18.69	9.75	12.61	3.21	8.49	3.78	23.97	19.50		872
 7|	24.90	14.43	8.43	4.57	6.00	3.35	8.03	30.28		984


        00     01     02     03     04     05     06     07    
prec    0.475  0.236  0.274  0.051  0.243  0.081  0.240  0.303
rec     0.379  0.131  0.141  0.039  0.469  0.160  0.428  0.252
f1      0.422  0.168  0.187  0.045  0.320  0.108  0.307  0.275
====================================================================================================
====================================================================================================
2024-01-13 19:52:08.435571
Train Exp5bMergerNetwork1+alexnetEmoNet^_OIToFER^ -- 0.1:
	 0	 1	 2	 3	 4	 5	 6	 7		#
 0|	44.74	16.03	4.48	2.88	5.47	2.14	4.96	19.30		3507
 1|	33.00	18.38	7.10	3.45	7.95	3.00	5.44	21.67		2464
 2|	16.07	10.90	17.68	3.01	13.23	4.11	12.17	22.82		2358
 3|	28.85	13.59	6.34	4.91	8.25	3.67	8.25	26.13		2097
 4|	20.22	12.90	11.13	2.92	20.72	4.33	7.45	20.32		3046
 5|	23.35	14.41	9.19	3.40	11.01	6.63	8.16	23.85		2415
 6|	17.72	9.91	12.25	3.37	8.46	3.90	21.97	22.43		2613
 7|	27.87	12.86	7.16	4.15	6.43	3.79	8.44	29.29		2192


        00     01     02     03     04     05     06     07    
prec    0.447  0.184  0.177  0.049  0.207  0.066  0.220  0.293
rec     0.279  0.160  0.217  0.145  0.296  0.200  0.294  0.136
f1      0.344  0.171  0.195  0.073  0.244  0.100  0.252  0.186
----------------------------------------------------------------------------------------------------
Test Exp5bMergerNetwork1+alexnetEmoNet^_OIToFER^ -- 0.1:
	 0	 1	 2	 3	 4	 5	 6	 7		#
 0|	46.63	16.65	3.87	2.79	5.27	3.02	4.03	17.74		1291
 1|	34.94	24.04	5.45	1.92	6.09	4.49	4.17	18.91		312
 2|	12.48	11.05	18.99	3.38	13.78	4.03	13.91	22.37		769
 3|	25.76	5.30	12.88	7.58	9.09	4.55	6.06	28.79		132
 4|	12.30	8.20	11.48	2.46	36.48	4.51	6.15	18.44		244
 5|	16.00	9.82	12.73	2.55	14.18	5.45	12.00	27.27		275
 6|	19.03	7.09	12.31	3.73	6.72	3.36	31.34	16.42		268
 7|	23.33	13.89	8.22	4.08	9.65	3.98	9.33	27.52		1886


        00     01     02     03     04     05     06     07    
prec    0.466  0.240  0.190  0.076  0.365  0.055  0.313  0.275
rec     0.428  0.106  0.304  0.056  0.167  0.075  0.172  0.439
f1      0.446  0.147  0.234  0.065  0.229  0.063  0.222  0.338
====================================================================================================
====================================================================================================
2024-01-13 19:54:08.826948
Train Exp5bMergerNetwork1+alexnetEmoNet^_OIToFER^ -- 0.01:
	 0	 1	 2	 3	 4	 5	 6	 7		#
 0|	46.15	15.89	3.77	2.88	5.25	2.27	4.84	18.95		3926
 1|	32.69	20.40	5.98	3.41	8.43	3.09	5.86	20.12		2490
 2|	13.62	10.81	20.78	2.63	13.31	4.41	12.02	22.43		2247
 3|	26.65	11.98	7.27	5.85	7.47	4.04	8.75	27.99		1486
 4|	19.15	13.27	10.19	3.40	21.40	4.64	7.46	20.48		3149
 5|	24.19	14.29	8.69	3.04	10.72	6.37	7.05	25.64		2071
 6|	19.47	9.30	12.51	3.45	8.60	3.78	21.98	20.91		2989
 7|	25.96	12.60	7.41	3.98	6.56	3.60	7.58	32.31		2334


        00     01     02     03     04     05     06     07    
prec    0.462  0.204  0.208  0.059  0.214  0.064  0.220  0.323
rec     0.322  0.179  0.243  0.123  0.316  0.165  0.337  0.160
f1      0.380  0.191  0.224  0.079  0.255  0.092  0.266  0.214
----------------------------------------------------------------------------------------------------
Test Exp5bMergerNetwork1+alexnetEmoNet^_OIToFER^ -- 0.01:
	 0	 1	 2	 3	 4	 5	 6	 7		#
 0|	49.81	14.33	3.84	2.72	3.93	2.34	5.24	17.79		1068
 1|	30.26	20.82	6.36	3.69	9.03	3.28	4.41	22.15		975
 2|	11.73	9.47	22.26	3.76	13.53	3.76	10.53	24.96		665
 3|	19.81	9.43	7.55	9.43	11.32	3.77	7.55	31.13		106
 4|	17.47	13.48	10.15	1.66	27.45	5.49	5.32	18.97		601
 5|	19.64	6.25	8.04	5.36	8.93	10.71	12.50	28.57		112
 6|	19.48	8.90	10.97	3.35	8.00	3.35	26.19	19.74		775
 7|	23.09	14.17	7.66	4.11	7.31	4.91	7.09	31.66		875


        00     01     02     03     04     05     06     07    
prec    0.498  0.208  0.223  0.094  0.275  0.107  0.262  0.317
rec     0.378  0.286  0.308  0.056  0.310  0.060  0.416  0.235
f1      0.430  0.241  0.258  0.070  0.291  0.077  0.321  0.269
====================================================================================================
====================================================================================================
2024-01-13 19:56:00.220138
Train Exp5bMergerNetwork1+alexnetEmoNet^_OIToFER^ -- 0.01:
	 0	 1	 2	 3	 4	 5	 6	 7		#
 0|	46.69	15.71	3.96	3.00	5.05	2.42	4.36	18.81		3763
 1|	31.63	21.37	6.12	3.21	7.53	3.36	5.48	21.30		2681
 2|	14.03	10.30	19.82	2.53	12.40	4.38	13.08	23.47		2331
 3|	27.45	13.63	7.33	5.91	6.49	3.83	8.83	26.54		1541
 4|	19.97	12.42	10.04	3.41	22.49	4.44	7.29	19.94		3019
 5|	22.93	13.20	8.83	3.70	12.00	6.65	8.03	24.67		2242
 6|	19.03	9.79	12.26	3.15	8.18	3.46	21.81	22.32		2921
 7|	26.98	12.22	7.89	3.78	7.47	3.37	7.38	30.90		2194


        00     01     02     03     04     05     06     07    
prec    0.467  0.214  0.198  0.059  0.225  0.066  0.218  0.309
rec     0.313  0.202  0.241  0.128  0.318  0.186  0.326  0.144
f1      0.375  0.208  0.217  0.081  0.264  0.098  0.261  0.196
----------------------------------------------------------------------------------------------------
Test Exp5bMergerNetwork1+alexnetEmoNet^_OIToFER^ -- 0.01:
	 0	 1	 2	 3	 4	 5	 6	 7		#
 0|	47.37	16.00	3.37	2.95	4.28	1.96	5.61	18.46		1425
 1|	28.85	20.55	6.32	2.37	10.28	3.36	4.15	24.11		506
 2|	12.31	11.08	22.92	3.54	10.46	4.77	11.85	23.08		650
 3|	21.62	16.76	9.19	4.86	13.51	3.24	5.95	24.86		185
 4|	16.49	12.10	9.53	3.33	29.50	4.99	4.99	19.06		661
 5|	20.41	14.80	8.67	3.06	12.24	9.69	7.14	23.98		196
 6|	16.41	10.47	11.63	3.36	8.14	3.49	25.84	20.67		774
 7|	24.23	10.90	8.33	4.87	5.77	5.00	6.67	34.23		780


        00     01     02     03     04     05     06     07    
prec    0.474  0.206  0.229  0.049  0.295  0.097  0.258  0.342
rec     0.480  0.146  0.310  0.051  0.366  0.095  0.410  0.226
f1      0.477  0.171  0.263  0.050  0.327  0.096  0.317  0.272
====================================================================================================
====================================================================================================
2024-01-13 19:57:49.384074
Train Exp5bMergerNetwork1+alexnetEmoNet^_OIToFER^ -- 0.01:
	 0	 1	 2	 3	 4	 5	 6	 7		#
 0|	45.63	15.99	3.56	3.43	4.37	2.41	5.49	19.12		3934
 1|	33.92	18.09	6.91	3.05	7.96	2.93	5.23	21.91		2488
 2|	14.12	11.19	19.32	3.02	12.61	4.20	12.01	23.53		2189
 3|	27.45	14.68	8.16	4.94	8.29	4.34	7.24	24.88		1519
 4|	18.47	13.62	10.77	3.14	22.40	4.21	7.19	20.18		3156
 5|	22.31	13.60	8.33	3.78	10.89	7.31	7.55	26.23		2066
 6|	19.96	10.13	12.22	3.27	8.33	3.63	21.89	20.58		3061
 7|	26.33	11.89	7.68	3.55	7.59	3.47	7.85	31.64		2279


        00     01     02     03     04     05     06     07    
prec    0.456  0.181  0.193  0.049  0.224  0.073  0.219  0.316
rec     0.319  0.159  0.220  0.106  0.332  0.189  0.343  0.153
f1      0.376  0.169  0.206  0.067  0.267  0.105  0.267  0.206
----------------------------------------------------------------------------------------------------
Test Exp5bMergerNetwork1+alexnetEmoNet^_OIToFER^ -- 0.01:
	 0	 1	 2	 3	 4	 5	 6	 7		#
 0|	51.37	16.11	2.84	2.95	4.53	1.68	3.37	17.16		950
 1|	33.64	21.17	5.84	3.32	9.61	3.20	6.41	16.82		874
 2|	11.07	9.07	25.95	2.90	9.62	4.54	12.89	23.96		551
 3|	16.67	16.67	8.33	2.78	11.11	8.33	13.89	22.22		36
 4|	18.26	11.76	10.93	2.77	26.97	4.98	5.12	19.23		723
 5|	16.62	13.06	7.42	3.56	11.28	10.09	8.90	29.08		337
 6|	16.71	8.63	11.59	3.91	7.82	3.23	26.28	21.83		742
 7|	25.41	12.76	6.95	4.46	6.02	3.53	6.43	34.44		964


        00     01     02     03     04     05     06     07    
prec    0.514  0.212  0.260  0.028  0.270  0.101  0.263  0.344
rec     0.347  0.261  0.297  0.006  0.366  0.170  0.400  0.281
f1      0.414  0.234  0.277  0.009  0.311  0.127  0.317  0.310
====================================================================================================
====================================================================================================
2024-01-13 19:59:08.822080
Train Exp5bMergerNetwork1+alexnetEmoNet^_OIToFER^ -- 0.01:
	 0	 1	 2	 3	 4	 5	 6	 7		#
 0|	42.92	15.95	4.53	3.59	5.46	2.95	4.62	19.98		4175
 1|	29.23	18.17	6.60	3.15	9.17	3.84	7.03	22.80		2289
 2|	16.24	11.46	18.07	3.02	12.69	4.04	12.36	22.11		2451
 3|	27.02	13.88	8.02	3.77	7.95	3.84	9.64	25.88		1484
 4|	21.21	13.63	10.11	3.27	19.56	4.50	7.32	20.39		3154
 5|	24.16	13.04	9.68	3.09	12.37	4.48	9.28	23.89		2231
 6|	21.13	10.37	11.73	3.37	8.44	3.95	19.97	21.05		2584
 7|	26.08	12.09	7.75	4.26	6.63	3.83	8.48	30.90		2324


        00     01     02     03     04     05     06     07    
prec    0.429  0.182  0.181  0.038  0.196  0.045  0.200  0.309
rec     0.319  0.147  0.231  0.079  0.289  0.125  0.264  0.152
f1      0.366  0.162  0.203  0.051  0.233  0.066  0.228  0.204
----------------------------------------------------------------------------------------------------
Test Exp5bMergerNetwork1+alexnetEmoNet^_OIToFER^ -- 0.01:
	 0	 1	 2	 3	 4	 5	 6	 7		#
 0|	48.75	18.52	3.20	2.50	3.80	1.80	3.90	17.52		999
 1|	36.76	20.88	5.29	5.00	6.76	3.82	4.71	16.76		340
 2|	11.57	9.41	21.37	1.57	13.53	4.71	14.51	23.33		510
 3|	18.64	11.86	14.41	5.08	11.02	2.54	8.47	27.97		118
 4|	18.50	11.59	12.30	3.46	22.05	3.96	6.50	21.65		984
 5|	13.33	13.33	0.00	6.67	26.67	0.00	13.33	26.67		15
 6|	16.11	9.57	13.68	4.26	8.36	3.80	26.90	17.33		658
 7|	27.24	13.72	6.05	3.80	7.34	5.02	6.83	30.01		1553


        00     01     02     03     04     05     06     07    
prec    0.487  0.209  0.214  0.051  0.221  0.000  0.269  0.300
rec     0.346  0.100  0.227  0.034  0.407  0.000  0.363  0.395
f1      0.405  0.135  0.220  0.041  0.286  0.000  0.309  0.341
====================================================================================================
====================================================================================================
2024-01-13 20:03:22.577862
Train Exp5bMergerNetwork1+alexnetEmoNet^_OIToFER^ -- 0.01:
	 0	 1	 2	 3	 4	 5	 6	 7		#
 0|	47.26	15.30	3.72	2.93	4.78	2.23	5.00	18.78		3680
 1|	30.41	22.03	5.45	3.76	8.12	2.93	5.71	21.58		2660
 2|	15.73	10.37	19.40	2.46	13.05	4.19	11.32	23.47		2314
 3|	27.35	11.87	7.98	4.50	7.98	3.55	8.80	27.97		1466
 4|	19.22	12.62	11.12	3.05	22.21	4.32	6.61	20.85		3147
 5|	22.90	13.28	8.07	4.16	10.15	7.70	8.07	25.67		2454
 6|	20.26	10.39	11.81	3.46	7.69	3.57	22.55	20.26		2887
 7|	26.63	12.14	8.78	3.89	7.25	3.02	8.01	30.28		2084


        00     01     02     03     04     05     06     07    
prec    0.473  0.220  0.194  0.045  0.222  0.077  0.225  0.303
rec     0.309  0.206  0.234  0.093  0.328  0.236  0.334  0.134
f1      0.374  0.213  0.212  0.061  0.265  0.116  0.269  0.185
----------------------------------------------------------------------------------------------------
Test Exp5bMergerNetwork1+alexnetEmoNet^_OIToFER^ -- 0.01:
	 0	 1	 2	 3	 4	 5	 6	 7		#
 0|	49.03	15.64	2.67	3.22	4.32	2.85	5.06	17.20		1087
 1|	31.37	24.54	8.49	2.03	6.83	3.32	4.98	18.45		542
 2|	10.00	8.37	23.49	2.09	14.88	3.49	11.63	26.05		430
 3|	27.27	14.72	6.28	7.36	5.84	3.25	8.66	26.62		462
 4|	18.17	11.72	10.55	3.52	26.14	5.63	4.81	19.46		853
 5|	20.63	11.66	10.31	3.14	11.66	8.97	6.28	27.35		223
 6|	16.26	10.37	12.68	3.33	6.53	3.46	25.99	21.38		781
 7|	25.78	12.02	8.01	3.25	7.26	3.25	7.26	33.17		799


        00     01     02     03     04     05     06     07    
prec    0.490  0.245  0.235  0.074  0.261  0.090  0.260  0.332
rec     0.379  0.187  0.210  0.191  0.418  0.100  0.416  0.224
f1      0.428  0.212  0.222  0.106  0.322  0.095  0.320  0.268
====================================================================================================
====================================================================================================
2024-01-13 20:05:13.691621
Train Exp5bMergerNetwork1+alexnetEmoNet^_OIToFER^ -- 0.01:
	 0	 1	 2	 3	 4	 5	 6	 7		#
 0|	47.28	15.16	4.26	2.90	4.71	2.58	4.87	18.24		3799
 1|	33.20	20.21	6.16	3.30	8.36	3.10	4.95	20.72		2548
 2|	15.21	11.34	18.53	2.65	12.02	4.37	11.34	24.54		2380
 3|	26.59	13.26	6.14	5.51	8.16	3.56	8.30	28.47		1433
 4|	17.78	12.67	11.25	3.04	24.05	4.56	7.18	19.49		3094
 5|	23.39	13.07	9.81	4.36	9.26	6.86	7.61	25.64		1997
 6|	18.11	10.47	11.65	3.64	8.10	3.54	22.90	21.59		3048
 7|	27.83	13.21	7.23	3.43	6.73	3.43	7.48	30.67		2393


        00     01     02     03     04     05     06     07    
prec    0.473  0.202  0.185  0.055  0.240  0.069  0.229  0.307
rec     0.320  0.181  0.230  0.111  0.349  0.171  0.358  0.156
f1      0.381  0.191  0.205  0.074  0.285  0.098  0.279  0.206
----------------------------------------------------------------------------------------------------
Test Exp5bMergerNetwork1+alexnetEmoNet^_OIToFER^ -- 0.01:
	 0	 1	 2	 3	 4	 5	 6	 7		#
 0|	48.76	15.24	3.81	3.42	4.82	2.26	3.97	17.73		1286
 1|	31.77	21.18	5.70	3.87	10.79	2.24	3.87	20.57		491
 2|	9.07	8.22	25.78	1.98	12.46	3.68	9.63	29.18		353
 3|	24.73	17.20	10.75	4.30	5.38	2.15	7.53	27.96		93
 4|	16.79	14.23	10.34	3.48	23.54	4.30	7.68	19.65		977
 5|	15.62	13.84	7.59	4.46	8.48	10.27	9.82	29.91		224
 6|	19.54	9.14	12.69	2.97	6.97	4.46	24.34	19.89		875
 7|	22.55	13.10	8.43	3.87	6.72	4.67	7.63	33.03		878


        00     01     02     03     04     05     06     07    
prec    0.488  0.212  0.258  0.043  0.235  0.103  0.243  0.330
rec     0.446  0.146  0.189  0.022  0.432  0.115  0.436  0.246
f1      0.466  0.173  0.218  0.030  0.305  0.108  0.313  0.282
====================================================================================================
====================================================================================================
2024-01-13 20:08:12.338354
Train Exp5bMergerNetwork1+alexnetEmoNet^_OIToFER^ -- 0.01:
	 0	 1	 2	 3	 4	 5	 6	 7		#
 0|	48.04	14.95	3.93	3.27	5.62	2.37	4.17	17.65		3666
 1|	32.59	20.59	6.20	2.84	7.68	2.88	5.88	21.35		2501
 2|	15.92	10.93	19.09	2.60	12.54	3.96	10.60	24.37		2425
 3|	28.37	12.60	6.56	5.61	7.68	4.82	8.79	25.57		1889
 4|	18.42	13.14	10.19	2.99	24.06	4.25	6.97	19.98		3013
 5|	21.84	13.70	9.36	3.80	10.92	6.58	7.26	26.52		2051
 6|	19.47	10.29	11.99	3.36	7.09	3.66	22.97	21.17		3061
 7|	25.07	13.47	8.05	3.79	5.70	3.79	7.96	32.17		2086


        00     01     02     03     04     05     06     07    
prec    0.480  0.206  0.191  0.056  0.241  0.066  0.230  0.322
rec     0.313  0.181  0.241  0.149  0.340  0.169  0.360  0.142
f1      0.379  0.193  0.213  0.082  0.282  0.095  0.281  0.197
----------------------------------------------------------------------------------------------------
Test Exp5bMergerNetwork1+alexnetEmoNet^_OIToFER^ -- 0.01:
	 0	 1	 2	 3	 4	 5	 6	 7		#
 0|	53.68	14.29	2.12	2.90	3.79	2.12	3.35	17.75		896
 1|	34.30	22.28	5.57	3.54	6.71	1.90	4.68	21.01		790
 2|	11.64	10.04	21.69	2.91	12.66	3.78	13.68	23.58		687
 3|	29.63	14.81	7.41	5.93	2.96	1.48	7.41	30.37		135
 4|	16.69	13.69	10.95	3.52	25.55	5.08	6.65	17.86		767
 5|	20.33	10.17	8.51	4.96	10.64	10.64	6.86	27.90		423
 6|	16.36	9.67	12.83	2.79	7.62	2.97	31.04	16.73		538
 7|	24.65	12.43	7.44	3.51	7.76	4.04	7.44	32.73		941


        00     01     02     03     04     05     06     07    
prec    0.537  0.223  0.217  0.059  0.256  0.106  0.310  0.327
rec     0.342  0.248  0.310  0.045  0.368  0.225  0.342  0.261
f1      0.418  0.235  0.255  0.051  0.302  0.144  0.326  0.290
====================================================================================================
====================================================================================================
2024-01-13 20:10:51.688203
Train Exp5bMergerNetwork1+alexnetEmoNet^_OIToFER^ -- 0.01:
	 0	 1	 2	 3	 4	 5	 6	 7		#
 0|	46.64	15.26	3.73	3.08	4.67	2.16	5.01	19.46		3834
 1|	30.26	20.75	6.45	2.87	7.96	3.36	5.89	22.45		2650
 2|	15.31	11.46	19.82	2.57	12.48	3.94	11.59	22.83		2260
 3|	27.47	12.80	6.62	6.18	7.80	4.12	8.74	26.28		1602
 4|	19.66	13.70	10.66	3.45	23.04	4.33	7.21	17.96		3190
 5|	22.60	13.23	8.99	3.30	10.45	7.82	7.39	26.22		2124
 6|	18.59	9.52	12.56	3.18	7.79	3.59	22.38	22.38		2953
 7|	28.28	11.59	7.22	4.09	7.12	3.03	7.36	31.31		2079


        00     01     02     03     04     05     06     07    
prec    0.466  0.208  0.198  0.062  0.230  0.078  0.224  0.313
rec     0.318  0.194  0.233  0.139  0.345  0.207  0.339  0.138
f1      0.378  0.200  0.214  0.086  0.276  0.114  0.270  0.191
----------------------------------------------------------------------------------------------------
Test Exp5bMergerNetwork1+alexnetEmoNet^_OIToFER^ -- 0.01:
	 0	 1	 2	 3	 4	 5	 6	 7		#
 0|	49.21	16.74	2.74	2.96	4.04	2.38	4.33	17.60		1386
 1|	31.04	21.06	5.54	2.88	7.32	3.55	5.54	23.06		451
 2|	13.20	10.65	22.73	2.70	12.88	3.50	10.81	23.53		629
 3|	13.89	8.33	13.89	11.11	5.56	5.56	11.11	30.56		36
 4|	15.36	12.58	10.07	2.52	27.95	5.83	5.70	20.00		755
 5|	19.01	14.23	9.30	4.37	10.85	6.62	9.58	26.06		710
 6|	17.55	8.08	13.51	4.04	6.55	3.34	26.18	20.75		718
 7|	24.19	11.99	6.30	4.88	5.28	2.44	6.50	38.41		492


        00     01     02     03     04     05     06     07    
prec    0.492  0.211  0.227  0.111  0.279  0.066  0.262  0.384
rec     0.485  0.134  0.297  0.022  0.396  0.235  0.385  0.160
f1      0.489  0.164  0.258  0.037  0.328  0.103  0.312  0.226
====================================================================================================
====================================================================================================
2024-01-13 20:13:21.716056
Train Exp5bMergerNetwork1+alexnetEmoNet^_OIToFER^ -- 0.01:
	 0	 1	 2	 3	 4	 5	 6	 7		#
 0|	46.76	15.14	4.38	3.32	4.95	2.51	4.51	18.43		3858
 1|	31.74	21.33	5.73	2.90	8.22	2.70	5.44	21.95		2410
 2|	14.39	11.24	20.04	3.06	12.75	3.86	10.77	23.89		2126
 3|	28.68	12.88	7.26	5.46	6.92	4.05	7.87	26.88		1778
 4|	18.22	13.38	10.84	3.10	22.66	4.63	7.48	19.68		3221
 5|	23.38	13.62	7.68	3.43	10.19	6.71	8.36	26.62		2070
 6|	19.62	9.84	12.50	3.09	8.06	3.63	23.65	19.62		2977
 7|	25.75	11.86	7.90	3.86	7.46	3.91	7.06	32.19		2252


        00     01     02     03     04     05     06     07    
prec    0.468  0.213  0.200  0.055  0.227  0.067  0.236  0.322
rec     0.321  0.181  0.222  0.137  0.342  0.174  0.361  0.154
f1      0.381  0.196  0.211  0.078  0.273  0.097  0.286  0.208
----------------------------------------------------------------------------------------------------
Test Exp5bMergerNetwork1+alexnetEmoNet^_OIToFER^ -- 0.01:
	 0	 1	 2	 3	 4	 5	 6	 7		#
 0|	46.68	17.06	3.10	3.10	4.73	2.44	4.36	18.54		1354
 1|	31.59	18.49	6.63	3.70	8.94	3.85	6.01	20.80		649
 2|	14.26	10.15	18.77	3.59	14.56	4.00	12.82	21.85		975
 3|	23.08	12.50	5.77	8.65	8.65	0.96	6.73	33.65		104
 4|	18.76	10.52	11.13	2.89	28.04	4.54	3.92	20.21		485
 5|	17.91	16.98	7.48	3.27	12.93	7.48	7.79	26.17		642
 6|	20.07	8.46	12.94	2.99	4.64	2.32	27.03	21.56		603
 7|	21.64	9.86	7.40	4.11	3.56	4.93	7.12	41.37		365


        00     01     02     03     04     05     06     07    
prec    0.467  0.185  0.188  0.087  0.280  0.075  0.270  0.414
rec     0.450  0.169  0.380  0.051  0.255  0.240  0.334  0.128
f1      0.458  0.177  0.251  0.064  0.267  0.114  0.299  0.195
====================================================================================================
====================================================================================================
2024-01-13 20:16:21.656394
Train Exp5bMergerNetwork1+alexnetEmoNet^_OIToFER^ -- 0.01:
	 0	 1	 2	 3	 4	 5	 6	 7		#
 0|	46.95	15.27	3.39	3.28	5.27	2.12	5.09	18.63		3870
 1|	32.34	21.29	6.18	3.31	7.81	2.71	4.74	21.61		2508
 2|	14.02	11.50	20.53	2.18	12.97	4.32	11.71	22.75		2382
 3|	26.72	11.92	7.82	5.79	7.03	4.05	8.49	28.18		1778
 4|	18.76	13.23	9.92	3.34	23.14	4.69	7.09	19.84		2964
 5|	23.35	13.00	9.21	3.65	10.39	7.83	8.18	24.38		2030
 6|	20.80	9.19	11.44	3.36	8.34	3.68	22.33	20.86		3068
 7|	24.62	13.86	8.32	3.30	6.93	3.06	6.88	33.03		2092


        00     01     02     03     04     05     06     07    
prec    0.470  0.213  0.205  0.058  0.231  0.078  0.223  0.330
rec     0.323  0.188  0.255  0.145  0.322  0.199  0.351  0.146
f1      0.383  0.200  0.227  0.083  0.269  0.112  0.273  0.203
----------------------------------------------------------------------------------------------------
Test Exp5bMergerNetwork1+alexnetEmoNet^_OIToFER^ -- 0.01:
	 0	 1	 2	 3	 4	 5	 6	 7		#
 0|	54.56	12.64	3.36	3.20	3.68	2.24	2.88	17.44		625
 1|	32.86	17.82	4.82	2.99	8.54	4.35	6.03	22.59		1908
 2|	10.88	9.65	24.44	2.46	11.29	2.67	16.02	22.59		487
 3|	32.73	16.36	3.64	10.91	7.27	3.64	1.82	23.64		55
 4|	14.88	11.07	11.74	3.14	28.60	4.46	6.94	19.17		605
 5|	15.04	12.41	12.17	3.82	13.60	7.40	9.07	26.49		419
 6|	15.90	10.40	13.52	3.86	5.50	3.12	26.30	21.40		673
 7|	26.42	11.36	8.40	5.43	5.19	2.22	4.69	36.30		405


        00     01     02     03     04     05     06     07    
prec    0.546  0.178  0.244  0.109  0.286  0.074  0.263  0.363
rec     0.243  0.479  0.247  0.034  0.325  0.155  0.363  0.124
f1      0.336  0.260  0.246  0.052  0.304  0.100  0.305  0.185
====================================================================================================
====================================================================================================
2024-01-13 20:18:11.161156
Train Exp5bMergerNetwork1+alexnetEmoNet^_OIToFER^ -- 0.001:
	 0	 1	 2	 3	 4	 5	 6	 7		#
 0|	45.09	15.77	4.03	3.10	5.35	2.61	4.88	19.18		4489
 1|	29.84	19.66	6.85	4.03	8.46	3.50	6.00	21.66		2802
 2|	15.88	11.09	19.17	2.93	12.02	3.86	11.45	23.60		2254
 3|	23.73	12.62	10.03	4.96	11.33	5.29	8.41	23.62		927
 4|	19.27	13.41	10.91	3.16	21.39	4.87	7.31	19.68		3161
 5|	19.12	13.34	8.93	3.61	13.68	6.53	9.04	25.76		1747
 6|	20.34	9.38	11.71	3.05	7.36	3.29	22.32	22.56		2921
 7|	26.98	11.79	7.49	3.93	6.23	3.55	7.82	32.20		2391


        00     01     02     03     04     05     06     07    
prec    0.451  0.197  0.192  0.050  0.214  0.065  0.223  0.322
rec     0.360  0.194  0.225  0.065  0.317  0.142  0.334  0.163
f1      0.400  0.195  0.207  0.056  0.255  0.090  0.268  0.217
----------------------------------------------------------------------------------------------------
Test Exp5bMergerNetwork1+alexnetEmoNet^_OIToFER^ -- 0.001:
	 0	 1	 2	 3	 4	 5	 6	 7		#
 0|	48.95	16.05	3.16	3.51	4.74	1.58	3.86	18.16		1140
 1|	30.63	20.50	5.72	3.34	8.58	3.10	6.44	21.69		839
 2|	13.31	11.53	21.43	2.27	13.47	4.38	8.44	25.16		616
 3|	26.14	15.91	5.68	1.14	6.82	5.68	9.09	29.55		88
 4|	14.50	11.47	11.64	3.20	24.96	5.23	7.59	21.42		593
 5|	18.42	9.02	9.77	3.76	16.92	7.52	9.77	24.81		266
 6|	18.04	10.01	12.11	4.07	7.68	3.49	24.10	20.49		859
 7|	25.26	11.86	7.86	3.99	7.60	5.54	6.70	31.19		776


        00     01     02     03     04     05     06     07    
prec    0.489  0.205  0.214  0.011  0.250  0.075  0.241  0.312
rec     0.397  0.242  0.274  0.006  0.278  0.100  0.424  0.205
f1      0.438  0.222  0.241  0.008  0.263  0.086  0.307  0.247
====================================================================================================
====================================================================================================
2024-01-13 20:20:40.405641
Train Exp5bMergerNetwork1+alexnetEmoNet^_OIToFER^ -- 0.001:
	 0	 1	 2	 3	 4	 5	 6	 7		#
 0|	45.73	16.14	3.74	3.21	4.78	2.54	4.29	19.57		4522
 1|	30.79	17.94	6.94	3.65	9.03	3.57	6.12	21.96		2436
 2|	15.19	11.56	18.83	3.01	11.89	4.05	12.72	22.75		2422
 3|	25.74	12.87	8.85	5.31	8.74	3.19	11.10	24.20		847
 4|	18.95	13.19	11.44	3.18	21.79	4.58	6.95	19.92		3208
 5|	20.78	13.21	8.44	2.79	12.05	6.87	8.32	27.53		1718
 6|	19.77	10.56	11.29	3.90	8.48	4.03	20.76	21.21		3126
