%!PS-Adobe-3.0 EPSF-3.0
%%Creator: cairo 1.15.10 (http://cairographics.org)
%%CreationDate: Wed Oct 16 17:45:42 2019
%%Pages: 1
%%DocumentData: Clean7Bit
%%LanguageLevel: 2
%%BoundingBox: 0 0 300 300
%%EndComments
%%BeginProlog
50 dict begin
/q { gsave } bind def
/Q { grestore } bind def
/cm { 6 array astore concat } bind def
/w { setlinewidth } bind def
/J { setlinecap } bind def
/j { setlinejoin } bind def
/M { setmiterlimit } bind def
/d { setdash } bind def
/m { moveto } bind def
/l { lineto } bind def
/c { curveto } bind def
/h { closepath } bind def
/re { exch dup neg 3 1 roll 5 3 roll moveto 0 rlineto
      0 exch rlineto 0 rlineto closepath } bind def
/S { stroke } bind def
/f { fill } bind def
/f* { eofill } bind def
/n { newpath } bind def
/W { clip } bind def
/W* { eoclip } bind def
/BT { } bind def
/ET { } bind def
/BDC { mark 3 1 roll /BDC pdfmark } bind def
/EMC { mark /EMC pdfmark } bind def
/cairo_store_point { /cairo_point_y exch def /cairo_point_x exch def } def
/Tj { show currentpoint cairo_store_point } bind def
/TJ {
  {
    dup
    type /stringtype eq
    { show } { -0.001 mul 0 cairo_font_matrix dtransform rmoveto } ifelse
  } forall
  currentpoint cairo_store_point
} bind def
/cairo_selectfont { cairo_font_matrix aload pop pop pop 0 0 6 array astore
    cairo_font exch selectfont cairo_point_x cairo_point_y moveto } bind def
/Tf { pop /cairo_font exch def /cairo_font_matrix where
      { pop cairo_selectfont } if } bind def
/Td { matrix translate cairo_font_matrix matrix concatmatrix dup
      /cairo_font_matrix exch def dup 4 get exch 5 get cairo_store_point
      /cairo_font where { pop cairo_selectfont } if } bind def
/Tm { 2 copy 8 2 roll 6 array astore /cairo_font_matrix exch def
      cairo_store_point /cairo_font where { pop cairo_selectfont } if } bind def
/g { setgray } bind def
/rg { setrgbcolor } bind def
/d1 { setcachedevice } bind def
/cairo_data_source {
  CairoDataIndex CairoData length lt
    { CairoData CairoDataIndex get /CairoDataIndex CairoDataIndex 1 add def }
    { () } ifelse
} def
/cairo_flush_ascii85_file { cairo_ascii85_file status { cairo_ascii85_file flushfile } if } def
/cairo_image { image cairo_flush_ascii85_file } def
/cairo_imagemask { imagemask cairo_flush_ascii85_file } def
%%EndProlog
%%BeginSetup
%%EndSetup
%%Page: 1 1
%%BeginPageSetup
%%PageBoundingBox: 0 0 300 300
%%EndPageSetup
q 0 0 300 300 rectclip
1 0 0 -1 0 300 cm q
0.94902 g
0 0 300 300 rectfill
0.0705882 0.235294 0.458824 rg
148.938 34.02 m 141.285 34.633 132.574 39.664 123.859 44.695 c 123.859 
44.695 97.719 59.785 97.719 59.785 c 97.719 59.785 71.578 74.879 71.578 
74.879 c 62.863 79.91 54.152 84.941 49.797 92.488 c 45.438 100.035 45.438
 110.094 45.438 120.156 c 45.438 120.156 45.438 150.34 45.438 150.34 c 45.438
 150.34 45.438 180.523 45.438 180.523 c 45.438 190.586 45.438 200.648 49.797
 208.195 c 54.152 215.742 62.863 220.77 71.578 225.801 c 71.578 225.801 
97.719 240.895 97.719 240.895 c 97.719 240.895 123.859 255.984 123.859 255.984
 c 132.574 261.016 141.289 266.047 150 266.047 c 158.715 266.047 167.426
 261.016 176.141 255.984 c 176.141 255.984 202.281 240.895 202.281 240.895
 c 202.281 240.895 228.422 225.801 228.422 225.801 c 237.137 220.77 245.848
 215.738 250.207 209.422 c 254.562 203.109 254.562 195.504 254.562 187.902
 c 254.562 187.902 254.562 165.098 254.562 165.098 c 254.562 165.098 254.562
 142.289 254.562 142.289 c 254.562 134.688 254.562 127.086 253.422 123.945
 c 252.281 120.801 249.996 122.121 247.715 123.438 c 247.715 123.438 240.867
 127.391 240.867 127.391 c 240.867 127.391 234.023 131.344 234.023 131.344
 c 231.742 132.66 229.457 133.977 228.316 137.121 c 227.176 140.262 227.176
 145.23 227.176 150.195 c 227.176 150.195 227.176 165.098 227.176 165.098
 c 227.176 165.098 227.176 179.996 227.176 179.996 c 227.176 184.965 227.176
 189.934 223.961 194.27 c 220.746 198.609 214.312 202.324 207.883 206.039
 c 207.883 206.039 188.59 217.176 188.59 217.176 c 188.59 217.176 169.293
 228.316 169.293 228.316 c 162.863 232.031 156.434 235.742 150 235.742 c
 143.57 235.742 137.137 232.031 130.707 228.316 c 130.707 228.316 111.41
 217.176 111.41 217.176 c 111.41 217.176 92.117 206.039 92.117 206.039 c
 85.688 202.324 79.258 198.613 76.039 193.043 c 72.824 187.473 72.824 180.047
 72.824 172.617 c 72.824 172.617 72.824 150.34 72.824 150.34 c 72.824 150.34
 72.824 128.062 72.824 128.062 c 72.824 120.637 72.824 113.211 76.039 107.641
 c 79.254 102.07 85.688 98.355 92.117 94.645 c 92.117 94.645 111.41 83.504
 111.41 83.504 c 111.41 83.504 130.707 72.363 130.707 72.363 c 137.137 68.648
 143.57 64.938 148.938 64.324 c 154.301 63.707 158.602 66.191 162.902 68.676
 c 162.902 68.676 175.809 76.125 175.809 76.125 c 175.809 76.125 188.711
 83.574 188.711 83.574 c 193.016 86.059 197.316 88.543 198.18 90.527 c 199.047
 92.508 196.477 93.992 193.906 95.477 c 193.906 95.477 186.195 99.93 186.195
 99.93 c 186.195 99.93 178.484 104.379 178.484 104.379 c 175.918 105.863
 173.348 107.348 171.238 107.734 c 169.129 108.117 167.469 107.402 165.789
 106.789 c 164.109 106.172 162.391 105.656 160.652 105.242 c 158.914 104.828
 157.148 104.512 155.371 104.301 c 153.594 104.086 151.797 103.977 147.816
 104.547 c 143.836 105.113 137.711 106.352 132.355 108.59 c 127 110.832 
121.98 114.219 117.93 118.27 c 113.875 122.32 110.492 127.34 108.25 132.695
 c 106.008 138.051 104.773 144.176 104.773 150.34 c 104.773 156.508 106.008
 162.633 108.25 167.988 c 110.492 173.344 113.875 178.363 117.93 182.414
 c 121.98 186.465 127 189.848 132.355 192.09 c 137.711 194.332 143.836 195.566
 150 195.566 c 156.164 195.566 162.289 194.332 167.645 192.09 c 173 189.848
 178.02 186.465 182.07 182.414 c 186.125 178.363 189.508 173.344 191.75 
167.988 c 193.992 162.633 195.227 156.508 195.781 152.41 c 196.332 148.312
 196.195 146.281 195.926 144.285 c 195.66 142.285 195.258 140.301 194.734
 138.359 c 194.207 136.418 193.555 134.5 192.777 132.641 c 192.004 130.777
 191.098 128.953 192.188 127.152 c 193.277 125.355 196.359 123.574 199.441
 121.797 c 199.441 121.797 208.688 116.457 208.688 116.457 c 208.688 116.457
 217.93 111.121 217.93 111.121 c 217.93 111.121 227.176 105.781 227.176 
105.781 c 227.176 105.781 234.023 101.828 234.023 101.828 c 234.023 101.828
 240.867 97.875 240.867 97.875 c 240.867 97.875 247.715 93.926 247.715 93.926
 c 249.996 92.605 252.281 91.289 252.355 90.016 c 252.434 88.742 250.301
 87.512 248.172 86.281 c 248.172 86.281 241.781 82.594 241.781 82.594 c 
241.781 82.594 235.391 78.902 235.391 78.902 c 235.391 78.902 229.004 75.215
 229.004 75.215 c 229.004 75.215 209.25 63.812 209.25 63.812 c 209.25 63.812
 189.5 52.41 189.5 52.41 c 189.5 52.41 169.75 41.004 169.75 41.004 c 163.168
 37.203 156.586 33.406 148.938 34.02 c h
143.758 126.773 m 145.453 126.773 147.141 127.113 148.613 127.73 c 150.086
 128.348 151.465 129.277 152.578 130.391 c 153.691 131.504 154.625 132.887
 155.238 134.359 c 155.855 135.832 156.195 137.516 156.195 139.211 c 156.195
 140.906 155.855 142.59 155.238 144.062 c 154.625 145.535 153.691 146.918
 152.578 148.031 c 151.465 149.145 150.086 150.074 148.613 150.691 c 147.141
 151.309 145.453 151.648 143.758 151.648 c 142.062 151.648 140.379 151.309
 138.906 150.691 c 137.434 150.074 136.055 149.145 134.938 148.031 c 133.824
 146.918 132.895 145.535 132.277 144.062 c 131.66 142.59 131.32 140.906 
131.32 139.211 c 131.32 137.516 131.66 135.832 132.277 134.359 c 132.895
 132.887 133.824 131.504 134.938 130.391 c 136.055 129.277 137.434 128.348
 138.906 127.73 c 140.379 127.113 142.062 126.773 143.758 126.773 c h
143.758 126.773 m f*
Q Q
showpage
%%Trailer
end
%%EOF
