                       eeee                       
                    eeeeeeeeee                    
                eeeeeeeeeeeeeeeeee                
             eeeeeeeeeeeeeeeeeeeeeeee             
         eeeeeeeeeeee        eeeeeeeeeeee         
      eeeeeeeeeeee              eeeeeeeeeeee      
   eeeeeeeeeee                      eeeeeeeeeeee  
 eeeeeeeeee                         eeeeeeeeeee   
eeeeeeee                         eeeeeeeeeee      
eeeeeee             eeeeeeeeeeeeeeeeeeee          
eeeeee           eeeeeeeeeeeeeeeeeeee             
eeeeee          eeeee     eeeeeeeee           eeee
eeeeee         eeeee       eeeeeeee         eeeeee
eeeeee        eeeeeee     eeeeeeeeee        eeeeee
eeeeee        eeeeeeeeeeeeeeeeeeeeee        eeeeee
eeeeee         eeeeeeeeeeeeeeeeeeee         eeeeee
eeeeee          eeeeeeeeeeeeeeeeee          eeeeee
eeeeee           eeeeeeeeeeeeeeee           eeeeee
eeeeeee             eeeeeeeeee             eeeeeee
eeeeeeee                                  eeeeeeee
 eeeeeeeeee                            eeeeeeeeee 
   eeeeeeeeeee                      eeeeeeeeeee   
      eeeeeeeeeeee              eeeeeeeeeeee      
         eeeeeeeeeeee       eeeeeeeeeeeee         
             eeeeeeeeeeeeeeeeeeeeeeee             
                eeeeeeeeeeeeeeeeee                
                    eeeeeeeeee                    
                       eeee                       
