[37m [0m[37m [0m[37m [0m[37m [0m[37m [0m[37m [0m[37m [0m[37m [0m[37m [0m[37m [0m[37m [0m[37m [0m[37m [0m[37m [0m[37m [0m[37m [0m[37m [0m[37m [0m[37m [0m[37m [0m [37m [0m[34m [0m[34me[0m[34me[0m[34me[0m[34me[0m[34m [0m[37m [0m [37m [0m[37m [0m[37m [0m[37m [0m[37m [0m[37m [0m[37m [0m[37m [0m[37m [0m[37m [0m[37m [0m[37m [0m[37m [0m[37m [0m[37m [0m[37m [0m[37m [0m[37m [0m[37m [0m[37m [0m
[37m [0m[37m [0m[37m [0m[37m [0m[37m [0m[37m [0m[37m [0m[37m [0m[37m [0m[37m [0m[37m [0m[37m [0m[37m [0m[37m [0m[37m [0m  [37m [0m[37m [0m[34m [0m[34me[0m[34me[0m[34me[0m[34me[0m[34me[0m[34me[0m[34me[0m[34me[0m[34me[0m[34me[0m[34m [0m[37m [0m[37m [0m   [37m [0m[37m [0m[37m [0m[37m [0m[37m [0m[37m [0m[37m [0m[37m [0m[37m [0m[37m [0m[37m [0m[37m [0m[37m [0m[37m [0m
[37m [0m[37m [0m[37m [0m[37m [0m[37m [0m[37m [0m[37m [0m[37m [0m[37m [0m[37m [0m[37m [0m   [37m [0m[37m [0m[34me[0m[34me[0m[34me[0m[34me[0m[34me[0m[34me[0m[34me[0m[34me[0m[34me[0m[34me[0m[34me[0m[34me[0m[34me[0m[34me[0m[34me[0m[34me[0m[34me[0m[34me[0m[37m [0m[37m [0m [37m [0m[37m [0m[37m [0m[37m [0m[37m [0m[37m [0m[37m [0m[37m [0m[37m [0m[37m [0m[37m [0m[37m [0m[37m [0m
[37m [0m[37m [0m[37m [0m[37m [0m[37m [0m[37m [0m[37m [0m[37m [0m[37m [0m[37m [0m[37m [0m[37m [0m[34m [0m[34me[0m[34me[0m[34me[0m[34me[0m[34me[0m[34me[0m[34me[0m[34me[0m[34me[0m[34me[0m[34me[0m[34me[0m[34me[0m[34me[0m[34me[0m[34me[0m[34me[0m[34me[0m[34me[0m[34me[0m[34me[0m[34me[0m[34me[0m[34me[0m[34m [0m[37m [0m[37m [0m[37m [0m[37m [0m[37m [0m[37m [0m[37m [0m[37m [0m[37m [0m[37m [0m[37m [0m[37m [0m
[37m [0m[37m [0m[37m [0m[37m [0m  [37m [0m[37m [0m[37m [0m[34me[0m[34me[0m[34me[0m[34me[0m[34me[0m[34me[0m[34me[0m[34me[0m[34me[0m[34me[0m[34me[0m[34me[0m[34m [0m[37m [0m[37m [0m[37m [0m[37m [0m[37m [0m[37m [0m[34m [0m[34me[0m[34me[0m[34me[0m[34me[0m[34me[0m[34me[0m[34me[0m[34me[0m[34me[0m[34me[0m[34me[0m[34me[0m[37m [0m[37m [0m[37m [0m [37m [0m[37m [0m[37m [0m[37m [0m[37m [0m
[37m [0m[37m [0m [37m [0m[37m [0m[34m [0m[34me[0m[34me[0m[34me[0m[34me[0m[34me[0m[34me[0m[34me[0m[34me[0m[34me[0m[34me[0m[34me[0m[34me[0m[37m [0m[37m [0m[37m [0m [37m [0m[37m [0m[37m [0m[37m [0m[37m [0m[37m [0m [37m [0m[37m [0m[34m [0m[34me[0m[34me[0m[34me[0m[34me[0m[34me[0m[34me[0m[34me[0m[34me[0m[34me[0m[34me[0m[34me[0m[34me[0m[34m [0m[37m [0m[37m [0m [37m [0m[37m [0m
 [37m [0m[34m [0m[34me[0m[34me[0m[34me[0m[34me[0m[34me[0m[34me[0m[34me[0m[34me[0m[34me[0m[34me[0m[34me[0m[34m [0m[37m [0m[37m [0m   [37m [0m[37m [0m[37m [0m[37m [0m[37m [0m[37m [0m[37m [0m[37m [0m[37m [0m[37m [0m[37m [0m  [37m [0m[37m [0m[34m [0m[34me[0m[34me[0m[34me[0m[34me[0m[34me[0m[34me[0m[34me[0m[34me[0m[34me[0m[34me[0m[34me[0m[34me[0m[37m [0m[37m [0m
[37m [0m[34me[0m[34me[0m[34me[0m[34me[0m[34me[0m[34me[0m[34me[0m[34me[0m[34me[0m[34me[0m[37m [0m[37m [0m[37m [0m[37m [0m[37m [0m[37m [0m[37m [0m[37m [0m[37m [0m[37m [0m[37m [0m[37m [0m[37m [0m[37m [0m[37m [0m[37m [0m[37m [0m[37m [0m[37m [0m[37m [0m[37m [0m [37m [0m[37m [0m[37m [0m[34me[0m[34me[0m[34me[0m[34me[0m[34me[0m[34me[0m[34me[0m[34me[0m[34me[0m[34me[0m[34me[0m[34m [0m[37m [0m[37m [0m
[34me[0m[34me[0m[34me[0m[34me[0m[34me[0m[34me[0m[34me[0m[34me[0m[37m [0m[37m [0m  [37m [0m[37m [0m[37m [0m[37m [0m[37m [0m[37m [0m[37m [0m[37m [0m [37m [0m[37m [0m[37m [0m[37m [0m[37m [0m[37m [0m[37m [0m[37m [0m[37m [0m[37m [0m[37m [0m[34m [0m[34me[0m[34me[0m[34me[0m[34me[0m[34me[0m[34me[0m[34me[0m[34me[0m[34me[0m[34me[0m[34me[0m[37m [0m[37m [0m[37m [0m [37m [0m[37m [0m
[34me[0m[34me[0m[34me[0m[34me[0m[34me[0m[34me[0m[34me[0m[37m [0m [37m [0m[37m [0m[37m [0m[37m [0m[37m [0m[37m [0m[37m [0m [37m [0m[37m [0m[34m [0m[34me[0m[34me[0m[34me[0m[34me[0m[34me[0m[34me[0m[34me[0m[34me[0m[34me[0m[34me[0m[34me[0m[34me[0m[34me[0m[34me[0m[34me[0m[34me[0m[34me[0m[34me[0m[34me[0m[34me[0m[34m [0m[37m [0m[37m [0m[37m [0m[37m [0m [37m [0m[37m [0m[37m [0m[37m [0m
[34me[0m[34me[0m[34me[0m[34me[0m[34me[0m[34me[0m[34m [0m [37m [0m[37m [0m[37m [0m[37m [0m[37m [0m[37m [0m  [37m [0m[34me[0m[34me[0m[34me[0m[34me[0m[34me[0m[34me[0m[34me[0m[34me[0m[34me[0m[34me[0m[34me[0m[34me[0m[34me[0m[34me[0m[34me[0m[34me[0m[34me[0m[34me[0m[34me[0m[34me[0m[37m [0m[37m [0m [37m [0m[37m [0m[37m [0m[37m [0m[37m [0m  [37m [0m[37m [0m[37m [0m
[34me[0m[34me[0m[34me[0m[34me[0m[34me[0m[34me[0m[34m [0m [37m [0m[37m [0m[37m [0m[37m [0m[37m [0m [37m [0m[34m [0m[34me[0m[34me[0m[34me[0m[34me[0m[34me[0m[34m [0m[37m [0m[37m [0m[37m [0m[34m [0m[34me[0m[34me[0m[34me[0m[34me[0m[34me[0m[34me[0m[34me[0m[34me[0m[34me[0m[37m [0m   [37m [0m[37m [0m[37m [0m  [37m [0m[37m [0m[34me[0m[34me[0m[34me[0m[34me[0m
[34me[0m[34me[0m[34me[0m[34me[0m[34me[0m[34me[0m[34m [0m [37m [0m[37m [0m[37m [0m[37m [0m[37m [0m [34m [0m[34me[0m[34me[0m[34me[0m[34me[0m[34me[0m[34m [0m  [37m [0m[37m [0m [34m [0m[34me[0m[34me[0m[34me[0m[34me[0m[34me[0m[34me[0m[34me[0m[34me[0m[34m [0m [37m [0m[37m [0m[37m [0m[37m [0m[37m [0m [37m [0m[34me[0m[34me[0m[34me[0m[34me[0m[34me[0m[34me[0m
[34me[0m[34me[0m[34me[0m[34me[0m[34me[0m[34me[0m[34m [0m [37m [0m[37m [0m[37m [0m[37m [0m[37m [0m[37m [0m[34me[0m[34me[0m[34me[0m[34me[0m[34me[0m[34me[0m[34me[0m[37m [0m  [37m [0m[37m [0m[34me[0m[34me[0m[34me[0m[34me[0m[34me[0m[34me[0m[34me[0m[34me[0m[34me[0m[34me[0m[37m [0m[37m [0m[37m [0m[37m [0m[37m [0m[37m [0m[37m [0m[34m [0m[34me[0m[34me[0m[34me[0m[34me[0m[34me[0m[34me[0m
[34me[0m[34me[0m[34me[0m[34me[0m[34me[0m[34me[0m[34m [0m [37m [0m[37m [0m[37m [0m[37m [0m[37m [0m [34me[0m[34me[0m[34me[0m[34me[0m[34me[0m[34me[0m[34me[0m[34me[0m[34me[0m[34me[0m[34me[0m[34me[0m[34me[0m[34me[0m[34me[0m[34me[0m[34me[0m[34me[0m[34me[0m[34me[0m[34me[0m[34me[0m [37m [0m[37m [0m[37m [0m[37m [0m[37m [0m [34m [0m[34me[0m[34me[0m[34me[0m[34me[0m[34me[0m[34me[0m
[34me[0m[34me[0m[34me[0m[34me[0m[34me[0m[34me[0m[34m [0m [37m [0m[37m [0m[37m [0m[37m [0m[37m [0m [34m [0m[34me[0m[34me[0m[34me[0m[34me[0m[34me[0m[34me[0m[34me[0m[34me[0m[34me[0m[34me[0m[34me[0m[34me[0m[34me[0m[34me[0m[34me[0m[34me[0m[34me[0m[34me[0m[34me[0m[34me[0m[37m [0m [37m [0m[37m [0m[37m [0m[37m [0m[37m [0m [34m [0m[34me[0m[34me[0m[34me[0m[34me[0m[34me[0m[34me[0m
[34me[0m[34me[0m[34me[0m[34me[0m[34me[0m[34me[0m[34m [0m [37m [0m[37m [0m[37m [0m[37m [0m[37m [0m [37m [0m[34m [0m[34me[0m[34me[0m[34me[0m[34me[0m[34me[0m[34me[0m[34me[0m[34me[0m[34me[0m[34me[0m[34me[0m[34me[0m[34me[0m[34me[0m[34me[0m[34me[0m[34me[0m[34me[0m[37m [0m [37m [0m[37m [0m[37m [0m[37m [0m[37m [0m[37m [0m [34m [0m[34me[0m[34me[0m[34me[0m[34me[0m[34me[0m[34me[0m
[34me[0m[34me[0m[34me[0m[34me[0m[34me[0m[34me[0m[34m [0m [37m [0m[37m [0m[37m [0m[37m [0m[37m [0m[37m [0m[37m [0m[37m [0m[37m [0m[34me[0m[34me[0m[34me[0m[34me[0m[34me[0m[34me[0m[34me[0m[34me[0m[34me[0m[34me[0m[34me[0m[34me[0m[34me[0m[34me[0m[34me[0m[34me[0m[37m [0m  [37m [0m[37m [0m[37m [0m[37m [0m[37m [0m[37m [0m[37m [0m[34m [0m[34me[0m[34me[0m[34me[0m[34me[0m[34me[0m[34me[0m
[34me[0m[34me[0m[34me[0m[34me[0m[34me[0m[34me[0m[34me[0m[37m [0m [37m [0m[37m [0m[37m [0m[37m [0m[37m [0m[37m [0m[37m [0m [37m [0m[37m [0m[34m [0m[34me[0m[34me[0m[34me[0m[34me[0m[34me[0m[34me[0m[34me[0m[34me[0m[34me[0m[34me[0m[34m [0m[37m [0m[37m [0m[37m [0m[37m [0m[37m [0m[37m [0m[37m [0m[37m [0m[37m [0m[37m [0m [37m [0m[34me[0m[34me[0m[34me[0m[34me[0m[34me[0m[34me[0m[34me[0m
[34me[0m[34me[0m[34me[0m[34me[0m[34me[0m[34me[0m[34me[0m[34me[0m[37m [0m[37m [0m [37m [0m[37m [0m[37m [0m[37m [0m[37m [0m[37m [0m[37m [0m[37m [0m  [37m [0m[37m [0m[37m [0m[37m [0m[37m [0m[37m [0m[37m [0m[37m [0m   [37m [0m[37m [0m[37m [0m[37m [0m[37m [0m[37m [0m  [37m [0m[37m [0m[34me[0m[34me[0m[34me[0m[34me[0m[34me[0m[34me[0m[34me[0m[34me[0m
[37m [0m[34me[0m[34me[0m[34me[0m[34me[0m[34me[0m[34me[0m[34me[0m[34me[0m[34me[0m[34me[0m[37m [0m[37m [0m  [37m [0m[37m [0m[37m [0m[37m [0m[37m [0m[37m [0m[37m [0m[37m [0m[37m [0m[37m [0m[37m [0m[37m [0m[37m [0m[37m [0m[37m [0m[37m [0m[37m [0m[37m [0m[37m [0m[37m [0m [37m [0m[37m [0m[37m [0m[34me[0m[34me[0m[34me[0m[34me[0m[34me[0m[34me[0m[34me[0m[34me[0m[34me[0m[34me[0m[37m [0m
 [37m [0m[34m [0m[34me[0m[34me[0m[34me[0m[34me[0m[34me[0m[34me[0m[34me[0m[34me[0m[34me[0m[34me[0m[34me[0m[34m [0m[37m [0m[37m [0m [37m [0m[37m [0m[37m [0m[37m [0m[37m [0m[37m [0m[37m [0m[37m [0m[37m [0m[37m [0m[37m [0m[37m [0m[37m [0m[37m [0m [37m [0m[37m [0m[34m [0m[34me[0m[34me[0m[34me[0m[34me[0m[34me[0m[34me[0m[34me[0m[34me[0m[34me[0m[34me[0m[34me[0m[34m [0m[37m [0m 
[37m [0m  [37m [0m[37m [0m[34m [0m[34me[0m[34me[0m[34me[0m[34me[0m[34me[0m[34me[0m[34me[0m[34me[0m[34me[0m[34me[0m[34me[0m[34me[0m[34m [0m[37m [0m[37m [0m  [37m [0m[37m [0m[37m [0m[37m [0m[37m [0m [37m [0m[37m [0m[34m [0m[34me[0m[34me[0m[34me[0m[34me[0m[34me[0m[34me[0m[34me[0m[34me[0m[34me[0m[34me[0m[34me[0m[34me[0m[34m [0m[37m [0m[37m [0m  [37m [0m
[37m [0m[37m [0m[37m [0m[37m [0m[37m [0m  [37m [0m[37m [0m[34me[0m[34me[0m[34me[0m[34me[0m[34me[0m[34me[0m[34me[0m[34me[0m[34me[0m[34me[0m[34me[0m[34me[0m[34m [0m[37m [0m[37m [0m[37m [0m[37m [0m[37m [0m[37m [0m[34me[0m[34me[0m[34me[0m[34me[0m[34me[0m[34me[0m[34me[0m[34me[0m[34me[0m[34me[0m[34me[0m[34me[0m[34me[0m[37m [0m[37m [0m  [37m [0m[37m [0m[37m [0m[37m [0m[37m [0m
[37m [0m[37m [0m[37m [0m[37m [0m[37m [0m[37m [0m[37m [0m[37m [0m  [37m [0m[37m [0m[34m [0m[34me[0m[34me[0m[34me[0m[34me[0m[34me[0m[34me[0m[34me[0m[34me[0m[34me[0m[34me[0m[34me[0m[34me[0m[34me[0m[34me[0m[34me[0m[34me[0m[34me[0m[34me[0m[34me[0m[34me[0m[34me[0m[34me[0m[34me[0m[34me[0m[34m [0m[37m [0m[37m [0m  [37m [0m[37m [0m[37m [0m[37m [0m[37m [0m[37m [0m[37m [0m[37m [0m
[37m [0m[37m [0m[37m [0m[37m [0m[37m [0m[37m [0m[37m [0m[37m [0m[37m [0m[37m [0m[37m [0m[37m [0m[37m [0m [37m [0m[37m [0m[34me[0m[34me[0m[34me[0m[34me[0m[34me[0m[34me[0m[34me[0m[34me[0m[34me[0m[34me[0m[34me[0m[34me[0m[34me[0m[34me[0m[34me[0m[34me[0m[34me[0m[34me[0m[37m [0m[37m [0m [37m [0m[37m [0m[37m [0m[37m [0m[37m [0m[37m [0m[37m [0m[37m [0m[37m [0m[37m [0m[37m [0m[37m [0m[37m [0m
[37m [0m[37m [0m[37m [0m[37m [0m[37m [0m[37m [0m[37m [0m[37m [0m[37m [0m[37m [0m[37m [0m[37m [0m[37m [0m[37m [0m[37m [0m[37m [0m [37m [0m[37m [0m[34m [0m[34me[0m[34me[0m[34me[0m[34me[0m[34me[0m[34me[0m[34me[0m[34me[0m[34me[0m[34me[0m[34m [0m[37m [0m[37m [0m [37m [0m[37m [0m[37m [0m[37m [0m[37m [0m[37m [0m[37m [0m[37m [0m[37m [0m[37m [0m[37m [0m[37m [0m[37m [0m[37m [0m[37m [0m[37m [0m
[37m [0m[37m [0m[37m [0m[37m [0m[37m [0m[37m [0m[37m [0m[37m [0m[37m [0m[37m [0m[37m [0m[37m [0m[37m [0m[37m [0m[37m [0m[37m [0m[37m [0m[37m [0m   [37m [0m[34m [0m[34me[0m[34me[0m[34me[0m[34me[0m[34m [0m[37m [0m[37m [0m  [37m [0m[37m [0m[37m [0m[37m [0m[37m [0m[37m [0m[37m [0m[37m [0m[37m [0m[37m [0m[37m [0m[37m [0m[37m [0m[37m [0m[37m [0m[37m [0m[37m [0m[37m [0m
