%!PS-Adobe-3.0 EPSF-3.0
%%Creator: cairo 1.15.10 (http://cairographics.org)
%%CreationDate: Wed Oct 16 17:45:23 2019
%%Pages: 1
%%DocumentData: Clean7Bit
%%LanguageLevel: 2
%%BoundingBox: 0 0 1010 225
%%EndComments
%%BeginProlog
50 dict begin
/q { gsave } bind def
/Q { grestore } bind def
/cm { 6 array astore concat } bind def
/w { setlinewidth } bind def
/J { setlinecap } bind def
/j { setlinejoin } bind def
/M { setmiterlimit } bind def
/d { setdash } bind def
/m { moveto } bind def
/l { lineto } bind def
/c { curveto } bind def
/h { closepath } bind def
/re { exch dup neg 3 1 roll 5 3 roll moveto 0 rlineto
      0 exch rlineto 0 rlineto closepath } bind def
/S { stroke } bind def
/f { fill } bind def
/f* { eofill } bind def
/n { newpath } bind def
/W { clip } bind def
/W* { eoclip } bind def
/BT { } bind def
/ET { } bind def
/BDC { mark 3 1 roll /BDC pdfmark } bind def
/EMC { mark /EMC pdfmark } bind def
/cairo_store_point { /cairo_point_y exch def /cairo_point_x exch def } def
/Tj { show currentpoint cairo_store_point } bind def
/TJ {
  {
    dup
    type /stringtype eq
    { show } { -0.001 mul 0 cairo_font_matrix dtransform rmoveto } ifelse
  } forall
  currentpoint cairo_store_point
} bind def
/cairo_selectfont { cairo_font_matrix aload pop pop pop 0 0 6 array astore
    cairo_font exch selectfont cairo_point_x cairo_point_y moveto } bind def
/Tf { pop /cairo_font exch def /cairo_font_matrix where
      { pop cairo_selectfont } if } bind def
/Td { matrix translate cairo_font_matrix matrix concatmatrix dup
      /cairo_font_matrix exch def dup 4 get exch 5 get cairo_store_point
      /cairo_font where { pop cairo_selectfont } if } bind def
/Tm { 2 copy 8 2 roll 6 array astore /cairo_font_matrix exch def
      cairo_store_point /cairo_font where { pop cairo_selectfont } if } bind def
/g { setgray } bind def
/rg { setrgbcolor } bind def
/d1 { setcachedevice } bind def
/cairo_data_source {
  CairoDataIndex CairoData length lt
    { CairoData CairoDataIndex get /CairoDataIndex CairoDataIndex 1 add def }
    { () } ifelse
} def
/cairo_flush_ascii85_file { cairo_ascii85_file status { cairo_ascii85_file flushfile } if } def
/cairo_image { image cairo_flush_ascii85_file } def
/cairo_imagemask { imagemask cairo_flush_ascii85_file } def
%%EndProlog
%%BeginSetup
%%EndSetup
%%Page: 1 1
%%BeginPageSetup
%%PageBoundingBox: 0 0 1010 225
%%EndPageSetup
q 0 0 1010 225 rectclip
1 0 0 -1 0 225 cm q
0.0705882 0.235294 0.458824 rg
100.336 0.062 m 92.918 0.66 84.473 5.535 76.023 10.414 c 76.023 10.414 
50.684 25.043 50.684 25.043 c 50.684 25.043 25.34 39.676 25.34 39.676 c 
16.895 44.551 8.449 49.43 4.223 56.746 c 0 64.062 0 73.812 0 83.566 c 0 
83.566 0 112.828 0 112.828 c 0 112.828 0 142.09 0 142.09 c 0 151.844 0 161.602
 4.223 168.914 c 8.449 176.23 16.895 181.109 25.34 185.984 c 25.34 185.984
 50.684 200.613 50.684 200.613 c 50.684 200.613 76.023 215.246 76.023 215.246
 c 84.473 220.121 92.922 225 101.367 225 c 109.812 225 118.262 220.121 126.707
 215.246 c 126.707 215.246 152.051 200.613 152.051 200.613 c 152.051 200.613
 177.391 185.984 177.391 185.984 c 185.836 181.109 194.285 176.23 198.508
 170.109 c 202.73 163.984 202.73 156.613 202.73 149.246 c 202.73 149.246
 202.73 127.137 202.73 127.137 c 202.73 127.137 202.73 105.027 202.73 105.027
 c 202.73 97.656 202.73 90.289 201.625 87.242 c 200.52 84.195 198.309 85.473
 196.094 86.75 c 196.094 86.75 189.457 90.582 189.457 90.582 c 189.457 90.582
 182.82 94.414 182.82 94.414 c 180.609 95.691 178.395 96.969 177.289 100.016
 c 176.184 103.062 176.184 107.875 176.184 112.691 c 176.184 112.691 176.184
 127.137 176.184 127.137 c 176.184 127.137 176.184 141.582 176.184 141.582
 c 176.184 146.395 176.184 151.211 173.066 155.418 c 169.949 159.625 163.715
 163.227 157.48 166.824 c 157.48 166.824 138.773 177.625 138.773 177.625
 c 138.773 177.625 120.07 188.422 120.07 188.422 c 113.836 192.023 107.602
 195.621 101.367 195.621 c 95.133 195.625 88.898 192.023 82.66 188.422 c
 82.66 188.422 63.957 177.625 63.957 177.625 c 63.957 177.625 45.254 166.824
 45.254 166.824 c 39.02 163.227 32.785 159.625 29.668 154.227 c 26.547 148.828
 26.547 141.625 26.547 134.426 c 26.547 134.426 26.547 112.828 26.547 112.828
 c 26.547 112.828 26.547 91.23 26.547 91.23 c 26.547 84.031 26.547 76.836
 29.668 71.434 c 32.785 66.035 39.02 62.434 45.254 58.836 c 45.254 58.836
 63.957 48.035 63.957 48.035 c 63.957 48.035 82.66 37.234 82.66 37.234 c
 88.898 33.637 95.133 30.035 100.336 29.441 c 105.539 28.844 109.707 31.254
 113.875 33.66 c 113.875 33.66 126.387 40.883 126.387 40.883 c 126.387 40.883
 138.895 48.105 138.895 48.105 c 143.066 50.512 147.234 52.922 148.074 54.844
 c 148.914 56.766 146.422 58.207 143.93 59.645 c 143.93 59.645 136.457 63.961
 136.457 63.961 c 136.457 63.961 128.98 68.273 128.98 68.273 c 126.492 69.715
 124 71.152 121.953 71.523 c 119.91 71.898 118.301 71.203 116.672 70.609
 c 115.043 70.012 113.379 69.512 111.695 69.109 c 110.008 68.707 108.297
 68.402 106.574 68.195 c 104.852 67.992 103.109 67.887 99.25 68.434 c 95.391
 68.984 89.449 70.184 84.258 72.355 c 79.066 74.531 74.203 77.812 70.273
 81.738 c 66.348 85.668 63.066 90.531 60.895 95.723 c 58.719 100.914 57.52
 106.855 57.52 112.832 c 57.52 118.809 58.719 124.746 60.895 129.938 c 63.066
 135.129 66.348 139.996 70.273 143.922 c 74.203 147.852 79.066 151.133 84.258
 153.305 c 89.449 155.477 95.391 156.676 101.367 156.676 c 107.344 156.676
 113.281 155.477 118.473 153.305 c 123.664 151.133 128.531 147.852 132.457
 143.922 c 136.387 139.996 139.668 135.129 141.84 129.938 c 144.012 124.746
 145.211 118.809 145.746 114.836 c 146.285 110.863 146.148 108.898 145.891
 106.961 c 145.629 105.023 145.242 103.098 144.734 101.215 c 144.223 99.332
 143.59 97.473 142.836 95.668 c 142.086 93.867 141.207 92.098 142.266 90.352
 c 143.32 88.609 146.309 86.883 149.297 85.156 c 149.297 85.156 158.258 
79.984 158.258 79.984 c 158.258 79.984 167.223 74.809 167.223 74.809 c 167.223
 74.809 176.184 69.633 176.184 69.633 c 176.184 69.633 182.82 65.801 182.82
 65.801 c 182.82 65.801 189.457 61.969 189.457 61.969 c 189.457 61.969 196.094
 58.137 196.094 58.137 c 198.309 56.859 200.52 55.582 200.594 54.348 c 200.668
 53.113 198.602 51.922 196.539 50.73 c 196.539 50.73 190.344 47.152 190.344
 47.152 c 190.344 47.152 184.148 43.578 184.148 43.578 c 184.148 43.578 
177.953 40 177.953 40 c 177.953 40 158.809 28.945 158.809 28.945 c 158.809
 28.945 139.66 17.891 139.66 17.891 c 139.66 17.891 120.512 6.836 120.512
 6.836 c 114.129 3.152 107.75 -0.531 100.336 0.062 c h
95.316 89.984 m 96.961 89.984 98.594 90.312 100.02 90.91 c 101.449 91.508
 102.785 92.41 103.867 93.492 c 104.945 94.57 105.848 95.91 106.445 97.336
 c 107.043 98.766 107.375 100.398 107.375 102.043 c 107.375 103.684 107.043
 105.316 106.445 106.746 c 105.848 108.172 104.945 109.512 103.867 110.59
 c 102.785 111.672 101.449 112.574 100.02 113.172 c 98.594 113.77 96.961
 114.098 95.316 114.098 c 93.672 114.098 92.039 113.77 90.613 113.172 c 
89.184 112.574 87.844 111.672 86.766 110.59 c 85.684 109.512 84.781 108.172
 84.188 106.746 c 83.59 105.316 83.258 103.684 83.258 102.043 c 83.258 100.398
 83.59 98.766 84.188 97.336 c 84.781 95.91 85.684 94.57 86.766 93.492 c 
87.844 92.41 89.184 91.508 90.613 90.91 c 92.039 90.312 93.672 89.984 95.316
 89.984 c h
95.316 89.984 m f*
361.461 155.82 m 377.707 169.359 l 371.207 174.773 l 367.957 177.48 365.703
 179.105 364.438 179.648 c 363.355 180.008 361.188 180.191 357.941 180.191
 c 285.648 180.191 l 281.316 180.191 276.984 178.387 272.652 174.773 c 266.152
 169.359 l 261.82 165.75 259.656 161.238 259.656 155.82 c 259.656 69.18 
l 259.656 63.762 261.82 59.25 266.152 55.641 c 272.652 50.227 l 276.984 
46.613 281.316 44.809 285.648 44.809 c 348.734 44.809 l 352.344 44.809 356.676
 46.613 361.73 50.227 c 368.5 55.641 l 372.832 58.891 375 63.402 375 69.18
 c 375 124.684 l 282.398 124.684 l 282.398 150.137 l 282.398 152.844 282.488
 154.648 282.668 155.551 c 283.031 156.273 284.023 157.266 285.648 158.527
 c 287.273 159.793 288.535 160.605 289.438 160.965 c 290.34 161.145 292.418
 161.238 295.664 161.238 c 348.191 161.238 l 351.441 161.238 353.609 161.055
 354.691 160.695 c 355.953 160.152 358.211 158.527 361.461 155.82 c h
352.254 107.086 m 352.254 74.863 l 352.254 72.156 352.074 70.441 351.711
 69.719 c 351.531 68.816 350.629 67.734 349.004 66.473 c 347.379 65.207 
346.117 64.484 345.215 64.305 c 344.312 63.945 342.234 63.762 338.988 63.762
 c 295.664 63.762 l 292.418 63.762 290.34 63.945 289.438 64.305 c 288.535
 64.484 287.273 65.207 285.648 66.473 c 284.023 67.734 283.031 68.816 282.668
 69.719 c 282.488 70.441 282.398 72.156 282.398 74.863 c 282.398 107.086
 l h
352.254 107.086 m f
503.035 169.359 m 501.949 169.359 l 501.949 171.527 499.965 173.781 495.992
 176.129 c 492.746 178.113 490.488 179.289 489.227 179.648 c 488.141 180.008
 485.977 180.191 482.727 180.191 c 436.426 180.191 l 432.094 180.191 427.762
 178.387 423.43 174.773 c 416.934 169.359 l 412.602 165.75 410.434 161.238
 410.434 155.82 c 410.434 123.332 l 410.434 117.914 412.602 113.402 416.934
 109.793 c 423.43 104.379 l 427.762 100.766 432.094 98.961 436.426 98.961
 c 484.895 98.961 l 488.324 98.961 490.488 99.141 491.391 99.504 c 492.293
 99.684 493.465 100.406 494.91 101.668 c 497.078 103.477 498.16 105.281 
498.16 107.086 c 499.242 107.086 l 499.242 74.863 l 499.242 72.156 499.062
 70.441 498.703 69.719 c 498.52 68.816 497.617 67.734 495.992 66.473 c 494.371
 65.207 493.105 64.484 492.203 64.305 c 491.301 63.945 489.227 63.762 485.977
 63.762 c 442.113 63.762 l 438.863 63.762 436.605 64.035 435.344 64.574 
c 434.262 64.938 432.094 66.473 428.844 69.18 c 412.602 55.641 l 419.098
 50.227 l 422.348 47.52 424.512 45.984 425.598 45.621 c 426.859 45.082 429.117
 44.809 432.367 44.809 c 495.992 44.809 l 500.324 44.809 504.656 46.613 
508.992 50.227 c 515.488 55.641 l 519.82 59.25 521.988 63.762 521.988 69.18
 c 521.988 150.137 l 521.988 152.844 522.078 154.648 522.258 155.551 c 522.617
 156.273 523.613 157.266 525.234 158.527 c 526.859 159.793 527.762 160.875
 527.945 161.777 c 528.305 162.5 528.484 164.215 528.484 166.922 c 528.484
 180.191 l 519.008 180.191 l 515.758 180.191 513.504 180.008 512.238 179.648
 c 511.156 179.105 509.531 177.934 507.367 176.129 c 504.477 173.781 503.035
 171.527 503.035 169.359 c h
433.176 129.016 m 433.176 150.137 l 433.176 152.844 433.27 154.648 433.449
 155.551 c 433.809 156.273 434.801 157.266 436.426 158.527 c 438.051 159.793
 439.316 160.605 440.219 160.965 c 441.121 161.145 443.195 161.238 446.445
 161.238 c 479.477 161.238 l 482.727 161.238 484.895 161.055 485.977 160.695
 c 487.238 160.336 489.496 159.16 492.746 157.176 c 495.992 155.191 497.891
 153.746 498.43 152.844 c 498.973 151.941 499.242 150.137 499.242 147.43
 c 499.242 129.016 l 499.242 126.309 499.062 124.594 498.703 123.871 c 498.52
 122.969 497.617 121.887 495.992 120.621 c 494.371 119.359 493.105 118.637
 492.203 118.457 c 491.301 118.094 489.227 117.914 485.977 117.914 c 446.445
 117.914 l 443.195 117.914 441.121 118.094 440.219 118.457 c 439.316 118.637
 438.051 119.359 436.426 120.621 c 434.801 121.887 433.809 122.969 433.449
 123.871 c 433.27 124.594 433.176 126.309 433.176 129.016 c h
433.176 129.016 m f
610.906 155.281 m 646.645 44.809 l 669.121 44.809 l 622.008 180.191 l 596.016
 180.191 l 548.902 44.809 l 571.375 44.809 l 607.117 155.281 l 608.02 157.988
 608.469 160.152 608.469 161.777 c 609.551 161.777 l 609.551 160.152 610.004
 157.988 610.906 155.281 c h
610.906 155.281 m f
690.676 44.809 22.742 135.383 re f
833.336 101.668 m 837.668 101.668 842 103.477 846.332 107.086 c 852.828
 112.5 l 857.16 116.109 859.328 120.621 859.328 126.039 c 859.328 155.82
 l 859.328 161.238 857.16 165.75 852.828 169.359 c 846.332 174.773 l 842
 178.387 837.668 180.191 833.336 180.191 c 773.227 180.191 l 768.895 180.191
 764.562 178.387 760.23 174.773 c 753.73 169.359 l 749.398 165.75 747.234
 161.238 747.234 155.82 c 747.234 144.992 l 769.977 144.992 l 769.977 150.137
 l 769.977 152.844 770.066 154.648 770.246 155.551 c 770.609 156.273 771.602
 157.266 773.227 158.527 c 774.852 159.793 776.113 160.605 777.016 160.965
 c 777.918 161.145 779.996 161.238 783.246 161.238 c 823.316 161.238 l 826.566
 161.238 828.641 161.145 829.543 160.965 c 830.445 160.605 831.711 159.793
 833.336 158.527 c 834.961 157.266 835.863 156.273 836.043 155.551 c 836.402
 154.648 836.586 152.844 836.586 150.137 c 836.586 128.203 l 836.402 126.762
 835.32 125.137 833.336 123.332 c 831.711 122.066 830.445 121.344 829.543
 121.164 c 828.641 120.805 826.566 120.621 823.316 120.621 c 775.934 120.621
 l 771.602 120.621 767.27 118.816 762.938 115.207 c 756.438 109.793 l 752.105
 106.184 749.941 101.668 749.941 96.254 c 749.941 69.18 l 749.941 63.762
 752.105 59.25 756.438 55.641 c 762.938 50.227 l 767.27 46.613 771.602 44.809
 775.934 44.809 c 833.336 44.809 l 837.668 44.809 842 46.613 846.332 50.227
 c 852.828 55.641 l 857.16 59.25 859.328 63.762 859.328 69.18 c 859.328 
80.008 l 836.586 80.008 l 836.586 74.863 l 836.586 72.156 836.402 70.441
 836.043 69.719 c 835.863 68.816 834.961 67.734 833.336 66.473 c 831.711
 65.207 830.445 64.484 829.543 64.305 c 828.641 63.945 826.566 63.762 823.316
 63.762 c 785.953 63.762 l 782.703 63.762 780.629 63.945 779.723 64.305 
c 778.82 64.484 777.559 65.207 775.934 66.473 c 774.309 67.734 773.316 68.816
 772.957 69.719 c 772.773 70.441 772.684 72.156 772.684 74.863 c 772.684
 90.57 l 772.684 93.277 772.773 95.082 772.957 95.984 c 773.316 96.707 774.309
 97.699 775.934 98.961 c 777.559 100.227 778.82 101.039 779.723 101.398 
c 780.629 101.578 782.703 101.668 785.953 101.668 c h
833.336 101.668 m f
993.41 155.82 m 1009.656 169.359 l 1003.156 174.773 l 999.906 177.48 997.652
 179.105 996.387 179.648 c 995.305 180.008 993.137 180.191 989.891 180.191
 c 917.598 180.191 l 913.266 180.191 908.934 178.387 904.602 174.773 c 898.102
 169.359 l 893.77 165.75 891.602 161.238 891.602 155.82 c 891.602 69.18 
l 891.602 63.762 893.77 59.25 898.102 55.641 c 904.602 50.227 l 908.934 
46.613 913.266 44.809 917.598 44.809 c 980.684 44.809 l 984.293 44.809 988.625
 46.613 993.68 50.227 c 1000.449 55.641 l 1004.781 58.891 1006.945 63.402
 1006.945 69.18 c 1006.945 124.684 l 914.348 124.684 l 914.348 150.137 l
 914.348 152.844 914.438 154.648 914.617 155.551 c 914.98 156.273 915.973
 157.266 917.598 158.527 c 919.223 159.793 920.484 160.605 921.387 160.965
 c 922.289 161.145 924.367 161.238 927.613 161.238 c 980.141 161.238 l 983.391
 161.238 985.559 161.055 986.641 160.695 c 987.902 160.152 990.16 158.527
 993.41 155.82 c h
984.203 107.086 m 984.203 74.863 l 984.203 72.156 984.023 70.441 983.66
 69.719 c 983.48 68.816 982.578 67.734 980.953 66.473 c 979.328 65.207 978.066
 64.484 977.164 64.305 c 976.262 63.945 974.184 63.762 970.938 63.762 c 
927.613 63.762 l 924.367 63.762 922.289 63.945 921.387 64.305 c 920.484 
64.484 919.223 65.207 917.598 66.473 c 915.973 67.734 914.98 68.816 914.617
 69.719 c 914.438 70.441 914.348 72.156 914.348 74.863 c 914.348 107.086
 l h
984.203 107.086 m f
Q Q
showpage
%%Trailer
end
%%EOF
