%!PS-Adobe-3.0 EPSF-3.0
%%Creator: cairo 1.15.10 (http://cairographics.org)
%%CreationDate: Wed Oct 16 17:47:09 2019
%%Pages: 1
%%DocumentData: Clean7Bit
%%LanguageLevel: 2
%%BoundingBox: 0 0 128 128
%%EndComments
%%BeginProlog
50 dict begin
/q { gsave } bind def
/Q { grestore } bind def
/cm { 6 array astore concat } bind def
/w { setlinewidth } bind def
/J { setlinecap } bind def
/j { setlinejoin } bind def
/M { setmiterlimit } bind def
/d { setdash } bind def
/m { moveto } bind def
/l { lineto } bind def
/c { curveto } bind def
/h { closepath } bind def
/re { exch dup neg 3 1 roll 5 3 roll moveto 0 rlineto
      0 exch rlineto 0 rlineto closepath } bind def
/S { stroke } bind def
/f { fill } bind def
/f* { eofill } bind def
/n { newpath } bind def
/W { clip } bind def
/W* { eoclip } bind def
/BT { } bind def
/ET { } bind def
/BDC { mark 3 1 roll /BDC pdfmark } bind def
/EMC { mark /EMC pdfmark } bind def
/cairo_store_point { /cairo_point_y exch def /cairo_point_x exch def } def
/Tj { show currentpoint cairo_store_point } bind def
/TJ {
  {
    dup
    type /stringtype eq
    { show } { -0.001 mul 0 cairo_font_matrix dtransform rmoveto } ifelse
  } forall
  currentpoint cairo_store_point
} bind def
/cairo_selectfont { cairo_font_matrix aload pop pop pop 0 0 6 array astore
    cairo_font exch selectfont cairo_point_x cairo_point_y moveto } bind def
/Tf { pop /cairo_font exch def /cairo_font_matrix where
      { pop cairo_selectfont } if } bind def
/Td { matrix translate cairo_font_matrix matrix concatmatrix dup
      /cairo_font_matrix exch def dup 4 get exch 5 get cairo_store_point
      /cairo_font where { pop cairo_selectfont } if } bind def
/Tm { 2 copy 8 2 roll 6 array astore /cairo_font_matrix exch def
      cairo_store_point /cairo_font where { pop cairo_selectfont } if } bind def
/g { setgray } bind def
/rg { setrgbcolor } bind def
/d1 { setcachedevice } bind def
/cairo_data_source {
  CairoDataIndex CairoData length lt
    { CairoData CairoDataIndex get /CairoDataIndex CairoDataIndex 1 add def }
    { () } ifelse
} def
/cairo_flush_ascii85_file { cairo_ascii85_file status { cairo_ascii85_file flushfile } if } def
/cairo_image { image cairo_flush_ascii85_file } def
/cairo_imagemask { imagemask cairo_flush_ascii85_file } def
%%EndProlog
%%BeginSetup
%%EndSetup
%%Page: 1 1
%%BeginPageSetup
%%PageBoundingBox: 0 0 128 128
%%EndPageSetup
q 0 0 128 128 rectclip
1 0 0 -1 0 128 cm q
0.94902 g
0 0 127.5 127.5 re f
0.0705882 0.235294 0.458824 rg
63.297 14.457 m 60.047 14.719 56.344 16.855 52.641 18.996 c 52.641 18.996
 41.531 25.41 41.531 25.41 c 41.531 25.41 30.422 31.824 30.422 31.824 c 
26.719 33.961 23.016 36.098 21.164 39.309 c 19.312 42.516 19.312 46.789 
19.312 51.066 c 19.312 51.066 19.312 63.895 19.312 63.895 c 19.312 63.895
 19.312 76.723 19.312 76.723 c 19.312 81 19.312 85.277 21.164 88.484 c 23.016
 91.691 26.719 93.828 30.422 95.965 c 30.422 95.965 41.531 102.379 41.531
 102.379 c 41.531 102.379 52.641 108.793 52.641 108.793 c 56.344 110.934
 60.047 113.07 63.75 113.07 c 67.453 113.07 71.156 110.934 74.859 108.793
 c 74.859 108.793 85.969 102.379 85.969 102.379 c 85.969 102.379 97.078 
95.965 97.078 95.965 c 100.781 93.828 104.484 91.688 106.336 89.004 c 108.188
 86.32 108.188 83.09 108.188 79.859 c 108.188 79.859 108.188 70.168 108.188
 70.168 c 108.188 70.168 108.188 60.473 108.188 60.473 c 108.188 57.242 
108.188 54.012 107.703 52.676 c 107.219 51.34 106.25 51.902 105.277 52.461
 c 105.277 52.461 102.371 54.141 102.371 54.141 c 102.371 54.141 99.461 
55.82 99.461 55.82 c 98.488 56.379 97.52 56.941 97.035 58.277 c 96.551 59.613
 96.551 61.723 96.551 63.832 c 96.551 63.832 96.551 70.168 96.551 70.168
 c 96.551 70.168 96.551 76.5 96.551 76.5 c 96.551 78.609 96.551 80.723 95.184
 82.566 c 93.816 84.41 91.082 85.988 88.352 87.566 c 88.352 87.566 80.148
 92.301 80.148 92.301 c 80.148 92.301 71.949 97.035 71.949 97.035 c 69.215
 98.613 66.484 100.191 63.75 100.191 c 61.016 100.191 58.285 98.613 55.551
 97.035 c 55.551 97.035 47.352 92.301 47.352 92.301 c 47.352 92.301 39.148
 87.566 39.148 87.566 c 36.418 85.988 33.684 84.41 32.316 82.043 c 30.949
 79.676 30.949 76.52 30.949 73.363 c 30.949 73.363 30.949 63.895 30.949 
63.895 c 30.949 63.895 30.949 54.426 30.949 54.426 c 30.949 51.27 30.949
 48.113 32.316 45.746 c 33.684 43.379 36.418 41.801 39.148 40.223 c 39.148
 40.223 47.352 35.488 47.352 35.488 c 47.352 35.488 55.551 30.754 55.551
 30.754 c 58.285 29.176 61.016 27.598 63.297 27.336 c 65.578 27.074 67.406
 28.133 69.234 29.188 c 69.234 29.188 74.719 32.352 74.719 32.352 c 74.719
 32.352 80.203 35.52 80.203 35.52 c 82.031 36.574 83.859 37.629 84.227 38.473
 c 84.594 39.316 83.504 39.945 82.41 40.578 c 82.41 40.578 79.133 42.469
 79.133 42.469 c 79.133 42.469 75.855 44.363 75.855 44.363 c 74.766 44.992
 73.672 45.621 72.777 45.785 c 71.879 45.949 71.176 45.645 70.461 45.387
 c 69.746 45.125 69.016 44.902 68.277 44.727 c 67.539 44.551 66.789 44.418
 66.031 44.328 c 65.277 44.238 64.516 44.191 62.82 44.434 c 61.129 44.672
 58.527 45.199 56.25 46.152 c 53.973 47.105 51.84 48.543 50.121 50.266 c
 48.398 51.984 46.961 54.121 46.008 56.395 c 45.055 58.672 44.527 61.273
 44.527 63.895 c 44.527 66.516 45.055 69.117 46.008 71.395 c 46.961 73.672
 48.398 75.805 50.121 77.527 c 51.84 79.246 53.973 80.688 56.25 81.637 c
 58.527 82.59 61.129 83.117 63.75 83.117 c 66.371 83.117 68.973 82.59 71.25
 81.637 c 73.527 80.688 75.66 79.246 77.379 77.527 c 79.102 75.805 80.539
 73.672 81.492 71.395 c 82.445 69.117 82.973 66.516 83.207 64.773 c 83.441
 63.031 83.383 62.172 83.27 61.32 c 83.156 60.473 82.984 59.629 82.762 58.801
 c 82.539 57.977 82.262 57.164 81.93 56.371 c 81.602 55.582 81.215 54.805
 81.68 54.039 c 82.145 53.277 83.453 52.52 84.762 51.762 c 84.762 51.762
 88.691 49.496 88.691 49.496 c 88.691 49.496 92.621 47.227 92.621 47.227
 c 92.621 47.227 96.551 44.957 96.551 44.957 c 96.551 44.957 99.461 43.277
 99.461 43.277 c 99.461 43.277 102.371 41.598 102.371 41.598 c 102.371 41.598
 105.277 39.918 105.277 39.918 c 106.25 39.359 107.219 38.797 107.25 38.258
 c 107.285 37.715 106.379 37.191 105.473 36.668 c 105.473 36.668 102.758
 35.102 102.758 35.102 c 102.758 35.102 100.043 33.535 100.043 33.535 c 
100.043 33.535 97.324 31.965 97.324 31.965 c 97.324 31.965 88.934 27.121
 88.934 27.121 c 88.934 27.121 80.539 22.273 80.539 22.273 c 80.539 22.273
 72.145 17.426 72.145 17.426 c 69.348 15.812 66.547 14.195 63.297 14.457
 c h
61.098 53.879 m 61.816 53.879 62.535 54.023 63.16 54.285 c 63.785 54.547
 64.371 54.941 64.848 55.418 c 65.32 55.891 65.715 56.477 65.977 57.102 
c 66.238 57.727 66.383 58.445 66.383 59.164 c 66.383 59.887 66.238 60.602
 65.977 61.227 c 65.715 61.852 65.32 62.441 64.848 62.914 c 64.371 63.387
 63.785 63.781 63.16 64.043 c 62.535 64.305 61.816 64.449 61.098 64.449 
c 60.379 64.449 59.66 64.305 59.035 64.043 c 58.41 63.781 57.824 63.387 
57.348 62.914 c 56.875 62.441 56.48 61.852 56.219 61.227 c 55.957 60.602
 55.812 59.887 55.812 59.164 c 55.812 58.445 55.957 57.727 56.219 57.102
 c 56.48 56.477 56.875 55.891 57.348 55.418 c 57.824 54.941 58.41 54.547
 59.035 54.285 c 59.66 54.023 60.379 53.879 61.098 53.879 c h
61.098 53.879 m f*
Q Q
showpage
%%Trailer
end
%%EOF
