%!PS-Adobe-3.0 EPSF-3.0
%%Creator: cairo 1.15.10 (http://cairographics.org)
%%CreationDate: Wed Oct 16 17:46:43 2019
%%Pages: 1
%%DocumentData: Clean7Bit
%%LanguageLevel: 2
%%BoundingBox: 0 0 1554 270
%%EndComments
%%BeginProlog
50 dict begin
/q { gsave } bind def
/Q { grestore } bind def
/cm { 6 array astore concat } bind def
/w { setlinewidth } bind def
/J { setlinecap } bind def
/j { setlinejoin } bind def
/M { setmiterlimit } bind def
/d { setdash } bind def
/m { moveto } bind def
/l { lineto } bind def
/c { curveto } bind def
/h { closepath } bind def
/re { exch dup neg 3 1 roll 5 3 roll moveto 0 rlineto
      0 exch rlineto 0 rlineto closepath } bind def
/S { stroke } bind def
/f { fill } bind def
/f* { eofill } bind def
/n { newpath } bind def
/W { clip } bind def
/W* { eoclip } bind def
/BT { } bind def
/ET { } bind def
/BDC { mark 3 1 roll /BDC pdfmark } bind def
/EMC { mark /EMC pdfmark } bind def
/cairo_store_point { /cairo_point_y exch def /cairo_point_x exch def } def
/Tj { show currentpoint cairo_store_point } bind def
/TJ {
  {
    dup
    type /stringtype eq
    { show } { -0.001 mul 0 cairo_font_matrix dtransform rmoveto } ifelse
  } forall
  currentpoint cairo_store_point
} bind def
/cairo_selectfont { cairo_font_matrix aload pop pop pop 0 0 6 array astore
    cairo_font exch selectfont cairo_point_x cairo_point_y moveto } bind def
/Tf { pop /cairo_font exch def /cairo_font_matrix where
      { pop cairo_selectfont } if } bind def
/Td { matrix translate cairo_font_matrix matrix concatmatrix dup
      /cairo_font_matrix exch def dup 4 get exch 5 get cairo_store_point
      /cairo_font where { pop cairo_selectfont } if } bind def
/Tm { 2 copy 8 2 roll 6 array astore /cairo_font_matrix exch def
      cairo_store_point /cairo_font where { pop cairo_selectfont } if } bind def
/g { setgray } bind def
/rg { setrgbcolor } bind def
/d1 { setcachedevice } bind def
/cairo_data_source {
  CairoDataIndex CairoData length lt
    { CairoData CairoDataIndex get /CairoDataIndex CairoDataIndex 1 add def }
    { () } ifelse
} def
/cairo_flush_ascii85_file { cairo_ascii85_file status { cairo_ascii85_file flushfile } if } def
/cairo_image { image cairo_flush_ascii85_file } def
/cairo_imagemask { imagemask cairo_flush_ascii85_file } def
%%EndProlog
%%BeginSetup
%%EndSetup
%%Page: 1 1
%%BeginPageSetup
%%PageBoundingBox: 0 0 1554 270
%%EndPageSetup
q 0 0 1554 270 rectclip
1 0 0 -1 0 270 cm q
0 g
0 0 m 0 269.238 l 753.855 269.238 l 753.855 26.926 l 1553.328 26.926 l 
1553.328 0 l h
80.77 107.695 m 104.855 107.695 l 104.855 135.516 l 105.078 135.516 l 126.539
 107.695 l 156.207 107.695 l 127.852 139.254 l 160.809 188.465 l 130.805
 188.465 l 111.535 157.02 l 104.855 164.586 l 104.855 188.465 l 80.77 188.465
 l h
161.801 107.695 m 185.887 107.695 l 185.887 151.684 l 185.887 159.938 185.887
 170.223 197.602 170.223 c 208.992 170.223 208.992 159.938 208.992 151.684
 c 208.992 107.695 l 233.078 107.695 l 233.078 157.219 l 233.078 179.602
 221.359 190.352 197.492 190.352 c 173.625 190.352 161.801 179.602 161.801
 157.219 c h
268.406 107.695 m 292.5 107.695 l 292.5 167.754 l 326.48 167.754 l 326.48
 188.465 l 268.406 188.465 l h
333.859 107.695 m 397.965 107.695 l 397.965 128.391 l 357.727 128.391 l
 357.727 138.469 l 394.277 138.469 l 394.277 157.695 l 357.727 157.695 l
 357.727 167.754 l 399.148 167.754 l 399.148 188.465 l 333.859 188.465 l
 h
405.344 107.695 m 429.422 107.695 l 429.422 151.684 l 429.422 159.938 429.422
 170.223 441.137 170.223 c 452.527 170.223 452.527 159.938 452.527 151.684
 c 452.527 107.695 l 476.613 107.695 l 476.613 157.219 l 476.613 179.602
 464.902 190.352 441.035 190.352 c 417.16 190.352 405.344 179.602 405.344
 157.219 c h
480.016 107.695 m 504.324 107.695 l 517.137 156.676 l 517.355 156.676 l
 529.945 107.695 l 554.695 107.695 l 530.277 188.465 l 503.344 188.465 l
 h
558.094 107.695 m 622.188 107.695 l 622.188 128.391 l 581.949 128.391 l
 581.949 138.469 l 618.5 138.469 l 618.5 157.695 l 581.949 157.695 l 581.949
 167.754 l 623.383 167.754 l 623.383 188.465 l 558.094 188.465 l h
629.609 107.695 m 654.246 107.695 l 677.02 150.902 l 677.238 150.902 l 
677.238 107.695 l 700.008 107.695 l 700.008 188.465 l 676.582 188.465 l 
652.605 144.34 l 652.379 144.34 l 652.379 188.465 l 629.609 188.465 l h
629.609 107.695 m f
870.75 68.668 m 865.512 69.09 859.547 72.535 853.578 75.98 c 853.578 75.98
 835.68 86.312 835.68 86.312 c 835.68 86.312 817.781 96.645 817.781 96.645
 c 811.816 100.09 805.852 103.535 802.867 108.703 c 799.883 113.871 799.883
 120.758 799.883 127.648 c 799.883 127.648 799.883 148.312 799.883 148.312
 c 799.883 148.312 799.883 168.98 799.883 168.98 c 799.883 175.871 799.883
 182.762 802.867 187.926 c 805.852 193.094 811.816 196.539 817.781 199.98
 c 817.781 199.98 835.68 210.316 835.68 210.316 c 835.68 210.316 853.578
 220.648 853.578 220.648 c 859.547 224.094 865.512 227.539 871.477 227.539
 c 877.445 227.539 883.41 224.094 889.375 220.648 c 889.375 220.648 907.273
 210.316 907.273 210.316 c 907.273 210.316 925.172 199.98 925.172 199.98
 c 931.137 196.539 937.105 193.094 940.086 188.77 c 943.07 184.445 943.07
 179.238 943.07 174.031 c 943.07 174.031 943.07 158.418 943.07 158.418 c
 943.07 158.418 943.07 142.801 943.07 142.801 c 943.07 137.598 943.07 132.395
 942.289 130.242 c 941.508 128.09 939.945 128.992 938.383 129.895 c 938.383
 129.895 933.695 132.602 933.695 132.602 c 933.695 132.602 929.008 135.309
 929.008 135.309 c 927.445 136.207 925.883 137.109 925.102 139.262 c 924.32
 141.414 924.32 144.816 924.32 148.215 c 924.32 148.215 924.32 158.418 924.32
 158.418 c 924.32 158.418 924.32 168.621 924.32 168.621 c 924.32 172.02 
924.32 175.422 922.117 178.395 c 919.918 181.363 915.512 183.906 911.109
 186.449 c 911.109 186.449 897.898 194.078 897.898 194.078 c 897.898 194.078
 884.688 201.703 884.688 201.703 c 880.285 204.246 875.883 206.789 871.477
 206.789 c 867.074 206.789 862.672 204.246 858.266 201.703 c 858.266 201.703
 845.055 194.078 845.055 194.078 c 845.055 194.078 831.848 186.449 831.848
 186.449 c 827.441 183.906 823.039 181.367 820.836 177.551 c 818.637 173.738
 818.637 168.652 818.637 163.566 c 818.637 163.566 818.637 148.312 818.637
 148.312 c 818.637 148.312 818.637 133.059 818.637 133.059 c 818.637 127.977
 818.637 122.891 820.836 119.078 c 823.039 115.262 827.441 112.719 831.848
 110.18 c 831.848 110.18 845.055 102.551 845.055 102.551 c 845.055 102.551
 858.266 94.922 858.266 94.922 c 862.672 92.383 867.074 89.84 870.75 89.418
 c 874.422 88.996 877.367 90.699 880.312 92.398 c 880.312 92.398 889.148
 97.5 889.148 97.5 c 889.148 97.5 897.984 102.602 897.984 102.602 c 900.93
 104.301 903.875 106 904.469 107.359 c 905.059 108.719 903.301 109.734 901.539
 110.75 c 901.539 110.75 896.262 113.797 896.262 113.797 c 896.262 113.797
 890.98 116.844 890.98 116.844 c 889.223 117.863 887.461 118.879 886.02 
119.141 c 884.574 119.406 883.438 118.914 882.289 118.492 c 881.137 118.074
 879.961 117.719 878.773 117.434 c 877.582 117.152 876.371 116.934 875.156
 116.789 c 873.938 116.645 872.707 116.57 869.98 116.957 c 867.258 117.348
 863.062 118.195 859.395 119.73 c 855.73 121.266 852.293 123.582 849.52 
126.355 c 846.742 129.129 844.426 132.566 842.891 136.234 c 841.355 139.898
 840.512 144.094 840.512 148.316 c 840.512 152.535 841.355 156.73 842.891
 160.398 c 844.426 164.062 846.742 167.5 849.52 170.273 c 852.293 173.047
 855.73 175.367 859.395 176.898 c 863.062 178.434 867.258 179.281 871.477
 179.281 c 875.699 179.281 879.895 178.434 883.559 176.898 c 887.227 175.367
 890.664 173.047 893.438 170.273 c 896.211 167.5 898.527 164.062 900.062
 160.398 c 901.598 156.73 902.445 152.535 902.824 149.73 c 903.203 146.926
 903.105 145.535 902.922 144.168 c 902.738 142.801 902.465 141.441 902.105
 140.109 c 901.746 138.781 901.297 137.469 900.766 136.195 c 900.238 134.922
 899.617 133.672 900.363 132.438 c 901.109 131.207 903.219 129.988 905.328
 128.77 c 905.328 128.77 911.66 125.113 911.66 125.113 c 911.66 125.113 
917.988 121.461 917.988 121.461 c 917.988 121.461 924.32 117.805 924.32 
117.805 c 924.32 117.805 929.008 115.098 929.008 115.098 c 929.008 115.098
 933.695 112.391 933.695 112.391 c 933.695 112.391 938.383 109.688 938.383
 109.688 c 939.945 108.785 941.508 107.883 941.559 107.012 c 941.613 106.137
 940.152 105.297 938.695 104.453 c 938.695 104.453 934.32 101.926 934.32
 101.926 c 934.32 101.926 929.945 99.402 929.945 99.402 c 929.945 99.402
 925.57 96.875 925.57 96.875 c 925.57 96.875 912.047 89.066 912.047 89.066
 c 912.047 89.066 898.523 81.262 898.523 81.262 c 898.523 81.262 885 73.453
 885 73.453 c 880.492 70.852 875.984 68.25 870.75 68.668 c h
867.203 132.18 m 868.363 132.18 869.52 132.41 870.527 132.832 c 871.535
 133.254 872.48 133.891 873.242 134.656 c 874.008 135.418 874.645 136.363
 875.066 137.371 c 875.488 138.379 875.719 139.535 875.719 140.695 c 875.719
 141.855 875.488 143.008 875.066 144.016 c 874.645 145.023 874.008 145.969
 873.242 146.734 c 872.48 147.496 871.535 148.133 870.527 148.555 c 869.52
 148.977 868.363 149.211 867.203 149.211 c 866.043 149.211 864.891 148.977
 863.883 148.555 c 862.875 148.133 861.93 147.496 861.164 146.734 c 860.402
 145.969 859.766 145.023 859.344 144.016 c 858.922 143.008 858.688 141.855
 858.688 140.695 c 858.688 139.535 858.922 138.379 859.344 137.371 c 859.766
 136.363 860.402 135.418 861.164 134.656 c 861.93 133.891 862.875 133.254
 863.883 132.832 c 864.891 132.41 866.043 132.18 867.203 132.18 c h
867.203 132.18 m f*
1055.176 178.68 m 1066.652 188.238 l 1062.062 192.066 l 1059.766 193.977
 1058.172 195.125 1057.281 195.508 c 1056.516 195.762 1054.984 195.891 1052.691
 195.891 c 1001.633 195.891 l 998.574 195.891 995.512 194.613 992.453 192.066
 c 987.863 188.238 l 984.805 185.691 983.273 182.504 983.273 178.68 c 983.273
 117.484 l 983.273 113.66 984.805 110.473 987.863 107.922 c 992.453 104.098
 l 995.512 101.547 998.574 100.273 1001.633 100.273 c 1046.188 100.273 l
 1048.738 100.273 1051.797 101.547 1055.367 104.098 c 1060.148 107.922 l
 1063.207 110.219 1064.738 113.406 1064.738 117.484 c 1064.738 156.688 l
 999.336 156.688 l 999.336 174.664 l 999.336 176.574 999.402 177.852 999.527
 178.488 c 999.785 178.996 1000.484 179.699 1001.633 180.59 c 1002.781 181.484
 1003.672 182.059 1004.309 182.312 c 1004.945 182.438 1006.414 182.504 1008.707
 182.504 c 1045.809 182.504 l 1048.102 182.504 1049.633 182.375 1050.395
 182.121 c 1051.289 181.738 1052.883 180.59 1055.176 178.68 c h
1048.676 144.258 m 1048.676 121.5 l 1048.676 119.586 1048.547 118.375 1048.293
 117.867 c 1048.164 117.23 1047.527 116.465 1046.379 115.57 c 1045.234 114.68
 1044.34 114.168 1043.703 114.043 c 1043.066 113.785 1041.602 113.66 1039.305
 113.66 c 1008.707 113.66 l 1006.414 113.66 1004.945 113.785 1004.309 114.043
 c 1003.672 114.168 1002.781 114.68 1001.633 115.57 c 1000.484 116.465 999.785
 117.23 999.527 117.867 c 999.402 118.375 999.336 119.586 999.336 121.5 
c 999.336 144.258 l h
1048.676 144.258 m f
1155.168 188.238 m 1154.402 188.238 l 1154.402 189.77 1153 191.363 1150.195
 193.02 c 1147.902 194.422 1146.309 195.25 1145.414 195.508 c 1144.648 195.762
 1143.121 195.891 1140.824 195.891 c 1108.125 195.891 l 1105.066 195.891
 1102.004 194.613 1098.945 192.066 c 1094.355 188.238 l 1091.297 185.691
 1089.766 182.504 1089.766 178.68 c 1089.766 155.73 l 1089.766 151.906 1091.297
 148.719 1094.355 146.168 c 1098.945 142.344 l 1102.004 139.793 1105.066
 138.52 1108.125 138.52 c 1142.355 138.52 l 1144.777 138.52 1146.309 138.648
 1146.945 138.902 c 1147.582 139.031 1148.41 139.539 1149.43 140.434 c 1150.961
 141.707 1151.727 142.98 1151.727 144.258 c 1152.492 144.258 l 1152.492 
121.5 l 1152.492 119.586 1152.363 118.375 1152.109 117.867 c 1151.98 117.23
 1151.344 116.465 1150.195 115.57 c 1149.047 114.68 1148.156 114.168 1147.52
 114.043 c 1146.883 113.785 1145.414 113.66 1143.121 113.66 c 1112.141 113.66
 l 1109.848 113.66 1108.254 113.852 1107.359 114.234 c 1106.594 114.488 
1105.066 115.57 1102.77 117.484 c 1091.297 107.922 l 1095.887 104.098 l 
1098.18 102.184 1099.711 101.102 1100.477 100.848 c 1101.367 100.465 1102.961
 100.273 1105.258 100.273 c 1150.195 100.273 l 1153.254 100.273 1156.316
 101.547 1159.375 104.098 c 1163.965 107.922 l 1167.023 110.473 1168.555
 113.66 1168.555 117.484 c 1168.555 174.664 l 1168.555 176.574 1168.617 
177.852 1168.746 178.488 c 1169 178.996 1169.703 179.699 1170.848 180.59
 c 1171.996 181.484 1172.633 182.25 1172.762 182.887 c 1173.016 183.395 
1173.145 184.605 1173.145 186.52 c 1173.145 195.891 l 1166.449 195.891 l
 1164.156 195.891 1162.562 195.762 1161.668 195.508 c 1160.906 195.125 1159.758
 194.297 1158.227 193.02 c 1156.188 191.363 1155.168 189.77 1155.168 188.238
 c h
1105.828 159.746 m 1105.828 174.664 l 1105.828 176.574 1105.895 177.852
 1106.02 178.488 c 1106.277 178.996 1106.977 179.699 1108.125 180.59 c 1109.273
 181.484 1110.164 182.059 1110.801 182.312 c 1111.441 182.438 1112.906 182.504
 1115.199 182.504 c 1138.531 182.504 l 1140.824 182.504 1142.355 182.375
 1143.121 182.121 c 1144.012 181.867 1145.605 181.035 1147.902 179.633 c
 1150.195 178.23 1151.535 177.211 1151.918 176.574 c 1152.301 175.938 1152.492
 174.664 1152.492 172.75 c 1152.492 159.746 l 1152.492 157.836 1152.363 
156.621 1152.109 156.113 c 1151.98 155.477 1151.344 154.711 1150.195 153.816
 c 1149.047 152.926 1148.156 152.414 1147.52 152.289 c 1146.883 152.035 
1145.414 151.906 1143.121 151.906 c 1115.199 151.906 l 1112.906 151.906 
1111.441 152.035 1110.801 152.289 c 1110.164 152.414 1109.273 152.926 1108.125
 153.816 c 1106.977 154.711 1106.277 155.477 1106.02 156.113 c 1105.895 
156.621 1105.828 157.836 1105.828 159.746 c h
1105.828 159.746 m f
1231.355 178.297 m 1256.598 100.273 l 1272.473 100.273 l 1239.195 195.891
 l 1220.84 195.891 l 1187.562 100.273 l 1203.438 100.273 l 1228.68 178.297
 l 1229.316 180.207 1229.637 181.738 1229.637 182.887 c 1230.398 182.887
 l 1230.398 181.738 1230.719 180.207 1231.355 178.297 c h
1231.355 178.297 m f
1287.695 100.273 16.062 95.617 re f
1388.453 140.434 m 1391.516 140.434 1394.574 141.707 1397.633 144.258 c
 1402.223 148.082 l 1405.281 150.633 1406.812 153.816 1406.812 157.645 c
 1406.812 178.68 l 1406.812 182.504 1405.281 185.691 1402.223 188.238 c 
1397.633 192.066 l 1394.574 194.613 1391.516 195.891 1388.453 195.891 c 
1346 195.891 l 1342.941 195.891 1339.883 194.613 1336.82 192.066 c 1332.23
 188.238 l 1329.172 185.691 1327.641 182.504 1327.641 178.68 c 1327.641 
171.027 l 1343.707 171.027 l 1343.707 174.664 l 1343.707 176.574 1343.77
 177.852 1343.898 178.488 c 1344.152 178.996 1344.852 179.699 1346 180.59
 c 1347.148 181.484 1348.039 182.059 1348.676 182.312 c 1349.316 182.438
 1350.781 182.504 1353.074 182.504 c 1381.379 182.504 l 1383.672 182.504
 1385.141 182.438 1385.777 182.312 c 1386.414 182.059 1387.305 181.484 1388.453
 180.59 c 1389.602 179.699 1390.238 178.996 1390.367 178.488 c 1390.621 
177.852 1390.75 176.574 1390.75 174.664 c 1390.75 159.172 l 1390.621 158.152
 1389.855 157.004 1388.453 155.73 c 1387.305 154.84 1386.414 154.328 1385.777
 154.199 c 1385.141 153.945 1383.672 153.816 1381.379 153.816 c 1347.914
 153.816 l 1344.852 153.816 1341.793 152.543 1338.734 149.992 c 1334.145
 146.168 l 1331.086 143.617 1329.555 140.434 1329.555 136.605 c 1329.555
 117.484 l 1329.555 113.66 1331.086 110.473 1334.145 107.922 c 1338.734 
104.098 l 1341.793 101.547 1344.852 100.273 1347.914 100.273 c 1388.453 
100.273 l 1391.516 100.273 1394.574 101.547 1397.633 104.098 c 1402.223 
107.922 l 1405.281 110.473 1406.812 113.66 1406.812 117.484 c 1406.812 125.133
 l 1390.75 125.133 l 1390.75 121.5 l 1390.75 119.586 1390.621 118.375 1390.367
 117.867 c 1390.238 117.23 1389.602 116.465 1388.453 115.57 c 1387.305 114.68
 1386.414 114.168 1385.777 114.043 c 1385.141 113.785 1383.672 113.66 1381.379
 113.66 c 1354.988 113.66 l 1352.695 113.66 1351.227 113.785 1350.59 114.043
 c 1349.953 114.168 1349.059 114.68 1347.914 115.57 c 1346.766 116.465 1346.062
 117.23 1345.809 117.867 c 1345.68 118.375 1345.617 119.586 1345.617 121.5
 c 1345.617 132.59 l 1345.617 134.504 1345.68 135.777 1345.809 136.414 c
 1346.062 136.926 1346.766 137.629 1347.914 138.52 c 1349.059 139.41 1349.953
 139.984 1350.59 140.242 c 1351.227 140.367 1352.695 140.434 1354.988 140.434
 c h
1388.453 140.434 m f
1501.512 178.68 m 1512.984 188.238 l 1508.395 192.066 l 1506.102 193.977
 1504.508 195.125 1503.613 195.508 c 1502.852 195.762 1501.32 195.891 1499.023
 195.891 c 1447.965 195.891 l 1444.906 195.891 1441.848 194.613 1438.785
 192.066 c 1434.199 188.238 l 1431.137 185.691 1429.609 182.504 1429.609
 178.68 c 1429.609 117.484 l 1429.609 113.66 1431.137 110.473 1434.199 107.922
 c 1438.785 104.098 l 1441.848 101.547 1444.906 100.273 1447.965 100.273
 c 1492.523 100.273 l 1495.074 100.273 1498.133 101.547 1501.703 104.098
 c 1506.484 107.922 l 1509.543 110.219 1511.074 113.406 1511.074 117.484
 c 1511.074 156.688 l 1445.672 156.688 l 1445.672 174.664 l 1445.672 176.574
 1445.734 177.852 1445.863 178.488 c 1446.117 178.996 1446.82 179.699 1447.965
 180.59 c 1449.113 181.484 1450.008 182.059 1450.645 182.312 c 1451.281 
182.438 1452.746 182.504 1455.043 182.504 c 1492.141 182.504 l 1494.438 
182.504 1495.965 182.375 1496.73 182.121 c 1497.621 181.738 1499.215 180.59
 1501.512 178.68 c h
1495.008 144.258 m 1495.008 121.5 l 1495.008 119.586 1494.883 118.375 1494.629
 117.867 c 1494.5 117.23 1493.863 116.465 1492.715 115.57 c 1491.566 114.68
 1490.676 114.168 1490.039 114.043 c 1489.398 113.785 1487.934 113.66 1485.641
 113.66 c 1455.043 113.66 l 1452.746 113.66 1451.281 113.785 1450.645 114.043
 c 1450.008 114.168 1449.113 114.68 1447.965 115.57 c 1446.82 116.465 1446.117
 117.23 1445.863 117.867 c 1445.734 118.375 1445.672 119.586 1445.672 121.5
 c 1445.672 144.258 l h
1495.008 144.258 m f
Q Q
showpage
%%Trailer
end
%%EOF
