%!PS-Adobe-3.0 EPSF-3.0
%%Creator: cairo 1.15.10 (http://cairographics.org)
%%CreationDate: Wed Oct 16 17:45:18 2019
%%Pages: 1
%%DocumentData: Clean7Bit
%%LanguageLevel: 2
%%BoundingBox: 0 0 1010 225
%%EndComments
%%BeginProlog
50 dict begin
/q { gsave } bind def
/Q { grestore } bind def
/cm { 6 array astore concat } bind def
/w { setlinewidth } bind def
/J { setlinecap } bind def
/j { setlinejoin } bind def
/M { setmiterlimit } bind def
/d { setdash } bind def
/m { moveto } bind def
/l { lineto } bind def
/c { curveto } bind def
/h { closepath } bind def
/re { exch dup neg 3 1 roll 5 3 roll moveto 0 rlineto
      0 exch rlineto 0 rlineto closepath } bind def
/S { stroke } bind def
/f { fill } bind def
/f* { eofill } bind def
/n { newpath } bind def
/W { clip } bind def
/W* { eoclip } bind def
/BT { } bind def
/ET { } bind def
/BDC { mark 3 1 roll /BDC pdfmark } bind def
/EMC { mark /EMC pdfmark } bind def
/cairo_store_point { /cairo_point_y exch def /cairo_point_x exch def } def
/Tj { show currentpoint cairo_store_point } bind def
/TJ {
  {
    dup
    type /stringtype eq
    { show } { -0.001 mul 0 cairo_font_matrix dtransform rmoveto } ifelse
  } forall
  currentpoint cairo_store_point
} bind def
/cairo_selectfont { cairo_font_matrix aload pop pop pop 0 0 6 array astore
    cairo_font exch selectfont cairo_point_x cairo_point_y moveto } bind def
/Tf { pop /cairo_font exch def /cairo_font_matrix where
      { pop cairo_selectfont } if } bind def
/Td { matrix translate cairo_font_matrix matrix concatmatrix dup
      /cairo_font_matrix exch def dup 4 get exch 5 get cairo_store_point
      /cairo_font where { pop cairo_selectfont } if } bind def
/Tm { 2 copy 8 2 roll 6 array astore /cairo_font_matrix exch def
      cairo_store_point /cairo_font where { pop cairo_selectfont } if } bind def
/g { setgray } bind def
/rg { setrgbcolor } bind def
/d1 { setcachedevice } bind def
/cairo_data_source {
  CairoDataIndex CairoData length lt
    { CairoData CairoDataIndex get /CairoDataIndex CairoDataIndex 1 add def }
    { () } ifelse
} def
/cairo_flush_ascii85_file { cairo_ascii85_file status { cairo_ascii85_file flushfile } if } def
/cairo_image { image cairo_flush_ascii85_file } def
/cairo_imagemask { imagemask cairo_flush_ascii85_file } def
%%EndProlog
%%BeginSetup
%%EndSetup
%%Page: 1 1
%%BeginPageSetup
%%PageBoundingBox: 0 0 1010 225
%%EndPageSetup
q 0 0 1010 225 rectclip
1 0 0 -1 0 225 cm q
0.0705882 0.235294 0.458824 rg
100.336 0.062 m 92.918 0.66 84.473 5.535 76.023 10.414 c 76.023 10.414 
50.684 25.043 50.684 25.043 c 50.684 25.043 25.34 39.676 25.34 39.676 c 
16.895 44.551 8.449 49.43 4.223 56.746 c 0 64.062 0 73.812 0 83.566 c 0 
83.566 0 112.828 0 112.828 c 0 112.828 0 142.09 0 142.09 c 0 151.844 0 161.602
 4.223 168.914 c 8.449 176.23 16.895 181.109 25.34 185.984 c 25.34 185.984
 50.684 200.613 50.684 200.613 c 50.684 200.613 76.023 215.246 76.023 215.246
 c 84.473 220.121 92.922 225 101.367 225 c 109.812 225 118.262 220.121 126.707
 215.246 c 126.707 215.246 152.051 200.613 152.051 200.613 c 152.051 200.613
 177.391 185.984 177.391 185.984 c 185.836 181.109 194.285 176.23 198.508
 170.109 c 202.73 163.984 202.73 156.613 202.73 149.246 c 202.73 149.246
 202.73 127.137 202.73 127.137 c 202.73 127.137 202.73 105.027 202.73 105.027
 c 202.73 97.656 202.73 90.289 201.625 87.242 c 200.52 84.195 198.309 85.473
 196.094 86.75 c 196.094 86.75 189.457 90.582 189.457 90.582 c 189.457 90.582
 182.82 94.414 182.82 94.414 c 180.609 95.691 178.395 96.969 177.289 100.016
 c 176.184 103.062 176.184 107.875 176.184 112.691 c 176.184 112.691 176.184
 127.137 176.184 127.137 c 176.184 127.137 176.184 141.582 176.184 141.582
 c 176.184 146.395 176.184 151.211 173.066 155.418 c 169.949 159.625 163.715
 163.227 157.48 166.824 c 157.48 166.824 138.773 177.625 138.773 177.625
 c 138.773 177.625 120.07 188.422 120.07 188.422 c 113.836 192.023 107.602
 195.621 101.367 195.621 c 95.133 195.625 88.898 192.023 82.66 188.422 c
 82.66 188.422 63.957 177.625 63.957 177.625 c 63.957 177.625 45.254 166.824
 45.254 166.824 c 39.02 163.227 32.785 159.625 29.668 154.227 c 26.547 148.828
 26.547 141.625 26.547 134.426 c 26.547 134.426 26.547 112.828 26.547 112.828
 c 26.547 112.828 26.547 91.23 26.547 91.23 c 26.547 84.031 26.547 76.836
 29.668 71.434 c 32.785 66.035 39.02 62.434 45.254 58.836 c 45.254 58.836
 63.957 48.035 63.957 48.035 c 63.957 48.035 82.66 37.234 82.66 37.234 c
 88.898 33.637 95.133 30.035 100.336 29.441 c 105.539 28.844 109.707 31.254
 113.875 33.66 c 113.875 33.66 126.387 40.883 126.387 40.883 c 126.387 40.883
 138.895 48.105 138.895 48.105 c 143.066 50.512 147.234 52.922 148.074 54.844
 c 148.914 56.766 146.422 58.207 143.93 59.645 c 143.93 59.645 136.457 63.961
 136.457 63.961 c 136.457 63.961 128.98 68.273 128.98 68.273 c 126.492 69.715
 124 71.152 121.953 71.523 c 119.91 71.898 118.301 71.203 116.672 70.609
 c 115.043 70.012 113.379 69.512 111.695 69.109 c 110.008 68.707 108.297
 68.402 106.574 68.195 c 104.852 67.992 103.109 67.887 99.25 68.434 c 95.391
 68.984 89.449 70.184 84.258 72.355 c 79.066 74.531 74.203 77.812 70.273
 81.738 c 66.348 85.668 63.066 90.531 60.895 95.723 c 58.719 100.914 57.52
 106.855 57.52 112.832 c 57.52 118.809 58.719 124.746 60.895 129.938 c 63.066
 135.129 66.348 139.996 70.273 143.922 c 74.203 147.852 79.066 151.133 84.258
 153.305 c 89.449 155.477 95.391 156.676 101.367 156.676 c 107.344 156.676
 113.281 155.477 118.473 153.305 c 123.664 151.133 128.531 147.852 132.457
 143.922 c 136.387 139.996 139.668 135.129 141.84 129.938 c 144.012 124.746
 145.211 118.809 145.746 114.836 c 146.285 110.863 146.148 108.898 145.891
 106.961 c 145.629 105.023 145.242 103.098 144.734 101.215 c 144.223 99.332
 143.59 97.473 142.836 95.668 c 142.086 93.867 141.207 92.098 142.266 90.352
 c 143.32 88.609 146.309 86.883 149.297 85.156 c 149.297 85.156 158.258 
79.984 158.258 79.984 c 158.258 79.984 167.223 74.809 167.223 74.809 c 167.223
 74.809 176.184 69.633 176.184 69.633 c 176.184 69.633 182.82 65.801 182.82
 65.801 c 182.82 65.801 189.457 61.969 189.457 61.969 c 189.457 61.969 196.094
 58.137 196.094 58.137 c 198.309 56.859 200.52 55.582 200.594 54.348 c 200.668
 53.113 198.602 51.922 196.539 50.73 c 196.539 50.73 190.344 47.152 190.344
 47.152 c 190.344 47.152 184.148 43.578 184.148 43.578 c 184.148 43.578 
177.953 40 177.953 40 c 177.953 40 158.809 28.945 158.809 28.945 c 158.809
 28.945 139.66 17.891 139.66 17.891 c 139.66 17.891 120.512 6.836 120.512
 6.836 c 114.129 3.152 107.75 -0.531 100.336 0.062 c h
95.316 89.984 m 96.961 89.984 98.594 90.312 100.02 90.91 c 101.449 91.508
 102.785 92.41 103.867 93.492 c 104.945 94.57 105.848 95.91 106.445 97.336
 c 107.043 98.766 107.375 100.398 107.375 102.043 c 107.375 103.684 107.043
 105.316 106.445 106.746 c 105.848 108.172 104.945 109.512 103.867 110.59
 c 102.785 111.672 101.449 112.574 100.02 113.172 c 98.594 113.77 96.961
 114.098 95.316 114.098 c 93.672 114.098 92.039 113.77 90.613 113.172 c 
89.184 112.574 87.844 111.672 86.766 110.59 c 85.684 109.512 84.781 108.172
 84.188 106.746 c 83.59 105.316 83.258 103.684 83.258 102.043 c 83.258 100.398
 83.59 98.766 84.188 97.336 c 84.781 95.91 85.684 94.57 86.766 93.492 c 
87.844 92.41 89.184 91.508 90.613 90.91 c 92.039 90.312 93.672 89.984 95.316
 89.984 c h
95.316 89.984 m f*
361.461 134.734 m 377.707 148.27 l 371.207 153.688 l 367.957 156.395 365.703
 158.02 364.438 158.559 c 363.355 158.922 361.188 159.102 357.941 159.102
 c 285.648 159.102 l 281.316 159.102 276.984 157.297 272.652 153.688 c 266.152
 148.27 l 261.82 144.66 259.656 140.148 259.656 134.734 c 259.656 48.09 
l 259.656 42.676 261.82 38.16 266.152 34.551 c 272.652 29.137 l 276.984 
25.527 281.316 23.723 285.648 23.723 c 348.734 23.723 l 352.344 23.723 356.676
 25.527 361.73 29.137 c 368.5 34.551 l 372.832 37.801 375 42.312 375 48.09
 c 375 103.594 l 282.398 103.594 l 282.398 129.047 l 282.398 131.754 282.488
 133.559 282.668 134.461 c 283.031 135.184 284.023 136.176 285.648 137.441
 c 287.273 138.703 288.535 139.516 289.438 139.879 c 290.34 140.059 292.418
 140.148 295.664 140.148 c 348.191 140.148 l 351.441 140.148 353.609 139.969
 354.691 139.605 c 355.953 139.066 358.211 137.441 361.461 134.734 c h
352.254 85.996 m 352.254 53.777 l 352.254 51.066 352.074 49.352 351.711
 48.633 c 351.531 47.73 350.629 46.645 349.004 45.383 c 347.379 44.117 346.117
 43.395 345.215 43.215 c 344.312 42.855 342.234 42.676 338.988 42.676 c 
295.664 42.676 l 292.418 42.676 290.34 42.855 289.438 43.215 c 288.535 43.395
 287.273 44.117 285.648 45.383 c 284.023 46.645 283.031 47.73 282.668 48.633
 c 282.488 49.352 282.398 51.066 282.398 53.777 c 282.398 85.996 l h
352.254 85.996 m f
503.035 148.27 m 501.949 148.27 l 501.949 150.438 499.965 152.691 495.992
 155.039 c 492.746 157.023 490.488 158.199 489.227 158.559 c 488.141 158.922
 485.977 159.102 482.727 159.102 c 436.426 159.102 l 432.094 159.102 427.762
 157.297 423.43 153.688 c 416.934 148.27 l 412.602 144.66 410.434 140.148
 410.434 134.734 c 410.434 102.242 l 410.434 96.828 412.602 92.312 416.934
 88.703 c 423.43 83.289 l 427.762 79.68 432.094 77.875 436.426 77.875 c 
484.895 77.875 l 488.324 77.875 490.488 78.055 491.391 78.414 c 492.293 
78.594 493.465 79.316 494.91 80.582 c 497.078 82.387 498.16 84.191 498.16
 85.996 c 499.242 85.996 l 499.242 53.777 l 499.242 51.066 499.062 49.352
 498.703 48.633 c 498.52 47.73 497.617 46.645 495.992 45.383 c 494.371 44.117
 493.105 43.395 492.203 43.215 c 491.301 42.855 489.227 42.676 485.977 42.676
 c 442.113 42.676 l 438.863 42.676 436.605 42.945 435.344 43.488 c 434.262
 43.848 432.094 45.383 428.844 48.09 c 412.602 34.551 l 419.098 29.137 l
 422.348 26.43 424.512 24.895 425.598 24.535 c 426.859 23.992 429.117 23.723
 432.367 23.723 c 495.992 23.723 l 500.324 23.723 504.656 25.527 508.992
 29.137 c 515.488 34.551 l 519.82 38.16 521.988 42.676 521.988 48.09 c 521.988
 129.047 l 521.988 131.754 522.078 133.559 522.258 134.461 c 522.617 135.184
 523.613 136.176 525.234 137.441 c 526.859 138.703 527.762 139.785 527.945
 140.688 c 528.305 141.41 528.484 143.125 528.484 145.832 c 528.484 159.102
 l 519.008 159.102 l 515.758 159.102 513.504 158.922 512.238 158.559 c 511.156
 158.02 509.531 156.844 507.367 155.039 c 504.477 152.691 503.035 150.438
 503.035 148.27 c h
433.176 107.926 m 433.176 129.047 l 433.176 131.754 433.27 133.559 433.449
 134.461 c 433.809 135.184 434.801 136.176 436.426 137.441 c 438.051 138.703
 439.316 139.516 440.219 139.879 c 441.121 140.059 443.195 140.148 446.445
 140.148 c 479.477 140.148 l 482.727 140.148 484.895 139.969 485.977 139.605
 c 487.238 139.246 489.496 138.07 492.746 136.086 c 495.992 134.102 497.891
 132.656 498.43 131.754 c 498.973 130.852 499.242 129.047 499.242 126.34
 c 499.242 107.926 l 499.242 105.219 499.062 103.504 498.703 102.781 c 498.52
 101.879 497.617 100.797 495.992 99.535 c 494.371 98.27 493.105 97.547 492.203
 97.367 c 491.301 97.008 489.227 96.828 485.977 96.828 c 446.445 96.828 
l 443.195 96.828 441.121 97.008 440.219 97.367 c 439.316 97.547 438.051 
98.27 436.426 99.535 c 434.801 100.797 433.809 101.879 433.449 102.781 c
 433.27 103.504 433.176 105.219 433.176 107.926 c h
433.176 107.926 m f
610.906 134.191 m 646.645 23.723 l 669.121 23.723 l 622.008 159.102 l 596.016
 159.102 l 548.902 23.723 l 571.375 23.723 l 607.117 134.191 l 608.02 136.898
 608.469 139.066 608.469 140.688 c 609.551 140.688 l 609.551 139.066 610.004
 136.898 610.906 134.191 c h
610.906 134.191 m f
690.676 23.723 22.742 135.379 re f
833.336 80.582 m 837.668 80.582 842 82.387 846.332 85.996 c 852.828 91.41
 l 857.16 95.02 859.328 99.535 859.328 104.949 c 859.328 134.734 l 859.328
 140.148 857.16 144.66 852.828 148.27 c 846.332 153.688 l 842 157.297 837.668
 159.102 833.336 159.102 c 773.227 159.102 l 768.895 159.102 764.562 157.297
 760.23 153.688 c 753.73 148.27 l 749.398 144.66 747.234 140.148 747.234
 134.734 c 747.234 123.902 l 769.977 123.902 l 769.977 129.047 l 769.977
 131.754 770.066 133.559 770.246 134.461 c 770.609 135.184 771.602 136.176
 773.227 137.441 c 774.852 138.703 776.113 139.516 777.016 139.879 c 777.918
 140.059 779.996 140.148 783.246 140.148 c 823.316 140.148 l 826.566 140.148
 828.641 140.059 829.543 139.879 c 830.445 139.516 831.711 138.703 833.336
 137.441 c 834.961 136.176 835.863 135.184 836.043 134.461 c 836.402 133.559
 836.586 131.754 836.586 129.047 c 836.586 107.113 l 836.402 105.672 835.32
 104.047 833.336 102.242 c 831.711 100.977 830.445 100.258 829.543 100.074
 c 828.641 99.715 826.566 99.535 823.316 99.535 c 775.934 99.535 l 771.602
 99.535 767.27 97.73 762.938 94.117 c 756.438 88.703 l 752.105 85.094 749.941
 80.582 749.941 75.164 c 749.941 48.09 l 749.941 42.676 752.105 38.16 756.438
 34.551 c 762.938 29.137 l 767.27 25.527 771.602 23.723 775.934 23.723 c
 833.336 23.723 l 837.668 23.723 842 25.527 846.332 29.137 c 852.828 34.551
 l 857.16 38.16 859.328 42.676 859.328 48.09 c 859.328 58.922 l 836.586 
58.922 l 836.586 53.777 l 836.586 51.066 836.402 49.352 836.043 48.633 c
 835.863 47.73 834.961 46.645 833.336 45.383 c 831.711 44.117 830.445 43.395
 829.543 43.215 c 828.641 42.855 826.566 42.676 823.316 42.676 c 785.953
 42.676 l 782.703 42.676 780.629 42.855 779.723 43.215 c 778.82 43.395 777.559
 44.117 775.934 45.383 c 774.309 46.645 773.316 47.73 772.957 48.633 c 772.773
 49.352 772.684 51.066 772.684 53.777 c 772.684 69.48 l 772.684 72.188 772.773
 73.992 772.957 74.895 c 773.316 75.617 774.309 76.609 775.934 77.875 c 
777.559 79.137 778.82 79.949 779.723 80.309 c 780.629 80.492 782.703 80.582
 785.953 80.582 c h
833.336 80.582 m f
993.41 134.734 m 1009.656 148.27 l 1003.156 153.688 l 999.906 156.395 997.652
 158.02 996.387 158.559 c 995.305 158.922 993.137 159.102 989.891 159.102
 c 917.598 159.102 l 913.266 159.102 908.934 157.297 904.602 153.688 c 898.102
 148.27 l 893.77 144.66 891.602 140.148 891.602 134.734 c 891.602 48.09 
l 891.602 42.676 893.77 38.16 898.102 34.551 c 904.602 29.137 l 908.934 
25.527 913.266 23.723 917.598 23.723 c 980.684 23.723 l 984.293 23.723 988.625
 25.527 993.68 29.137 c 1000.449 34.551 l 1004.781 37.801 1006.945 42.312
 1006.945 48.09 c 1006.945 103.594 l 914.348 103.594 l 914.348 129.047 l
 914.348 131.754 914.438 133.559 914.617 134.461 c 914.98 135.184 915.973
 136.176 917.598 137.441 c 919.223 138.703 920.484 139.516 921.387 139.879
 c 922.289 140.059 924.367 140.148 927.613 140.148 c 980.141 140.148 l 983.391
 140.148 985.559 139.969 986.641 139.605 c 987.902 139.066 990.16 137.441
 993.41 134.734 c h
984.203 85.996 m 984.203 53.777 l 984.203 51.066 984.023 49.352 983.66 
48.633 c 983.48 47.73 982.578 46.645 980.953 45.383 c 979.328 44.117 978.066
 43.395 977.164 43.215 c 976.262 42.855 974.184 42.676 970.938 42.676 c 
927.613 42.676 l 924.367 42.676 922.289 42.855 921.387 43.215 c 920.484 
43.395 919.223 44.117 917.598 45.383 c 915.973 46.645 914.98 47.73 914.617
 48.633 c 914.438 49.352 914.348 51.066 914.348 53.777 c 914.348 85.996 
l h
984.203 85.996 m f
269.875 199.418 m 269.996 199.418 l 269.996 199.297 270.055 199.039 270.176
 198.641 c 275.875 180.277 l 278.547 180.277 l 271.586 201.277 l 268.285
 201.277 l 261.324 180.277 l 263.996 180.277 l 269.695 198.641 l 269.816
 199.039 269.875 199.297 269.875 199.418 c h
269.875 199.418 m f
300.73 180.277 2.52 21 re f
337.578 191.68 m 330.406 191.68 l 329.926 191.68 329.445 191.48 328.965
 191.078 c 328.156 190.391 l 327.738 190.047 327.527 189.648 327.527 189.188
 c 327.527 182.98 l 327.527 182.379 327.766 181.879 328.246 181.48 c 328.965
 180.879 l 329.445 180.48 329.926 180.277 330.406 180.277 c 338.387 180.277
 l 338.867 180.277 339.348 180.48 339.828 180.879 c 340.547 181.48 l 341.027
 181.879 341.266 182.379 341.266 182.98 c 341.266 184.18 l 338.746 184.18
 l 338.746 183.609 l 338.746 183.309 338.727 183.117 338.688 183.039 c 338.668
 182.938 338.566 182.82 338.387 182.68 c 338.207 182.539 338.066 182.457
 337.965 182.438 c 337.867 182.398 337.637 182.379 337.277 182.379 c 331.516
 182.379 l 331.156 182.379 330.926 182.398 330.828 182.438 c 330.727 182.457
 330.586 182.539 330.406 182.68 c 330.227 182.82 330.117 182.938 330.078
 183.039 c 330.059 183.117 330.047 183.309 330.047 183.609 c 330.047 188.348
 l 330.047 188.648 330.059 188.848 330.078 188.949 c 330.117 189.027 330.227
 189.141 330.406 189.277 c 330.586 189.418 330.727 189.508 330.828 189.547
 c 330.926 189.57 331.156 189.578 331.516 189.578 c 338.688 189.578 l 339.168
 189.578 339.648 189.777 340.125 190.18 c 340.848 190.777 l 341.328 191.18
 341.566 191.68 341.566 192.277 c 341.566 198.578 l 341.566 199.18 341.328
 199.68 340.848 200.078 c 340.125 200.68 l 339.648 201.078 339.168 201.277
 338.688 201.277 c 330.105 201.277 l 329.625 201.277 329.148 201.078 328.668
 200.68 c 327.945 200.078 l 327.465 199.68 327.227 199.18 327.227 198.578
 c 327.227 197.379 l 329.746 197.379 l 329.746 197.949 l 329.746 198.25 
329.758 198.449 329.777 198.547 c 329.816 198.629 329.926 198.738 330.105
 198.879 c 330.285 199.02 330.426 199.109 330.527 199.148 c 330.625 199.168
 330.855 199.18 331.215 199.18 c 337.578 199.18 l 337.938 199.18 338.168
 199.168 338.266 199.148 c 338.367 199.109 338.508 199.02 338.688 198.879
 c 338.867 198.738 338.965 198.629 338.988 198.547 c 339.027 198.449 339.047
 198.25 339.047 197.949 c 339.047 192.91 l 339.047 192.609 339.027 192.418
 338.988 192.34 c 338.965 192.238 338.867 192.117 338.688 191.98 c 338.508
 191.84 338.367 191.758 338.266 191.738 c 338.168 191.699 337.938 191.68
 337.578 191.68 c h
337.578 191.68 m f
365.594 180.277 2.52 21 re f
395.719 180.277 m 406.699 180.277 l 407.18 180.277 407.66 180.48 408.141
 180.879 c 408.859 181.48 l 409.34 181.879 409.578 182.379 409.578 182.98
 c 409.578 198.578 l 409.578 199.18 409.34 199.68 408.859 200.078 c 408.141
 200.68 l 407.66 201.078 407.18 201.277 406.699 201.277 c 395.719 201.277
 l 395.238 201.277 394.762 201.078 394.281 200.68 c 393.559 200.078 l 393.078
 199.68 392.84 199.18 392.84 198.578 c 392.84 182.98 l 392.84 182.379 393.078
 181.879 393.559 181.48 c 394.281 180.879 l 394.762 180.48 395.238 180.277
 395.719 180.277 c h
407.059 197.949 m 407.059 183.609 l 407.059 183.309 407.039 183.117 407
 183.039 c 406.98 182.938 406.879 182.82 406.699 182.68 c 406.52 182.539
 406.379 182.457 406.281 182.438 c 406.18 182.398 405.949 182.379 405.59
 182.379 c 396.828 182.379 l 396.469 182.379 396.238 182.398 396.141 182.438
 c 396.039 182.457 395.898 182.539 395.719 182.68 c 395.539 182.82 395.43
 182.938 395.391 183.039 c 395.371 183.117 395.359 183.309 395.359 183.609
 c 395.359 197.949 l 395.359 198.25 395.371 198.449 395.391 198.547 c 395.43
 198.629 395.539 198.738 395.719 198.879 c 395.898 199.02 396.039 199.109
 396.141 199.148 c 396.238 199.168 396.469 199.18 396.828 199.18 c 405.59
 199.18 l 405.949 199.18 406.18 199.168 406.281 199.148 c 406.379 199.109
 406.52 199.02 406.699 198.879 c 406.879 198.738 406.98 198.629 407 198.547
 c 407.039 198.449 407.059 198.25 407.059 197.949 c h
407.059 197.949 m f
447.824 197.379 m 447.914 197.348 l 447.773 196.867 447.703 196.391 447.703
 195.91 c 447.703 180.277 l 450.223 180.277 l 450.223 201.277 l 447.703 
201.277 l 436.723 184.418 l 436.633 184.449 l 436.773 184.93 436.844 185.41
 436.844 185.891 c 436.844 201.277 l 434.324 201.277 l 434.324 180.277 l
 436.844 180.277 l h
447.824 197.379 m f
500.039 190.508 11.461 1.949 re f
559.797 201.277 m 566.996 180.277 l 570.535 180.277 l 577.887 201.277 l
 575.367 201.277 l 573.809 196.93 l 563.816 196.93 l 562.316 201.277 l h
568.828 182.078 m 568.707 182.078 l 568.707 182.32 568.637 182.609 568.496
 182.949 c 564.445 194.98 l 573.176 194.98 l 569.035 182.949 l 568.898 182.609
 568.828 182.32 568.828 182.078 c h
568.828 182.078 m f
601.141 180.277 2.52 21 re f
653.438 190.508 11.461 1.949 re f
728.137 199.18 m 728.137 201.277 l 714.695 201.277 l 714.695 180.277 l 
728.137 180.277 l 728.137 182.379 l 717.215 182.379 l 717.215 189.578 l 
726.457 189.578 l 726.457 191.68 l 717.215 191.68 l 717.215 199.18 l h
728.137 199.18 m f
754.535 182.078 m 754.445 182.109 l 754.586 182.59 754.656 183.07 754.656
 183.547 c 754.656 201.277 l 752.137 201.277 l 752.137 180.277 l 756.219
 180.277 l 762.637 197.047 l 762.758 197.391 762.816 197.668 762.816 197.891
 c 762.938 197.891 l 762.938 197.668 762.996 197.391 763.117 197.047 c 769.566
 180.277 l 773.617 180.277 l 773.617 201.277 l 771.098 201.277 l 771.098
 183.547 l 771.098 183.07 771.168 182.59 771.309 182.109 c 771.219 182.078
 l 763.836 201.277 l 761.918 201.277 l 760.996 199.02 760.117 196.828 759.277
 194.707 c 758.457 192.59 757.777 190.82 757.238 189.398 c 756.695 187.957
 756.227 186.699 755.828 185.617 c 755.426 184.52 755.117 183.668 754.898
 183.07 c 754.676 182.469 754.559 182.141 754.535 182.078 c h
754.535 182.078 m f
809.676 192.609 m 809.016 192.07 l 808.777 191.867 808.605 191.758 808.508
 191.738 c 808.406 191.699 808.207 191.68 807.906 191.68 c 800.887 191.68
 l 800.887 199.18 l 808.719 199.18 l 809.078 199.18 809.309 199.168 809.406
 199.148 c 809.508 199.109 809.648 199.02 809.828 198.879 c 810.008 198.738
 810.105 198.629 810.129 198.547 c 810.168 198.449 810.188 198.25 810.188
 197.949 c 810.188 193.688 l 810.188 193.367 810.168 193.16 810.129 193.059
 c 810.086 192.957 809.938 192.809 809.676 192.609 c h
800.887 182.379 m 800.887 189.578 l 807.398 189.578 l 807.758 189.578 807.988
 189.57 808.086 189.547 c 808.207 189.508 808.367 189.41 808.566 189.25 
c 809.348 188.617 l 809.586 188.418 809.727 188.27 809.766 188.168 c 809.809
 188.07 809.828 187.848 809.828 187.508 c 809.828 183.609 l 809.828 183.309
 809.809 183.117 809.766 183.039 c 809.746 182.938 809.648 182.82 809.469
 182.68 c 809.289 182.539 809.148 182.457 809.047 182.438 c 808.949 182.398
 808.719 182.379 808.355 182.379 c h
810.008 190.297 m 810.008 190.449 l 810.246 190.449 810.527 190.578 810.848
 190.84 c 812.289 192.008 l 812.469 192.168 812.578 192.32 812.617 192.457
 c 812.676 192.578 812.707 192.82 812.707 193.18 c 812.707 198.578 l 812.707
 199.18 812.469 199.68 811.988 200.078 c 811.828 200.199 811.586 200.398
 811.266 200.68 c 810.789 201.078 810.309 201.277 809.828 201.277 c 798.367
 201.277 l 798.367 180.277 l 809.469 180.277 l 809.949 180.277 810.426 180.48
 810.906 180.879 c 811.629 181.48 l 812.105 181.879 812.348 182.379 812.348
 182.98 c 812.348 188.109 l 812.348 188.527 812.188 188.867 811.867 189.129
 c 810.848 189.91 l 810.527 190.168 810.246 190.297 810.008 190.297 c h
810.008 190.297 m f
850.129 199.18 m 850.129 201.277 l 836.688 201.277 l 836.688 180.277 l 
850.129 180.277 l 850.129 182.379 l 839.207 182.379 l 839.207 189.578 l 
848.449 189.578 l 848.449 191.68 l 839.207 191.68 l 839.207 199.18 l h
850.129 199.18 m f
874.129 201.277 m 874.129 180.277 l 885.23 180.277 l 885.75 180.277 886.23
 180.48 886.668 180.879 c 889.551 183.277 l 890.027 183.68 890.27 184.078
 890.27 184.48 c 890.27 197.078 l 890.27 197.48 890.027 197.879 889.551 
198.277 c 886.668 200.68 l 886.23 201.078 885.75 201.277 885.23 201.277 
c h
887.75 196.18 m 887.75 185.379 l 887.75 184.98 887.508 184.578 887.027 
184.18 c 885.59 182.98 l 885.148 182.578 884.668 182.379 884.148 182.379
 c 876.648 182.379 l 876.648 199.18 l 884.148 199.18 l 884.668 199.18 885.148
 198.98 885.59 198.578 c 887.027 197.379 l 887.508 196.98 887.75 196.578
 887.75 196.18 c h
887.75 196.18 m f
914.266 201.277 m 914.266 180.277 l 925.367 180.277 l 925.887 180.277 926.367
 180.48 926.805 180.879 c 929.688 183.277 l 930.164 183.68 930.406 184.078
 930.406 184.48 c 930.406 197.078 l 930.406 197.48 930.164 197.879 929.688
 198.277 c 926.805 200.68 l 926.367 201.078 925.887 201.277 925.367 201.277
 c h
927.887 196.18 m 927.887 185.379 l 927.887 184.98 927.645 184.578 927.164
 184.18 c 925.727 182.98 l 925.285 182.578 924.805 182.379 924.285 182.379
 c 916.785 182.379 l 916.785 199.18 l 924.285 199.18 l 924.805 199.18 925.285
 198.98 925.727 198.578 c 927.164 197.379 l 927.645 196.98 927.887 196.578
 927.887 196.18 c h
927.887 196.18 m f
967.844 199.18 m 967.844 201.277 l 954.402 201.277 l 954.402 180.277 l 
967.844 180.277 l 967.844 182.379 l 956.922 182.379 l 956.922 189.578 l 
966.164 189.578 l 966.164 191.68 l 956.922 191.68 l 956.922 199.18 l h
967.844 199.18 m f
991.844 201.277 m 991.844 180.277 l 1002.945 180.277 l 1003.465 180.277
 1003.945 180.48 1004.383 180.879 c 1007.266 183.277 l 1007.742 183.68 1007.984
 184.078 1007.984 184.48 c 1007.984 197.078 l 1007.984 197.48 1007.742 197.879
 1007.266 198.277 c 1004.383 200.68 l 1003.945 201.078 1003.465 201.277 
1002.945 201.277 c h
1005.465 196.18 m 1005.465 185.379 l 1005.465 184.98 1005.223 184.578 1004.742
 184.18 c 1003.305 182.98 l 1002.863 182.578 1002.383 182.379 1001.863 182.379
 c 994.363 182.379 l 994.363 199.18 l 1001.863 199.18 l 1002.383 199.18 
1002.863 198.98 1003.305 198.578 c 1004.742 197.379 l 1005.223 196.98 1005.465
 196.578 1005.465 196.18 c h
1005.465 196.18 m f
Q Q
showpage
%%Trailer
end
%%EOF
