%!PS-Adobe-3.0 EPSF-3.0
%%Creator: cairo 1.15.10 (http://cairographics.org)
%%CreationDate: Wed Oct 16 17:45:55 2019
%%Pages: 1
%%DocumentData: Clean7Bit
%%LanguageLevel: 2
%%BoundingBox: 0 0 225 225
%%EndComments
%%BeginProlog
50 dict begin
/q { gsave } bind def
/Q { grestore } bind def
/cm { 6 array astore concat } bind def
/w { setlinewidth } bind def
/J { setlinecap } bind def
/j { setlinejoin } bind def
/M { setmiterlimit } bind def
/d { setdash } bind def
/m { moveto } bind def
/l { lineto } bind def
/c { curveto } bind def
/h { closepath } bind def
/re { exch dup neg 3 1 roll 5 3 roll moveto 0 rlineto
      0 exch rlineto 0 rlineto closepath } bind def
/S { stroke } bind def
/f { fill } bind def
/f* { eofill } bind def
/n { newpath } bind def
/W { clip } bind def
/W* { eoclip } bind def
/BT { } bind def
/ET { } bind def
/BDC { mark 3 1 roll /BDC pdfmark } bind def
/EMC { mark /EMC pdfmark } bind def
/cairo_store_point { /cairo_point_y exch def /cairo_point_x exch def } def
/Tj { show currentpoint cairo_store_point } bind def
/TJ {
  {
    dup
    type /stringtype eq
    { show } { -0.001 mul 0 cairo_font_matrix dtransform rmoveto } ifelse
  } forall
  currentpoint cairo_store_point
} bind def
/cairo_selectfont { cairo_font_matrix aload pop pop pop 0 0 6 array astore
    cairo_font exch selectfont cairo_point_x cairo_point_y moveto } bind def
/Tf { pop /cairo_font exch def /cairo_font_matrix where
      { pop cairo_selectfont } if } bind def
/Td { matrix translate cairo_font_matrix matrix concatmatrix dup
      /cairo_font_matrix exch def dup 4 get exch 5 get cairo_store_point
      /cairo_font where { pop cairo_selectfont } if } bind def
/Tm { 2 copy 8 2 roll 6 array astore /cairo_font_matrix exch def
      cairo_store_point /cairo_font where { pop cairo_selectfont } if } bind def
/g { setgray } bind def
/rg { setrgbcolor } bind def
/d1 { setcachedevice } bind def
/cairo_data_source {
  CairoDataIndex CairoData length lt
    { CairoData CairoDataIndex get /CairoDataIndex CairoDataIndex 1 add def }
    { () } ifelse
} def
/cairo_flush_ascii85_file { cairo_ascii85_file status { cairo_ascii85_file flushfile } if } def
/cairo_image { image cairo_flush_ascii85_file } def
/cairo_imagemask { imagemask cairo_flush_ascii85_file } def
%%EndProlog
%%BeginSetup
%%EndSetup
%%Page: 1 1
%%BeginPageSetup
%%PageBoundingBox: 0 0 225 225
%%EndPageSetup
q 0 0 225 225 rectclip
1 0 0 -1 0 225 cm q
0.94902 g
0 0 225 225 rectfill
0.0705882 0.235294 0.458824 rg
111.703 25.516 m 105.965 25.977 99.43 29.75 92.895 33.52 c 92.895 33.52
 73.289 44.84 73.289 44.84 c 73.289 44.84 53.684 56.16 53.684 56.16 c 47.148
 59.934 40.613 63.707 37.348 69.363 c 34.078 75.023 34.078 82.57 34.078 
90.117 c 34.078 90.117 34.078 112.754 34.078 112.754 c 34.078 112.754 34.078
 135.395 34.078 135.395 c 34.078 142.941 34.078 150.488 37.348 156.145 c
 40.613 161.805 47.148 165.578 53.684 169.352 c 53.684 169.352 73.289 180.668
 73.289 180.668 c 73.289 180.668 92.895 191.988 92.895 191.988 c 99.43 195.762
 105.965 199.535 112.5 199.535 c 119.035 199.535 125.57 195.762 132.105 
191.988 c 132.105 191.988 151.711 180.668 151.711 180.668 c 151.711 180.668
 171.316 169.352 171.316 169.352 c 177.852 165.578 184.387 161.805 187.652
 157.066 c 190.922 152.332 190.922 146.629 190.922 140.926 c 190.922 140.926
 190.922 123.824 190.922 123.824 c 190.922 123.824 190.922 106.719 190.922
 106.719 c 190.922 101.016 190.922 95.316 190.066 92.957 c 189.211 90.602
 187.5 91.59 185.785 92.578 c 185.785 92.578 180.652 95.543 180.652 95.543
 c 180.652 95.543 175.516 98.508 175.516 98.508 c 173.805 99.496 172.094
 100.484 171.238 102.84 c 170.383 105.199 170.383 108.922 170.383 112.648
 c 170.383 112.648 170.383 123.824 170.383 123.824 c 170.383 123.824 170.383
 134.996 170.383 134.996 c 170.383 138.723 170.383 142.449 167.969 145.703
 c 165.559 148.957 160.734 151.742 155.91 154.527 c 155.91 154.527 141.441
 162.883 141.441 162.883 c 141.441 162.883 126.969 171.238 126.969 171.238
 c 122.148 174.023 117.324 176.809 112.5 176.809 c 107.676 176.809 102.852
 174.023 98.031 171.238 c 98.031 171.238 83.559 162.883 83.559 162.883 c
 83.559 162.883 69.09 154.527 69.09 154.527 c 64.266 151.742 59.441 148.957
 57.031 144.781 c 54.617 140.605 54.617 135.035 54.617 129.465 c 54.617 
129.465 54.617 112.754 54.617 112.754 c 54.617 112.754 54.617 96.047 54.617
 96.047 c 54.617 90.477 54.617 84.906 57.031 80.73 c 59.441 76.551 64.266
 73.766 69.09 70.98 c 69.09 70.98 83.559 62.629 83.559 62.629 c 83.559 62.629
 98.031 54.273 98.031 54.273 c 102.852 51.488 107.676 48.703 111.703 48.242
 c 115.727 47.781 118.953 49.645 122.18 51.504 c 122.18 51.504 131.855 57.094
 131.855 57.094 c 131.855 57.094 141.535 62.68 141.535 62.68 c 144.762 64.543
 147.988 66.406 148.637 67.895 c 149.285 69.383 147.355 70.496 145.43 71.609
 c 145.43 71.609 139.648 74.945 139.648 74.945 c 139.648 74.945 133.863 
78.285 133.863 78.285 c 131.938 79.398 130.012 80.512 128.426 80.801 c 126.844
 81.09 125.602 80.551 124.344 80.09 c 123.082 79.629 121.793 79.242 120.488
 78.93 c 119.188 78.621 117.863 78.383 116.527 78.223 c 115.195 78.066 113.848
 77.984 110.863 78.41 c 107.875 78.836 103.281 79.762 99.266 81.445 c 95.25
 83.125 91.484 85.664 88.445 88.703 c 85.406 91.738 82.867 95.504 81.188
 99.52 c 79.508 103.539 78.578 108.133 78.578 112.754 c 78.578 117.379 79.508
 121.973 81.188 125.988 c 82.867 130.008 85.406 133.77 88.445 136.809 c 
91.484 139.848 95.25 142.387 99.266 144.066 c 103.281 145.75 107.875 146.676
 112.5 146.676 c 117.125 146.676 121.719 145.75 125.734 144.066 c 129.75
 142.387 133.516 139.848 136.555 136.809 c 139.594 133.77 142.133 130.008
 143.812 125.988 c 145.492 121.973 146.422 117.379 146.836 114.309 c 147.25
 111.234 147.148 109.711 146.945 108.215 c 146.746 106.715 146.445 105.227
 146.051 103.77 c 145.656 102.312 145.164 100.875 144.582 99.48 c 144.004
 98.082 143.324 96.715 144.141 95.367 c 144.957 94.016 147.27 92.68 149.582
 91.348 c 149.582 91.348 156.516 87.344 156.516 87.344 c 156.516 87.344 
163.449 83.34 163.449 83.34 c 163.449 83.34 170.383 79.336 170.383 79.336
 c 170.383 79.336 175.516 76.371 175.516 76.371 c 175.516 76.371 180.652
 73.406 180.652 73.406 c 180.652 73.406 185.785 70.441 185.785 70.441 c 
187.5 69.453 189.211 68.465 189.266 67.512 c 189.324 66.555 187.727 65.633
 186.129 64.711 c 186.129 64.711 181.336 61.945 181.336 61.945 c 181.336
 61.945 176.543 59.176 176.543 59.176 c 176.543 59.176 171.75 56.41 171.75
 56.41 c 171.75 56.41 156.938 47.859 156.938 47.859 c 156.938 47.859 142.125
 39.305 142.125 39.305 c 142.125 39.305 127.312 30.754 127.312 30.754 c 
122.375 27.902 117.438 25.055 111.703 25.516 c h
107.82 95.082 m 109.09 95.082 110.355 95.336 111.457 95.797 c 112.562 96.262
 113.598 96.957 114.434 97.793 c 115.27 98.629 115.969 99.664 116.43 100.77
 c 116.891 101.875 117.148 103.137 117.148 104.41 c 117.148 105.68 116.891
 106.945 116.43 108.047 c 115.969 109.152 115.27 110.188 114.434 111.023
 c 113.598 111.859 112.562 112.559 111.457 113.02 c 110.355 113.48 109.09
 113.738 107.82 113.738 c 106.547 113.738 105.285 113.48 104.18 113.02 c
 103.074 112.559 102.039 111.859 101.203 111.023 c 100.367 110.188 99.672
 109.152 99.207 108.047 c 98.746 106.945 98.492 105.68 98.492 104.41 c 98.492
 103.137 98.746 101.875 99.207 100.77 c 99.672 99.664 100.367 98.629 101.203
 97.793 c 102.039 96.957 103.074 96.262 104.18 95.797 c 105.285 95.336 106.547
 95.082 107.82 95.082 c h
107.82 95.082 m f*
Q Q
showpage
%%Trailer
end
%%EOF
