<?xml version="1.0" encoding="UTF-8" standalone="no"?>
<!-- Created with Inkscape (http://www.inkscape.org/) -->

<svg
   xmlns:dc="http://purl.org/dc/elements/1.1/"
   xmlns:cc="http://creativecommons.org/ns#"
   xmlns:rdf="http://www.w3.org/1999/02/22-rdf-syntax-ns#"
   xmlns:svg="http://www.w3.org/2000/svg"
   xmlns="http://www.w3.org/2000/svg"
   xmlns:sodipodi="http://sodipodi.sourceforge.net/DTD/sodipodi-0.dtd"
   xmlns:inkscape="http://www.inkscape.org/namespaces/inkscape"
   width="44.979168mm"
   height="44.979168mm"
   viewBox="0 0 159.37499 159.375"
   id="svg4608"
   version="1.1"
   inkscape:version="0.92.3 (2405546, 2018-03-11)"
   sodipodi:docname="profile_ink.svg"
   inkscape:export-filename="/home/fdf/Downloads/profile.png"
   inkscape:export-xdpi="300"
   inkscape:export-ydpi="300">
  <defs
     id="defs4610">
    <inkscape:path-effect
       effect="bspline"
       id="path-effect3441"
       is_visible="true"
       weight="33.333333"
       steps="2"
       helper_size="0"
       apply_no_weight="true"
       apply_with_weight="true"
       only_selected="true" />
    <inkscape:path-effect
       effect="bspline"
       id="path-effect2211"
       is_visible="true"
       weight="33.333333"
       steps="2"
       helper_size="0"
       apply_no_weight="true"
       apply_with_weight="true"
       only_selected="true" />
    <inkscape:path-effect
       effect="bspline"
       id="path-effect2161"
       is_visible="true"
       weight="33.333333"
       steps="2"
       helper_size="0"
       apply_no_weight="true"
       apply_with_weight="true"
       only_selected="true" />
    <inkscape:path-effect
       effect="bspline"
       id="path-effect2091"
       is_visible="true"
       weight="33.5333"
       steps="2"
       helper_size="0"
       apply_no_weight="true"
       apply_with_weight="true"
       only_selected="true" />
    <inkscape:path-effect
       effect="bspline"
       id="path-effect966"
       is_visible="true"
       weight="33.333333"
       steps="2"
       helper_size="0"
       apply_no_weight="true"
       apply_with_weight="true"
       only_selected="false" />
    <inkscape:path-effect
       effect="bspline"
       id="path-effect840"
       is_visible="true"
       weight="33.333333"
       steps="2"
       helper_size="0"
       apply_no_weight="true"
       apply_with_weight="true"
       only_selected="false" />
    <inkscape:path-effect
       effect="bspline"
       id="path-effect4794"
       is_visible="true"
       weight="3.2"
       steps="2"
       helper_size="0"
       apply_no_weight="true"
       apply_with_weight="true"
       only_selected="false" />
    <inkscape:path-effect
       effect="bspline"
       id="path-effect4790"
       is_visible="true"
       weight="5"
       steps="2"
       helper_size="0"
       apply_no_weight="true"
       apply_with_weight="true"
       only_selected="false" />
    <inkscape:path-effect
       effect="bspline"
       id="path-effect2096"
       is_visible="true"
       weight="33.333333"
       steps="2"
       helper_size="0"
       apply_no_weight="true"
       apply_with_weight="true"
       only_selected="true" />
    <inkscape:path-effect
       effect="bspline"
       id="path-effect2211-0"
       is_visible="true"
       weight="33.333333"
       steps="2"
       helper_size="0"
       apply_no_weight="true"
       apply_with_weight="true"
       only_selected="true" />
  </defs>
  <sodipodi:namedview
     id="base"
     pagecolor="#ffffff"
     bordercolor="#666666"
     borderopacity="1.0"
     inkscape:pageopacity="0.0"
     inkscape:pageshadow="2"
     inkscape:zoom="3.2623472"
     inkscape:cx="62.431048"
     inkscape:cy="86.44978"
     inkscape:document-units="px"
     inkscape:current-layer="layer1"
     showgrid="false"
     fit-margin-top="0"
     fit-margin-left="0"
     fit-margin-right="0"
     fit-margin-bottom="0"
     inkscape:window-width="1680"
     inkscape:window-height="999"
     inkscape:window-x="0"
     inkscape:window-y="25"
     inkscape:window-maximized="1"
     showguides="false"
     inkscape:guide-bbox="true"
     inkscape:snap-smooth-nodes="true"
     inkscape:object-nodes="true"
     inkscape:snap-intersection-paths="true"
     inkscape:object-paths="true"
     inkscape:snap-midpoints="false"
     inkscape:snap-global="true"
     inkscape:snap-text-baseline="false"
     inkscape:snap-page="true" />
  <metadata
     id="metadata4613">
    <rdf:RDF>
      <cc:Work
         rdf:about="">
        <dc:format>image/svg+xml</dc:format>
        <dc:type
           rdf:resource="http://purl.org/dc/dcmitype/StillImage" />
        <dc:title />
      </cc:Work>
    </rdf:RDF>
  </metadata>
  <g
     inkscape:label="Layer 1"
     inkscape:groupmode="layer"
     id="layer1"
     transform="translate(38.364136,-583.06525)">
    <g
       id="g6170">
      <rect
         y="583.06525"
         x="-38.364136"
         height="159.37498"
         width="159.37498"
         id="rect4773"
         style="opacity:1;vector-effect:none;fill:#f2f2f2;fill-opacity:1;fill-rule:nonzero;stroke:none;stroke-width:2.49999976;stroke-linecap:butt;stroke-linejoin:miter;stroke-miterlimit:4;stroke-dasharray:none;stroke-dashoffset:0;stroke-opacity:1;paint-order:markers stroke fill" />
      <path
         inkscape:original-d="m 41.323358,598.79181 c -4.62851,2.67307 -13.887106,8.01763 -13.887106,8.01763 0,0 -13.887113,8.01764 -13.887113,8.01764 0,0 -13.88711297,8.01763 -13.88711297,8.01763 0,0 -9.25754293,5.34563 -13.88710603,8.01765 4.95e-4,5.34569 0,16.03551 0,16.03551 0,0 0,16.03552 0,16.03552 0,0 0,16.03551 0,16.03551 0,0 4.95e-4,10.69086 0,16.03551 4.6295631,2.67308 13.88710603,8.01764 13.88710603,8.01764 0,0 13.88711297,8.01763 13.88711297,8.01763 0,0 13.887113,8.01765 13.887113,8.01765 0,0 9.258596,5.34561 13.887106,8.01763 4.62957,-2.67202 13.88712,-8.01763 13.88712,-8.01763 0,0 13.887106,-8.01765 13.887106,-8.01765 0,0 13.887092,-8.01763 13.887092,-8.01763 0,0 9.258635,-5.34456 13.887117,-8.01764 0,-4.03807 0,-12.11578 0,-12.11578 0,0 0,-12.11578 0,-12.11578 0,0 0,-12.11578 0,-12.11578 0,0 0,-8.07666 0,-12.11578 -1.211849,0.70051 -3.637139,2.09994 -3.637139,2.09994 0,0 -3.637209,2.09995 -3.637209,2.09995 0,0 -3.63716,2.09993 -3.63716,2.09993 0,0 -2.42425,1.4005 -3.637157,2.09995 0,2.63916 0,7.9159 0,7.9159 0,0 0,7.91589 0,7.91589 0,0 0,7.9159 0,7.9159 0,0 0,5.27779 0,7.91589 -3.416117,1.97317 -10.249932,5.91794 -10.249932,5.91794 0,0 -10.249946,5.91793 -10.249946,5.91793 0,0 -10.249946,5.91793 -10.249946,5.91793 0,0 -6.832777,3.94582 -10.249946,5.91794 -3.416116,-1.97212 -10.249939,-5.91794 -10.249939,-5.91794 0,0 -10.249939,-5.91793 -10.249939,-5.91793 0,0 -10.249938,-5.91793 -10.249938,-5.91793 0,0 -6.8327706,-3.94477 -10.24994667,-5.91794 4.9493e-4,-3.94468 0,-11.83563 0,-11.83563 0,0 0,-11.83562 0,-11.83562 0,0 0,-11.83563 0,-11.83563 0,0 4.9493e-4,-7.8899 0,-11.83563 3.41717607,-1.97212 10.24994667,-5.91794 10.24994667,-5.91794 0,0 10.249938,-5.91794 10.249938,-5.91794 0,0 10.249939,-5.91793 10.249939,-5.91793 0,0 6.833823,-3.94476 10.249939,-5.91793 2.285637,1.31988 6.855313,3.95806 6.855313,3.95806 0,0 6.855328,3.95808 6.855328,3.95808 0,0 6.855299,3.95806 6.855299,3.95806 0,0 4.570736,2.63924 6.85532,3.95808 -1.364789,0.78882 -4.09597,2.36491 -4.09597,2.36491 0,0 -4.095977,2.36489 -4.095977,2.36489 0,0 -4.095977,2.36492 -4.095977,2.36492 0,0 -2.730122,1.57712 -4.09597,2.3649 -0.8762,-0.37877 -1.734394,-0.81066 -2.63014,-1.13788 -0.89576,-0.32722 -1.808981,-0.60199 -2.734994,-0.82321 -0.92602,-0.22119 -1.864831,-0.38885 -2.811757,-0.50181 -0.946939,-0.11296 -1.901978,-0.17124 -2.860475,-0.17373 -3.408727,0 -6.656102,0.69084 -9.609756,1.94013 -2.953654,1.24929 -5.613587,3.05704 -7.84743,5.29088 -2.233844,2.23384 -4.041591,4.89378 -5.290881,7.84744 -1.24929,2.95365 -1.94013,6.20102 -1.94013,9.60975 0,3.40873 0.69084,6.65611 1.94013,9.60976 1.24929,2.95366 3.057037,5.61359 5.290881,7.84743 2.233843,2.23385 4.893776,4.0416 7.84743,5.29089 2.953654,1.24929 6.201029,1.94013 9.609756,1.94013 3.408735,0 6.656109,-0.69084 9.609763,-1.94013 2.953654,-1.24929 5.61358,-3.05704 7.847437,-5.29089 2.233823,-2.23384 4.041584,-4.89377 5.290874,-7.84743 1.249297,-2.95365 1.940137,-6.20103 1.940137,-9.60976 -0.0028,-1.08271 -0.07655,-2.16048 -0.219817,-3.22664 -0.143242,-1.06617 -0.355879,-2.12072 -0.636112,-3.157 -0.280232,-1.03628 -0.628032,-2.05428 -1.041623,-3.04734 -0.413605,-0.99306 -0.957026,-1.93126 -1.43633,-2.89767 1.63766,-0.94474 4.911364,-2.83578 4.911364,-2.83578 0,0 4.911356,-2.83577 4.911356,-2.83577 0,0 4.911357,-2.83577 4.911357,-2.83577 0,0 4.911364,-2.83576 4.911364,-2.83576 0,0 3.637157,-2.09994 3.637157,-2.09994 0,0 3.63716,-2.09994 3.63716,-2.09994 0,0 3.637209,-2.09995 3.637209,-2.09995 0,0 2.42529,-1.39944 3.637139,-2.09994 -1.13103,-0.65277 -3.394625,-1.95988 -3.394625,-1.95988 0,0 -3.394626,-1.95986 -3.394626,-1.95986 0,0 -3.394618,-1.95986 -3.394618,-1.95986 0,0 -3.394633,-1.95987 -3.394633,-1.95987 0,0 -10.492478,-6.05778 -10.492478,-6.05778 0,0 -10.492494,-6.05777 -10.492494,-6.05777 0,0 -10.492467,-6.05776 -10.492467,-6.05776 0,0 -6.994464,-4.03799 -10.492494,-6.05777 z m -3.315542,51.44017 c 0.937396,0 1.83043,0.18998 2.64268,0.53353 0.812264,0.34357 1.543743,0.84069 2.158043,1.455 0.614308,0.61431 1.111436,1.34579 1.454998,2.15804 0.343548,0.81226 0.53353,1.70529 0.53353,2.64268 0,0.93742 -0.189982,1.83044 -0.53353,2.64269 -0.343562,0.81225 -0.84069,1.54374 -1.454998,2.15805 -0.6143,0.61431 -1.345779,1.11143 -2.158043,1.45499 -0.81225,0.34355 -1.705284,0.53353 -2.64268,0.53353 -0.937403,0 -1.83043,-0.18998 -2.64268,-0.53353 -0.812257,-0.34356 -1.543736,-0.84068 -2.15805,-1.45499 -0.614308,-0.61431 -1.111436,-1.3458 -1.454991,-2.15805 -0.343548,-0.81225 -0.533537,-1.70527 -0.533537,-2.64269 0,-0.93739 0.189989,-1.83042 0.533537,-2.64268 0.343555,-0.81225 0.840683,-1.54373 1.454991,-2.15804 0.614314,-0.61431 1.345793,-1.11143 2.15805,-1.455 0.81225,-0.34355 1.705277,-0.53353 2.64268,-0.53353 z"
         inkscape:path-effect="#path-effect3441"
         sodipodi:nodetypes="cccccccccccccccccccccccccccccccccccccccccccccccccccccssscssssssssssscssscccccccccccccccccsssssssssssssssss"
         inkscape:connector-curvature="0"
         id="path2659-8"
         d="m 40.757985,601.13784 c -4.063496,0.32642 -8.692698,2.99906 -13.321733,5.6716 0,0 -13.887113,8.01764 -13.887113,8.01764 0,0 -13.88711297,8.01763 -13.88711297,8.01763 -4.62903533,2.67255 -9.25790433,5.345 -11.57250503,9.35417 -2.314601,4.00917 -2.314601,9.35382 -2.314601,14.69899 0,0 0,16.03552 0,16.03552 0,0 0,16.03551 0,16.03551 0,5.34517 0,10.69086 2.314831,14.69964 2.3148311,4.00878 6.9432397,6.68096 11.57227503,9.35351 0,0 13.88711297,8.01763 13.88711297,8.01763 0,0 13.887113,8.01765 13.887113,8.01765 4.629035,2.67254 9.258691,5.34544 13.887504,5.34522 4.628813,-2.3e-4 9.257682,-2.67268 13.886722,-5.34522 0,0 13.887106,-8.01765 13.887106,-8.01765 0,0 13.887092,-8.01763 13.887092,-8.01763 4.629039,-2.67255 9.258265,-5.3452 11.572691,-8.70046 2.314426,-3.35525 2.314426,-7.39437 2.314426,-11.43296 0,0 0,-12.11578 0,-12.11578 0,0 0,-12.11578 0,-12.11578 0,-4.03859 0,-8.07666 -0.606106,-9.74628 -0.606105,-1.66962 -1.818653,-0.96954 -3.031033,-0.26956 0,0 -3.637209,2.09995 -3.637209,2.09995 0,0 -3.63716,2.09993 -3.63716,2.09993 -1.212386,0.69998 -2.424611,1.39987 -3.030884,3.06949 -0.606273,1.66962 -0.606273,4.30773 -0.606273,6.94636 0,0 0,7.91589 0,7.91589 0,0 0,7.9159 0,7.9159 0,2.63863 0,5.27779 -1.708238,7.58311 -1.708237,2.30533 -5.12505,4.27807 -8.541694,6.25072 0,0 -10.249946,5.91793 -10.249946,5.91793 0,0 -10.249946,5.91793 -10.249946,5.91793 -3.416649,1.97265 -6.833135,3.9452 -10.249551,3.94543 -3.416416,2.2e-4 -6.833688,-1.97278 -10.250334,-3.94543 0,0 -10.249939,-5.91793 -10.249939,-5.91793 0,0 -10.249938,-5.91793 -10.249938,-5.91793 -3.4166489,-1.97265 -6.8326758,-3.94493 -8.5413112,-6.90378 -1.70863547,-2.95884 -1.70863547,-6.90458 -1.70863547,-10.84979 0,0 0,-11.83562 0,-11.83562 0,0 0,-11.83563 0,-11.83563 0,-3.94521 0,-7.8899 1.70840807,-10.84914 1.7084081,-2.95923 5.1248897,-4.93178 8.5415386,-6.90443 0,0 10.249938,-5.91794 10.249938,-5.91794 0,0 10.249939,-5.91793 10.249939,-5.91793 3.416646,-1.97264 6.833462,-3.94538 9.684567,-4.2718 2.851104,-0.32641 5.135581,0.99258 7.420685,2.31193 0,0 6.855328,3.95808 6.855328,3.95808 0,0 6.855299,3.95806 6.855299,3.95806 2.285107,1.31936 4.57083,2.63908 5.030502,3.69268 0.459672,1.0536 -0.905829,1.84201 -2.271152,2.63031 0,0 -4.095977,2.36489 -4.095977,2.36489 0,0 -4.095977,2.36492 -4.095977,2.36492 -1.365323,0.7883 -2.730478,1.5765 -3.851269,1.78119 -1.120791,0.20469 -2.001072,-0.17615 -2.893786,-0.50236 -0.892713,-0.32621 -1.805906,-0.60107 -2.728824,-0.82154 -0.922918,-0.22047 -1.861748,-0.38802 -2.805512,-0.50051 -0.943764,-0.1125 -1.89882,-0.1705 -4.013996,0.13112 -2.115177,0.30161 -5.369384,0.95861 -8.21438,2.1493 -2.844995,1.19069 -5.511591,2.98855 -7.663935,5.1409 -2.152344,2.15234 -3.950212,4.81894 -5.140902,7.66394 -1.19069,2.845 -1.847687,6.0992 -1.847687,9.37443 0,3.27523 0.656998,6.52944 1.847688,9.37444 1.19069,2.84499 2.988555,5.51159 5.140902,7.66393 2.152347,2.15235 4.818941,3.95022 7.663935,5.14091 2.844995,1.19069 6.099202,1.84769 9.374434,1.84769 3.275232,0 6.529438,-0.657 9.374433,-1.84769 2.844995,-1.19069 5.511585,-2.98855 7.663933,-5.1409 2.152347,-2.15234 3.950215,-4.81894 5.140906,-7.66394 1.190691,-2.845 1.847691,-6.09921 2.141597,-8.27577 0.293905,-2.17657 0.22048,-3.25436 0.07798,-4.31599 -0.142495,-1.06163 -0.354985,-2.11621 -0.634018,-3.14808 -0.279032,-1.03188 -0.626981,-2.04983 -1.038947,-3.03859 -0.411967,-0.98876 -0.892475,-1.95814 -0.313369,-2.91408 0.579106,-0.95594 2.216049,-1.9011 3.85317,-2.84636 0,0 4.911356,-2.83577 4.911356,-2.83577 0,0 4.911357,-2.83577 4.911357,-2.83577 0,0 4.911364,-2.83576 4.911364,-2.83576 0,0 3.637157,-2.09994 3.637157,-2.09994 0,0 3.63716,-2.09994 3.63716,-2.09994 0,0 3.637209,-2.09995 3.637209,-2.09995 1.21238,-0.69998 2.424932,-1.40006 2.46557,-2.07647 0.04064,-0.67641 -1.091514,-1.33006 -2.223056,-1.98335 0,0 -3.394626,-1.95986 -3.394626,-1.95986 0,0 -3.394618,-1.95986 -3.394618,-1.95986 0,0 -3.394633,-1.95987 -3.394633,-1.95987 0,0 -10.492478,-6.05778 -10.492478,-6.05778 0,0 -10.492494,-6.05777 -10.492494,-6.05777 0,0 -10.492467,-6.05776 -10.492467,-6.05776 -3.497498,-2.01926 -6.99437,-4.03815 -11.057867,-3.71174 z m -2.750172,49.27598 c 0.900688,0 1.7956,0.18067 2.577977,0.50812 0.782377,0.32744 1.515683,0.82185 2.107578,1.41375 0.591895,0.59189 1.086308,1.3252 1.413748,2.10758 0.32744,0.78237 0.508113,1.67728 0.508111,2.57797 -3e-6,0.9007 -0.180673,1.7956 -0.508111,2.57797 -0.327438,0.78237 -0.821855,1.51569 -1.41375,2.10758 -0.591894,0.5919 -1.325202,1.08631 -2.107577,1.41375 -0.782376,0.32744 -1.677288,0.50811 -2.577976,0.50811 -0.900688,0 -1.795594,-0.18067 -2.577968,-0.50811 -0.782373,-0.32744 -1.515681,-0.82185 -2.10758,-1.41375 -0.591899,-0.59189 -1.086314,-1.32521 -1.413752,-2.10758 -0.327437,-0.78237 -0.50811,-1.67727 -0.508112,-2.57797 -3e-6,-0.90069 0.180673,-1.7956 0.508112,-2.57797 0.327439,-0.78238 0.821851,-1.51569 1.41375,-2.10759 0.5919,-0.59189 1.325206,-1.0863 2.107581,-1.41375 0.782375,-0.32744 1.677281,-0.50811 2.577969,-0.50811 z"
         style="color:#000000;clip-rule:nonzero;display:inline;overflow:visible;visibility:visible;opacity:1;isolation:auto;mix-blend-mode:normal;color-interpolation:sRGB;color-interpolation-filters:linearRGB;solid-color:#000000;solid-opacity:1;fill:#123c75;fill-opacity:1;fill-rule:evenodd;stroke:none;stroke-width:7.08661461;stroke-linecap:butt;stroke-linejoin:round;stroke-miterlimit:4;stroke-dasharray:none;stroke-dashoffset:0;stroke-opacity:1;color-rendering:auto;image-rendering:auto;shape-rendering:auto;text-rendering:auto;enable-background:accumulate" />
    </g>
  </g>
</svg>
