v 0.032913 0.020718 0
v 0.033 0.02 0
l 1 2
v 0.032246 0.021989 0
v 0.032656 0.021394 0
l 3 4
v 0.032656 0.021394 0
v 0.032913 0.020718 0
l 5 6
v 0.031704 0.022469 0
v 0.032246 0.021989 0
l 7 8
v 0.031064 0.022805 0
v 0.031704 0.022469 0
l 9 10
v 0.030362 0.022978 0
v 0.031064 0.022805 0
l 11 12
v 0.029638 0.022978 0
v 0.030362 0.022978 0
l 13 14
v 0.028936 0.022805 0
v 0.029638 0.022978 0
l 15 16
v 0.028296 0.022469 0
v 0.028936 0.022805 0
l 17 18
v 0.027754 0.021989 0
v 0.028296 0.022469 0
l 19 20
v 0.027344 0.021394 0
v 0.027754 0.021989 0
l 21 22
v 0.027087 0.020718 0
v 0.027344 0.021394 0
l 23 24
v 0.027 0.02 0
v 0.027087 0.020718 0
l 25 26
v 0.027087 0.019282 0
v 0.027 0.02 0
l 27 28
v 0.027344 0.018606 0
v 0.027087 0.019282 0
l 29 30
v 0.027754 0.018011 0
v 0.027344 0.018606 0
l 31 32
v 0.028296 0.017531 0
v 0.027754 0.018011 0
l 33 34
v 0.028936 0.017195 0
v 0.028296 0.017531 0
l 35 36
v 0.029638 0.017022 0
v 0.028936 0.017195 0
l 37 38
v 0.030362 0.017022 0
v 0.029638 0.017022 0
l 39 40
v 0.031064 0.017195 0
v 0.030362 0.017022 0
l 41 42
v 0.031704 0.017531 0
v 0.031064 0.017195 0
l 43 44
v 0.032246 0.018011 0
v 0.031704 0.017531 0
l 45 46
v 0.032656 0.018606 0
v 0.032246 0.018011 0
l 47 48
v 0.032913 0.019282 0
v 0.032656 0.018606 0
l 49 50
v 0.033 0.02 0
v 0.032913 0.019282 0
l 51 52
