v 0 0 0
v 1 0 0
l 1 2
v 0.08 0 0.04
v -0.92 0 0.04
l 3 4
v 0.08 0.04 0.04
v -0.92 0.04 0.04
l 5 6
v 0.08 0.04 0
v -0.92 0.04 0
l 7 8
v 0.08 0 0
v 0.08 0 1
l 9 10
v 0 0 0.04
v 0 0 -0.96
l 11 12
v 0 0.04 0.04
v 0 -0.96 0.04
l 13 14
v 0.08 0 0.04
v 0.08 1 0.04
l 15 16
v 0.08 0.04 0.04
v 0.08 0.04 -0.96
l 17 18
v 0 0.04 0
v 0 0.04 1
l 19 20
v 0.031704 0.017531 0
v 0.780331 0.680522 0
l 21 22
v 0.032246 0.018011 0
v 0.599654 0.841448 0
l 23 24
v 0.032656 0.018606 0
v 0.388019 0.953334 0
l 25 26
v 0.032913 0.019282 0
v 0.153204 1.01202 0
l 27 28
v 0.033 0.02 0
v -0.0872905 1.01274 0
l 29 30
v 0.032913 0.020718 0
v -0.322451 0.955446 0
l 31 32
v 0.032656 0.021394 0
v -0.534752 0.844831 0
l 33 34
v 0.032246 0.021989 0
v -0.71638 0.684981 0
l 35 36
v 0.031704 0.022469 0
v -0.853695 0.487301 0
l 37 38
v 0.031064 0.022805 0
v -0.939886 0.262086 0
l 39 40
v 0.08 0.04 0
v 0.08 -0.96 0
l 41 42
v 0.027754 0.018011 0
v 0.776381 -0.64498 0
l 43 44
v 0.027344 0.018606 0
v 0.594754 -0.80483 0
l 45 46
v 0.029638 0.022978 0
v -0.941312 -0.216303 0
l 47 48
v 0.028296 0.017531 0
v 0.913694 -0.447303 0
l 49 50
v 0.027087 0.019282 0
v 0.38245 -0.915446 0
l 51 52
v 0.028936 0.017195 0
v 0.999887 -0.222083 0
l 53 54
v 0 0 0
v 0 1 0
l 55 56
v 0.027 0.02 0
v 0.147288 -0.972739 0
l 57 58
v 0.029638 0.017022 0
v 1.02964 0.017022 0
l 59 60
v 0.030362 0.022978 0
v -0.969638 0.022978 0
l 61 62
v 0.027087 0.020718 0
v -0.0932009 -0.972021 0
l 63 64
v 0.027344 0.021394 0
v -0.32802 -0.913334 0
l 65 66
v 0.027754 0.021989 0
v -0.539656 -0.801447 0
l 67 68
v 0.028296 0.022469 0
v -0.72033 -0.640523 0
l 69 70
v 0.028936 0.022805 0
v -0.856463 -0.442027 0
l 71 72
v 0.030362 0.017022 0
v 1.00131 0.2563 0
l 73 74
v 0.031064 0.017195 0
v 0.916462 0.482029 0
l 75 76
