<?xml version="1.0" encoding="utf-8"?>
<!-- Generator: Adobe Illustrator 24.2.3, SVG Export Plug-In . SVG Version: 6.00 Build 0)  -->
<svg version="1.1" id="Layer_1" xmlns="http://www.w3.org/2000/svg" xmlns:xlink="http://www.w3.org/1999/xlink" x="0px" y="0px" viewBox="0 0 117.1 151.3" style="enable-background:new 0 0 117.1 151.3;" xml:space="preserve">
	<style type="text/css">
	.st0{fill:#003248;}
	.st1{fill:#0096d6;}
</style>
	<g id="Group_1448" transform="translate(0)">
		<g id="Group_1446" transform="translate(0 0)">
			<path id="Path_3347" class="st0" d="M114.7,67.8H87.6c0.2-0.4,0.5-0.8,0.7-1.2c3.4-6.6,2.6-14.5-2-20.3L77,29.8
			C71.8,20,62.8,19.2,54.2,18.3c-1.2-0.1-2.5-0.3-3.8-0.4c-8.7-1.1-10.4-2-16.8-5.5c-0.7-0.4-1.6-0.9-2.4-1.4
			c0.1-0.9,0.1-1.8-0.2-2.7c-0.5-1.5-1.5-2.8-2.9-3.5l-7.6-4.1c-1.4-0.8-3-0.9-4.5-0.4c-1.5,0.5-2.8,1.5-3.5,2.9L0.7,25.6
			C0,27-0.2,28.6,0.3,30.2c0.5,1.5,1.5,2.8,2.9,3.6l7.6,4.1c0.9,0.5,1.8,0.7,2.8,0.7c2.2,0,4.2-1.2,5.3-3.2l0.1-0.2
			c2.1,1.2,3.9,3,5.1,5.1c3.8,6.2,7.5,8,11.1,9.8c1.2,0.6,2.5,1.2,3.6,2l15.5,9.8c0.1,0.1,0.2,0.1,0.3,0.2C55,64,55.8,66,57,67.8
			H32.4c-1.3,0-2.4,1.1-2.4,2.4v73.6c0,4.1,3.3,7.5,7.5,7.5h72.1c4.1,0,7.5-3.4,7.5-7.5V70.2C117.1,68.9,116,67.8,114.7,67.8
			L114.7,67.8z M84.1,64.4c-0.7,1.3-1.5,2.4-2.5,3.4H63c-1.3-1.2-2.3-2.7-3-4.3c0.2,0,0.4-0.1,0.6-0.1c1.5-0.5,2.8-1.6,3.5-3
			c1.6-3,1-8-1.3-11.9c4.1-4.2,10.5-5.2,15.7-2.4C85.1,49.6,87.6,57.8,84.1,64.4L84.1,64.4z M59.9,44.6l-7.8-8.2L52,36.3
			c0.4-0.2,0.9-0.3,1.3-0.3c6.2-1.1,8,0.7,10.9,5.6C62.6,42.4,61.2,43.4,59.9,44.6L59.9,44.6z M14.7,33.1c-0.3,0.6-1,0.8-1.6,0.5
			l-7.6-4.1l0,0c-0.3-0.2-0.5-0.4-0.6-0.7c-0.1-0.3-0.1-0.6,0.1-0.9L16.6,5.4c0.2-0.3,0.4-0.5,0.7-0.6c0.1,0,0.2-0.1,0.4-0.1
			c0.2,0,0.4,0,0.6,0.1l7.6,4.1c0.3,0.2,0.5,0.4,0.6,0.7c0.1,0.3,0.1,0.7-0.1,0.9L14.7,33.1z M56.8,57.6l-15.5-9.8
			c-1.3-0.8-2.7-1.5-4.1-2.2c-3.4-1.6-6-2.9-9.1-8c-1.7-2.8-4.1-5.1-6.9-6.8l8.1-15.5c0.7,0.4,1.4,0.8,2.1,1.2
			c6.4,3.6,8.8,4.9,18.5,6.1c1.3,0.2,2.6,0.3,3.9,0.4c8.4,0.8,15.1,1.5,19.1,9l0,0l4.7,8.3c-2.8-0.9-5.8-1-8.7-0.4
			c-3.5-5.9-6.6-10.4-16.2-8.7c-2.9,0.5-4.7,1.6-5.3,3.4c-0.4,1.1-0.5,2.8,1.3,4.9c0,0,0.1,0.1,0.1,0.1l8.6,9
			c2.7,2.9,3.6,7.7,2.7,9.4c-0.3,0.5-0.5,0.6-0.5,0.7C59.3,58.8,58.7,58.9,56.8,57.6L56.8,57.6z M109.6,146.5H37.5
			c-1.5,0-2.7-1.2-2.7-2.8v-57h12.8c1.3,0,2.4-1.1,2.4-2.4c0,0,0,0,0,0c0-1.3-1.1-2.4-2.4-2.4c0,0,0,0,0,0H34.7v-9.4h77.6V82H68.8
			c-1.3,0-2.4,1.1-2.4,2.4c0,0,0,0,0,0c0,1.3,1.1,2.4,2.4,2.4c0,0,0,0,0,0h43.6v57C112.3,145.3,111.1,146.5,109.6,146.5L109.6,146.5
			z" />
			<path id="Path_3348" class="st0" d="M58.1,86.8L58.1,86.8c1.4,0,2.5-1.1,2.5-2.5c0,0,0,0,0,0c0-1.4-1.1-2.5-2.5-2.5
			c-1.4,0-2.5,1.1-2.5,2.5C55.7,85.7,56.8,86.8,58.1,86.8z" />
		</g>
		<g id="Group_1447" transform="translate(46.968 90.62)">
			<path id="Path_3349" class="st1" d="M34.3,37.8c-0.8,0.1-1.5-0.5-1.6-1.3c0-0.8-0.7-1.5-1.5-1.5c-0.8,0-1.5,0.7-1.5,1.5
			c0,1.9,1.3,3.6,3.2,4.2v0c0,0.8,0.7,1.5,1.5,1.5c0.8,0,1.5-0.7,1.5-1.5v0c1.8-0.5,3.1-2.2,3.2-4.2c-0.1-2.5-2.2-4.5-4.7-4.4
			c-0.8,0.1-1.5-0.5-1.6-1.3c0.1-0.8,0.8-1.4,1.6-1.3c0.8-0.1,1.5,0.5,1.6,1.3c0,0.8,0.7,1.5,1.5,1.5c0.8,0,1.5-0.7,1.5-1.5
			c0,0,0,0,0,0c0-1.9-1.3-3.6-3.2-4.2v-0.1c0-0.8-0.7-1.5-1.5-1.5c-0.8,0-1.5,0.7-1.5,1.5v0.1c-1.8,0.5-3.1,2.2-3.2,4.2
			c0.1,2.5,2.2,4.5,4.7,4.4c0.8-0.1,1.5,0.5,1.6,1.3C35.8,37.3,35.1,37.9,34.3,37.8z" />
			<path id="Path_3350" class="st1" d="M39.7,17.2h1.2c2.8,0,5.1-2.3,5.1-5.1c0-2.8-2.3-5.1-5.1-5.1h-7c0.3-0.6,0.4-1.3,0.4-2
			C34.3,2.3,32,0,29.2,0H5.1C2.3,0,0,2.3,0,5.1c0,2.8,2.3,5.1,5.1,5.1h7c-0.3,0.6-0.4,1.3-0.4,2c0,0.7,0.1,1.4,0.4,2h-1.7
			c-2.8,0-5.1,2.3-5.1,5.1c0,1.3,0.5,2.6,1.5,3.6c-0.9,0.9-1.5,2.2-1.5,3.6c0,1.3,0.5,2.6,1.5,3.6c-0.9,0.9-1.5,2.2-1.5,3.6
			c0,1.3,0.5,2.6,1.5,3.6c-0.9,0.9-1.5,2.2-1.5,3.6c0,2.8,2.3,5.1,5.1,5.1h11.4C25,49,29.6,51,34.3,51c9.6,0,17.3-7.8,17.3-17.3
			C51.5,26.2,46.8,19.6,39.7,17.2z M34.3,19.4c7.9,0,14.2,6.4,14.3,14.3c0,7.9-6.4,14.2-14.3,14.3c-7.9,0-14.2-6.4-14.3-14.3
			C20,25.8,26.4,19.4,34.3,19.4L34.3,19.4z M10.4,31.5h6.7C17,32.2,17,32.9,17,33.7c0,0.6,0,1.2,0.1,1.8h-6.7c-1.1,0-2-0.9-2-2
			C8.4,32.4,9.3,31.5,10.4,31.5L10.4,31.5z M10.4,28.4c-1.1,0-2-0.9-2-2c0-1.1,0.9-2,2-2h9.3c-0.8,1.3-1.5,2.6-1.9,4.1H10.4z
			 M10.4,38.6h7.3c0.4,1.4,1,2.8,1.8,4.1h-9.1c-1.1,0-2-0.9-2-2C8.4,39.5,9.3,38.6,10.4,38.6L10.4,38.6z M22.2,21.3H10.4
			c-1.1,0-2-0.9-2-2c0-1.1,0.9-2,2-2h18.4C26.3,18.1,24,19.5,22.2,21.3z M16.7,10.1h24.2c1.1,0,2,0.9,2,2c0,1.1-0.9,2-2,2H16.7
			c-1.1,0-2-0.9-2-2C14.7,11.1,15.6,10.1,16.7,10.1L16.7,10.1z M29.2,7.1H5.1c-1.1,0-2-0.9-2-2c0-1.1,0.9-2,2-2h24.2
			c1.1,0,2,0.9,2,2C31.3,6.2,30.3,7.1,29.2,7.1z" />
		</g>
	</g>
</svg>