{
  "development": {
    "username": "postgres",
    "password": "Permana@19",
    "database": "binar_challenge_7_fix",
    "host": "localhost",
    "port": "5432",
    "dialect": "postgres"
  },
  "test": {
    "username": "postgres",
    "password": "Permana@19",
    "database": "binar_challenge_7_fix",
    "host": "localhost",
    "port":"5432",
    "dialect": "postgres"
  },
  "production": {
    "username": "postgres",
    "password": "Permana@19",
    "database": "binar_challenge_7_fix",
    "host": "localhost",
    "port" :"5432",
    "dialect": "postgres"
  }
}
