{
  "context-menu": {
    "atom-text-editor": [
      {
        "label": "Format current file",
        "command": "formatter:format"
      }
    ]
  },
  "menu": [
    {
      "label": "Packages",
      "submenu": [
        {
          "label": "formatter",
          "submenu": [
            {
              "label": "Format",
              "command": "formatter:format"
            }
          ]
        }
      ]
    }
  ]
}
