%YAML 1.1
%TAG !u! tag:unity3d.com,2011:
--- !u!114 &11400000
MonoBehaviour:
  m_ObjectHideFlags: 0
  m_CorrespondingSourceObject: {fileID: 0}
  m_PrefabInstance: {fileID: 0}
  m_PrefabAsset: {fileID: 0}
  m_GameObject: {fileID: 0}
  m_Enabled: 1
  m_EditorHideFlags: 0
  m_Script: {fileID: 11500000, guid: b955cab563c84c64cba20d3eeba1be2a, type: 3}
  m_Name: Settings
  m_EditorClassIdentifier: 
  BonusFactory:
    StandartBonusPrefab: {fileID: 2364872719452717864, guid: 6340f0333df17f045877ea3811a02065,
      type: 3}
  PlayerSettings:
    Speed: 3
    FailSound: {fileID: 8300000, guid: 9221a68be6ff1544091e192edb2100df, type: 3}
  set:
    TilePrefab: {fileID: 8937562000807267067, guid: b7c4b4b2bb9837f41a9e82a973f27172,
      type: 3}
  _BonusSettings:
    StandartBonusSettings:
      BonusCollectedSound: {fileID: 8300000, guid: 85a71a2be2bf9f84dae23cd4f9aa9658,
        type: 3}
      BonusCollectedParticles: {fileID: 5855858278817077098, guid: f4c3323a682c3064e89a5ddc14c74cbf,
        type: 3}
