%YAML 1.1
%TAG !u! tag:unity3d.com,2011:
--- !u!114 &11400000
MonoBehaviour:
  m_ObjectHideFlags: 0
  m_CorrespondingSourceObject: {fileID: 0}
  m_PrefabInstance: {fileID: 0}
  m_PrefabAsset: {fileID: 0}
  m_GameObject: {fileID: 0}
  m_Enabled: 1
  m_EditorHideFlags: 0
  m_Script: {fileID: 11500000, guid: 3b612f3097394d19b22469bf184121c7, type: 3}
  m_Name: IconsDatabase
  m_EditorClassIdentifier: 
  Sprites:
  - {fileID: 21300000, guid: b85a726f648808949b038ab32fda92f5, type: 3}
  - {fileID: 21300000, guid: 8542fa350ce5cd048acec7e0d005c13c, type: 3}
  - {fileID: 21300000, guid: fe4221b4225a1374ea055db250ddf794, type: 3}
  - {fileID: 21300000, guid: 806a30ab725a3064d88865068ac88436, type: 3}
  - {fileID: 21300000, guid: 4fdb042ae0eafec49b38018e9f2f879e, type: 3}
  - {fileID: 21300000, guid: 89c24639d55371f4698762deb10f9325, type: 3}
  - {fileID: 21300000, guid: 2bcb85bda0c93b8458c6645f5f374b7f, type: 3}
  - {fileID: 21300000, guid: 5be5faba96af13d4191a6652bb3e0a55, type: 3}
  - {fileID: 21300000, guid: 902507cb251b00a4d857054feb8b7ce8, type: 3}
