{
	"info": {
		"_postman_id": "1db66c7e-23e2-43da-8efd-ff7aae8b1836",
		"name": "pact producer verified",
		"schema": "https://schema.getpostman.com/json/collection/v2.1.0/collection.json"
	},
	"item": [
		{
			"name": "can i deploy",
			"event": [
				{
					"listen": "test",
					"script": {
						"exec": [
							"const responseJson = pm.response.json();\r",
							"const deployable = pm.response.json().summary.deployable;\r",
							"var loop_counter = pm.variables.get(\"loop_counter\");\r",
							"if(deployable === null && loop_counter < 20){\r",
							"    loop_counter = loop_counter + 1;\r",
							"    pm.variables.set(\"loop_counter\", loop_counter);\r",
							"    setTimeout(function(){\r",
							"        postman.setNextRequest(\"can i deploy\");\r",
							"    },3000);\r",
							"        \r",
							"}\r",
							"else{\r",
							"    pm.test(\"Is deployable\", function () {\r",
							"        pm.variables.set(\"loop_counter\", 0);\r",
							"        pm.expect(deployable).to.eql(true);\r",
							"    });\r",
							"}"
						],
						"type": "text/javascript"
					}
				}
			],
			"protocolProfileBehavior": {
				"disableBodyPruning": true
			},
			"request": {
				"method": "GET",
				"header": [],
				"body": {
					"mode": "raw",
					"raw": "pm.test(\"Is deployable\", function () {\r\n    const responseJson = pm.response.json();\r\n    const nullValue = null;\r\n\r\n    /*if(responseJson.summary.deployable === null){\r\n        pm.expect(false).to.eql(true);\r\n    }\r\n    else{\r\n         pm.expect(nullValue).to.eql(true);\r\n       // pm.expect(responseJson.summary.deployable).to.eql(true);\r\n    }\r\n */   \r\n  pm.expect(nullValue).to.eql(true);\r\n});",
					"options": {
						"raw": {
							"language": "json"
						}
					}
				},
				"url": {
					"raw": "{{pact_broker}}/can-i-deploy?pacticipant={{pact_consumer}}&version={{pact_version}}",
					"host": [
						"{{pact_broker}}"
					],
					"path": [
						"can-i-deploy"
					],
					"query": [
						{
							"key": "pacticipant",
							"value": "{{pact_consumer}}"
						},
						{
							"key": "version",
							"value": "{{pact_version}}"
						}
					]
				}
			},
			"response": []
		}
	],
	"event": [
		{
			"listen": "prerequest",
			"script": {
				"type": "text/javascript",
				"exec": [
					""
				]
			}
		},
		{
			"listen": "test",
			"script": {
				"type": "text/javascript",
				"exec": [
					""
				]
			}
		}
	],
	"variable": [
		{
			"key": "loop_counter",
			"value": "0"
		}
	]
}