{
  "extends": "../tslint.json",
  "rules": {
    "directive-selector": [
      true,
      "attribute",
      [
        "",
        "app"
      ],
      "camelCase"
    ],
    "component-selector": [
      true,
      "element",
      [
        "app",
        "dwfe",
        "nevis",
        "common",
        "storage"
      ],
      "kebab-case"
    ],
    "max-line-length": false
  }
}
