<configuration scan="true" scanPeriod="5 seconds">  <!-- https://logback.qos.ch/manual/configuration.html -->


    <springProfile name="dev">

        <include resource="log/logback-appender-console.xml"/>

        <root level="INFO">
            <appender-ref ref="CONSOLE"/>
        </root>

    </springProfile>


    <springProfile name="prod">

        <include resource="log/logback-appender-file.xml"/>

        <root>
            <appender-ref ref="FILE"/>
        </root>

    </springProfile>


</configuration>