[gd_scene load_steps=2 format=2]

[ext_resource path="res://assets/wall-tall.png" type="Texture" id=1]

[node name="wall" type="StaticBody2D"]

[node name="Wall-tall" type="Sprite" parent="."]
texture = ExtResource( 1 )
centered = false

[node name="CollisionPolygon2D" type="CollisionPolygon2D" parent="."]
polygon = PoolVector2Array( 1, 1, 31, 1, 31, 31, 1, 31 )
