%YAML 1.1
%TAG !u! tag:unity3d.com,2011:
--- !u!29 &1
OcclusionCullingSettings:
  m_ObjectHideFlags: 0
  serializedVersion: 2
  m_OcclusionBakeSettings:
    smallestOccluder: 5
    smallestHole: 0.25
    backfaceThreshold: 100
  m_SceneGUID: 00000000000000000000000000000000
  m_OcclusionCullingData: {fileID: 0}
--- !u!104 &2
RenderSettings:
  m_ObjectHideFlags: 0
  serializedVersion: 9
  m_Fog: 0
  m_FogColor: {r: 0.5, g: 0.5, b: 0.5, a: 1}
  m_FogMode: 3
  m_FogDensity: 0.01
  m_LinearFogStart: 0
  m_LinearFogEnd: 300
  m_AmbientSkyColor: {r: 0.2, g: 0.2, b: 0.2, a: 1}
  m_AmbientEquatorColor: {r: 0.2, g: 0.2, b: 0.2, a: 1}
  m_AmbientGroundColor: {r: 0.2, g: 0.2, b: 0.2, a: 1}
  m_AmbientIntensity: 1
  m_AmbientMode: 3
  m_SubtractiveShadowColor: {r: 0.42, g: 0.478, b: 0.627, a: 1}
  m_SkyboxMaterial: {fileID: 10304, guid: 0000000000000000f000000000000000, type: 0}
  m_HaloStrength: 0.5
  m_FlareStrength: 1
  m_FlareFadeSpeed: 3
  m_HaloTexture: {fileID: 0}
  m_SpotCookie: {fileID: 10001, guid: 0000000000000000e000000000000000, type: 0}
  m_DefaultReflectionMode: 0
  m_DefaultReflectionResolution: 128
  m_ReflectionBounces: 1
  m_ReflectionIntensity: 1
  m_CustomReflection: {fileID: 0}
  m_Sun: {fileID: 1927694594}
  m_IndirectSpecularColor: {r: 0, g: 0, b: 0, a: 1}
  m_UseRadianceAmbientProbe: 0
--- !u!157 &4
LightmapSettings:
  m_ObjectHideFlags: 0
  serializedVersion: 11
  m_GIWorkflowMode: 0
  m_GISettings:
    serializedVersion: 2
    m_BounceScale: 1
    m_IndirectOutputScale: 1
    m_AlbedoBoost: 1
    m_EnvironmentLightingMode: 0
    m_EnableBakedLightmaps: 0
    m_EnableRealtimeLightmaps: 1
  m_LightmapEditorSettings:
    serializedVersion: 12
    m_Resolution: 1
    m_BakeResolution: 50
    m_AtlasSize: 1024
    m_AO: 0
    m_AOMaxDistance: 1
    m_CompAOExponent: 0
    m_CompAOExponentDirect: 0
    m_ExtractAmbientOcclusion: 0
    m_Padding: 2
    m_LightmapParameters: {fileID: 0}
    m_LightmapsBakeMode: 1
    m_TextureCompression: 0
    m_FinalGather: 0
    m_FinalGatherFiltering: 1
    m_FinalGatherRayCount: 1024
    m_ReflectionCompression: 2
    m_MixedBakeMode: 1
    m_BakeBackend: 0
    m_PVRSampling: 1
    m_PVRDirectSampleCount: 32
    m_PVRSampleCount: 512
    m_PVRBounces: 2
    m_PVREnvironmentSampleCount: 512
    m_PVREnvironmentReferencePointCount: 2048
    m_PVRFilteringMode: 0
    m_PVRDenoiserTypeDirect: 0
    m_PVRDenoiserTypeIndirect: 0
    m_PVRDenoiserTypeAO: 0
    m_PVRFilterTypeDirect: 0
    m_PVRFilterTypeIndirect: 0
    m_PVRFilterTypeAO: 0
    m_PVREnvironmentMIS: 0
    m_PVRCulling: 1
    m_PVRFilteringGaussRadiusDirect: 1
    m_PVRFilteringGaussRadiusIndirect: 5
    m_PVRFilteringGaussRadiusAO: 2
    m_PVRFilteringAtrousPositionSigmaDirect: 0.5
    m_PVRFilteringAtrousPositionSigmaIndirect: 2
    m_PVRFilteringAtrousPositionSigmaAO: 1
    m_ShowResolutionOverlay: 1
    m_ExportTrainingData: 0
  m_LightingDataAsset: {fileID: 0}
  m_UseShadowmask: 0
--- !u!196 &5
NavMeshSettings:
  serializedVersion: 2
  m_ObjectHideFlags: 0
  m_BuildSettings:
    serializedVersion: 2
    agentTypeID: 0
    agentRadius: 0.5
    agentHeight: 2
    agentSlope: 45
    agentClimb: 0.4
    ledgeDropHeight: 0
    maxJumpAcrossDistance: 0
    minRegionArea: 2
    manualCellSize: 0
    cellSize: 0.16666666
    manualTileSize: 0
    tileSize: 256
    accuratePlacement: 0
    debug:
      m_Flags: 0
  m_NavMeshData: {fileID: 0}
--- !u!1 &336102051
GameObject:
  m_ObjectHideFlags: 0
  m_CorrespondingSourceObject: {fileID: 0}
  m_PrefabInstance: {fileID: 0}
  m_PrefabAsset: {fileID: 0}
  serializedVersion: 6
  m_Component:
  - component: {fileID: 336102056}
  - component: {fileID: 336102055}
  - component: {fileID: 336102054}
  - component: {fileID: 336102053}
  - component: {fileID: 336102052}
  - component: {fileID: 336102057}
  m_Layer: 0
  m_Name: Main Camera
  m_TagString: MainCamera
  m_Icon: {fileID: 0}
  m_NavMeshLayer: 0
  m_StaticEditorFlags: 0
  m_IsActive: 1
--- !u!81 &336102052
AudioListener:
  m_ObjectHideFlags: 0
  m_CorrespondingSourceObject: {fileID: 0}
  m_PrefabInstance: {fileID: 0}
  m_PrefabAsset: {fileID: 0}
  m_GameObject: {fileID: 336102051}
  m_Enabled: 1
--- !u!124 &336102053
Behaviour:
  m_ObjectHideFlags: 0
  m_CorrespondingSourceObject: {fileID: 0}
  m_PrefabInstance: {fileID: 0}
  m_PrefabAsset: {fileID: 0}
  m_GameObject: {fileID: 336102051}
  m_Enabled: 1
--- !u!92 &336102054
Behaviour:
  m_ObjectHideFlags: 0
  m_CorrespondingSourceObject: {fileID: 0}
  m_PrefabInstance: {fileID: 0}
  m_PrefabAsset: {fileID: 0}
  m_GameObject: {fileID: 336102051}
  m_Enabled: 1
--- !u!20 &336102055
Camera:
  m_ObjectHideFlags: 0
  m_CorrespondingSourceObject: {fileID: 0}
  m_PrefabInstance: {fileID: 0}
  m_PrefabAsset: {fileID: 0}
  m_GameObject: {fileID: 336102051}
  m_Enabled: 1
  serializedVersion: 2
  m_ClearFlags: 1
  m_BackGroundColor: {r: 0.19215687, g: 0.3019608, b: 0.4745098, a: 0.019607844}
  m_projectionMatrixMode: 1
  m_GateFitMode: 2
  m_FOVAxisMode: 0
  m_SensorSize: {x: 36, y: 24}
  m_LensShift: {x: 0, y: 0}
  m_FocalLength: 50
  m_NormalizedViewPortRect:
    serializedVersion: 2
    x: 0
    y: 0
    width: 1
    height: 1
  near clip plane: 0.3
  far clip plane: 1000
  field of view: 60
  orthographic: 0
  orthographic size: 5
  m_Depth: -1
  m_CullingMask:
    serializedVersion: 2
    m_Bits: 4294967295
  m_RenderingPath: -1
  m_TargetTexture: {fileID: 0}
  m_TargetDisplay: 0
  m_TargetEye: 3
  m_HDR: 0
  m_AllowMSAA: 1
  m_AllowDynamicResolution: 0
  m_ForceIntoRT: 0
  m_OcclusionCulling: 1
  m_StereoConvergence: 10
  m_StereoSeparation: 0.022
--- !u!4 &336102056
Transform:
  m_ObjectHideFlags: 0
  m_CorrespondingSourceObject: {fileID: 0}
  m_PrefabInstance: {fileID: 0}
  m_PrefabAsset: {fileID: 0}
  m_GameObject: {fileID: 336102051}
  m_LocalRotation: {x: 0, y: -0.12410322, z: 0, w: 0.99226934}
  m_LocalPosition: {x: 1.17, y: 1.27, z: -8.82}
  m_LocalScale: {x: 1, y: 1, z: 1}
  m_Children: []
  m_Father: {fileID: 0}
  m_RootOrder: 2
  m_LocalEulerAnglesHint: {x: 0, y: -14.257899, z: 0}
--- !u!114 &336102057
MonoBehaviour:
  m_ObjectHideFlags: 0
  m_CorrespondingSourceObject: {fileID: 0}
  m_PrefabInstance: {fileID: 0}
  m_PrefabAsset: {fileID: 0}
  m_GameObject: {fileID: 336102051}
  m_Enabled: 1
  m_EditorHideFlags: 0
  m_Script: {fileID: 11500000, guid: 9ed5d0626899bd84eb0a6704b4e0e51c, type: 3}
  m_Name: 
  m_EditorClassIdentifier: 
  target: {fileID: 1760006637}
  distance: 3
  xSpeed: 250
  ySpeed: 120
  yMinLimit: -20
  yMaxLimit: 80
--- !u!1001 &941128322
PrefabInstance:
  m_ObjectHideFlags: 0
  serializedVersion: 2
  m_Modification:
    m_TransformParent: {fileID: 0}
    m_Modifications:
    - target: {fileID: 100000, guid: 3cc7cb86a5c835b45a2e96a33fd7c489, type: 3}
      propertyPath: m_StaticEditorFlags
      value: 4294967295
      objectReference: {fileID: 0}
    - target: {fileID: 400000, guid: 3cc7cb86a5c835b45a2e96a33fd7c489, type: 3}
      propertyPath: m_LocalPosition.x
      value: 0
      objectReference: {fileID: 0}
    - target: {fileID: 400000, guid: 3cc7cb86a5c835b45a2e96a33fd7c489, type: 3}
      propertyPath: m_LocalPosition.y
      value: 0
      objectReference: {fileID: 0}
    - target: {fileID: 400000, guid: 3cc7cb86a5c835b45a2e96a33fd7c489, type: 3}
      propertyPath: m_LocalPosition.z
      value: -6.53000021
      objectReference: {fileID: 0}
    - target: {fileID: 400000, guid: 3cc7cb86a5c835b45a2e96a33fd7c489, type: 3}
      propertyPath: m_LocalRotation.x
      value: .707106829
      objectReference: {fileID: 0}
    - target: {fileID: 400000, guid: 3cc7cb86a5c835b45a2e96a33fd7c489, type: 3}
      propertyPath: m_LocalRotation.y
      value: 0
      objectReference: {fileID: 0}
    - target: {fileID: 400000, guid: 3cc7cb86a5c835b45a2e96a33fd7c489, type: 3}
      propertyPath: m_LocalRotation.z
      value: 0
      objectReference: {fileID: 0}
    - target: {fileID: 400000, guid: 3cc7cb86a5c835b45a2e96a33fd7c489, type: 3}
      propertyPath: m_LocalRotation.w
      value: .707106829
      objectReference: {fileID: 0}
    - target: {fileID: 400000, guid: 3cc7cb86a5c835b45a2e96a33fd7c489, type: 3}
      propertyPath: m_RootOrder
      value: 0
      objectReference: {fileID: 0}
    - target: {fileID: 400000, guid: 3cc7cb86a5c835b45a2e96a33fd7c489, type: 3}
      propertyPath: m_LocalScale.x
      value: 1
      objectReference: {fileID: 0}
    - target: {fileID: 400000, guid: 3cc7cb86a5c835b45a2e96a33fd7c489, type: 3}
      propertyPath: m_LocalScale.y
      value: .5
      objectReference: {fileID: 0}
    - target: {fileID: 400000, guid: 3cc7cb86a5c835b45a2e96a33fd7c489, type: 3}
      propertyPath: m_LocalScale.z
      value: .600000024
      objectReference: {fileID: 0}
    m_RemovedComponents: []
  m_SourcePrefab: {fileID: 100100000, guid: 3cc7cb86a5c835b45a2e96a33fd7c489, type: 3}
--- !u!1001 &1429238517
PrefabInstance:
  m_ObjectHideFlags: 0
  serializedVersion: 2
  m_Modification:
    m_TransformParent: {fileID: 0}
    m_Modifications:
    - target: {fileID: 100000, guid: 320b1c2af77554f99a1658df4a6d3d5c, type: 3}
      propertyPath: m_StaticEditorFlags
      value: 4294967295
      objectReference: {fileID: 0}
    - target: {fileID: 100002, guid: 320b1c2af77554f99a1658df4a6d3d5c, type: 3}
      propertyPath: m_StaticEditorFlags
      value: 4294967295
      objectReference: {fileID: 0}
    - target: {fileID: 100004, guid: 320b1c2af77554f99a1658df4a6d3d5c, type: 3}
      propertyPath: m_StaticEditorFlags
      value: 4294967295
      objectReference: {fileID: 0}
    - target: {fileID: 100006, guid: 320b1c2af77554f99a1658df4a6d3d5c, type: 3}
      propertyPath: m_StaticEditorFlags
      value: 4294967295
      objectReference: {fileID: 0}
    - target: {fileID: 100008, guid: 320b1c2af77554f99a1658df4a6d3d5c, type: 3}
      propertyPath: m_StaticEditorFlags
      value: 4294967295
      objectReference: {fileID: 0}
    - target: {fileID: 100010, guid: 320b1c2af77554f99a1658df4a6d3d5c, type: 3}
      propertyPath: m_StaticEditorFlags
      value: 4294967295
      objectReference: {fileID: 0}
    - target: {fileID: 100012, guid: 320b1c2af77554f99a1658df4a6d3d5c, type: 3}
      propertyPath: m_StaticEditorFlags
      value: 4294967295
      objectReference: {fileID: 0}
    - target: {fileID: 100014, guid: 320b1c2af77554f99a1658df4a6d3d5c, type: 3}
      propertyPath: m_StaticEditorFlags
      value: 4294967295
      objectReference: {fileID: 0}
    - target: {fileID: 100016, guid: 320b1c2af77554f99a1658df4a6d3d5c, type: 3}
      propertyPath: m_StaticEditorFlags
      value: 4294967295
      objectReference: {fileID: 0}
    - target: {fileID: 100018, guid: 320b1c2af77554f99a1658df4a6d3d5c, type: 3}
      propertyPath: m_StaticEditorFlags
      value: 4294967295
      objectReference: {fileID: 0}
    - target: {fileID: 100020, guid: 320b1c2af77554f99a1658df4a6d3d5c, type: 3}
      propertyPath: m_StaticEditorFlags
      value: 4294967295
      objectReference: {fileID: 0}
    - target: {fileID: 100022, guid: 320b1c2af77554f99a1658df4a6d3d5c, type: 3}
      propertyPath: m_StaticEditorFlags
      value: 4294967295
      objectReference: {fileID: 0}
    - target: {fileID: 100024, guid: 320b1c2af77554f99a1658df4a6d3d5c, type: 3}
      propertyPath: m_StaticEditorFlags
      value: 4294967295
      objectReference: {fileID: 0}
    - target: {fileID: 100026, guid: 320b1c2af77554f99a1658df4a6d3d5c, type: 3}
      propertyPath: m_StaticEditorFlags
      value: 4294967295
      objectReference: {fileID: 0}
    - target: {fileID: 100028, guid: 320b1c2af77554f99a1658df4a6d3d5c, type: 3}
      propertyPath: m_StaticEditorFlags
      value: 4294967295
      objectReference: {fileID: 0}
    - target: {fileID: 100030, guid: 320b1c2af77554f99a1658df4a6d3d5c, type: 3}
      propertyPath: m_StaticEditorFlags
      value: 4294967295
      objectReference: {fileID: 0}
    - target: {fileID: 100032, guid: 320b1c2af77554f99a1658df4a6d3d5c, type: 3}
      propertyPath: m_StaticEditorFlags
      value: 4294967295
      objectReference: {fileID: 0}
    - target: {fileID: 100034, guid: 320b1c2af77554f99a1658df4a6d3d5c, type: 3}
      propertyPath: m_StaticEditorFlags
      value: 4294967295
      objectReference: {fileID: 0}
    - target: {fileID: 100036, guid: 320b1c2af77554f99a1658df4a6d3d5c, type: 3}
      propertyPath: m_StaticEditorFlags
      value: 4294967295
      objectReference: {fileID: 0}
    - target: {fileID: 100038, guid: 320b1c2af77554f99a1658df4a6d3d5c, type: 3}
      propertyPath: m_StaticEditorFlags
      value: 4294967295
      objectReference: {fileID: 0}
    - target: {fileID: 100040, guid: 320b1c2af77554f99a1658df4a6d3d5c, type: 3}
      propertyPath: m_StaticEditorFlags
      value: 4294967295
      objectReference: {fileID: 0}
    - target: {fileID: 100042, guid: 320b1c2af77554f99a1658df4a6d3d5c, type: 3}
      propertyPath: m_StaticEditorFlags
      value: 4294967295
      objectReference: {fileID: 0}
    - target: {fileID: 100044, guid: 320b1c2af77554f99a1658df4a6d3d5c, type: 3}
      propertyPath: m_StaticEditorFlags
      value: 4294967295
      objectReference: {fileID: 0}
    - target: {fileID: 100046, guid: 320b1c2af77554f99a1658df4a6d3d5c, type: 3}
      propertyPath: m_StaticEditorFlags
      value: 4294967295
      objectReference: {fileID: 0}
    - target: {fileID: 100048, guid: 320b1c2af77554f99a1658df4a6d3d5c, type: 3}
      propertyPath: m_StaticEditorFlags
      value: 4294967295
      objectReference: {fileID: 0}
    - target: {fileID: 100050, guid: 320b1c2af77554f99a1658df4a6d3d5c, type: 3}
      propertyPath: m_StaticEditorFlags
      value: 4294967295
      objectReference: {fileID: 0}
    - target: {fileID: 100052, guid: 320b1c2af77554f99a1658df4a6d3d5c, type: 3}
      propertyPath: m_StaticEditorFlags
      value: 4294967295
      objectReference: {fileID: 0}
    - target: {fileID: 100054, guid: 320b1c2af77554f99a1658df4a6d3d5c, type: 3}
      propertyPath: m_StaticEditorFlags
      value: 4294967295
      objectReference: {fileID: 0}
    - target: {fileID: 100056, guid: 320b1c2af77554f99a1658df4a6d3d5c, type: 3}
      propertyPath: m_StaticEditorFlags
      value: 4294967295
      objectReference: {fileID: 0}
    - target: {fileID: 100058, guid: 320b1c2af77554f99a1658df4a6d3d5c, type: 3}
      propertyPath: m_StaticEditorFlags
      value: 4294967295
      objectReference: {fileID: 0}
    - target: {fileID: 100060, guid: 320b1c2af77554f99a1658df4a6d3d5c, type: 3}
      propertyPath: m_StaticEditorFlags
      value: 4294967295
      objectReference: {fileID: 0}
    - target: {fileID: 100062, guid: 320b1c2af77554f99a1658df4a6d3d5c, type: 3}
      propertyPath: m_StaticEditorFlags
      value: 4294967295
      objectReference: {fileID: 0}
    - target: {fileID: 100064, guid: 320b1c2af77554f99a1658df4a6d3d5c, type: 3}
      propertyPath: m_StaticEditorFlags
      value: 4294967295
      objectReference: {fileID: 0}
    - target: {fileID: 100066, guid: 320b1c2af77554f99a1658df4a6d3d5c, type: 3}
      propertyPath: m_StaticEditorFlags
      value: 4294967295
      objectReference: {fileID: 0}
    - target: {fileID: 100068, guid: 320b1c2af77554f99a1658df4a6d3d5c, type: 3}
      propertyPath: m_StaticEditorFlags
      value: 4294967295
      objectReference: {fileID: 0}
    - target: {fileID: 100070, guid: 320b1c2af77554f99a1658df4a6d3d5c, type: 3}
      propertyPath: m_StaticEditorFlags
      value: 4294967295
      objectReference: {fileID: 0}
    - target: {fileID: 100072, guid: 320b1c2af77554f99a1658df4a6d3d5c, type: 3}
      propertyPath: m_StaticEditorFlags
      value: 4294967295
      objectReference: {fileID: 0}
    - target: {fileID: 100074, guid: 320b1c2af77554f99a1658df4a6d3d5c, type: 3}
      propertyPath: m_StaticEditorFlags
      value: 4294967295
      objectReference: {fileID: 0}
    - target: {fileID: 100076, guid: 320b1c2af77554f99a1658df4a6d3d5c, type: 3}
      propertyPath: m_StaticEditorFlags
      value: 4294967295
      objectReference: {fileID: 0}
    - target: {fileID: 100078, guid: 320b1c2af77554f99a1658df4a6d3d5c, type: 3}
      propertyPath: m_StaticEditorFlags
      value: 4294967295
      objectReference: {fileID: 0}
    - target: {fileID: 100080, guid: 320b1c2af77554f99a1658df4a6d3d5c, type: 3}
      propertyPath: m_StaticEditorFlags
      value: 4294967295
      objectReference: {fileID: 0}
    - target: {fileID: 100082, guid: 320b1c2af77554f99a1658df4a6d3d5c, type: 3}
      propertyPath: m_StaticEditorFlags
      value: 4294967295
      objectReference: {fileID: 0}
    - target: {fileID: 100084, guid: 320b1c2af77554f99a1658df4a6d3d5c, type: 3}
      propertyPath: m_StaticEditorFlags
      value: 4294967295
      objectReference: {fileID: 0}
    - target: {fileID: 100086, guid: 320b1c2af77554f99a1658df4a6d3d5c, type: 3}
      propertyPath: m_StaticEditorFlags
      value: 4294967295
      objectReference: {fileID: 0}
    - target: {fileID: 100088, guid: 320b1c2af77554f99a1658df4a6d3d5c, type: 3}
      propertyPath: m_StaticEditorFlags
      value: 4294967295
      objectReference: {fileID: 0}
    - target: {fileID: 100090, guid: 320b1c2af77554f99a1658df4a6d3d5c, type: 3}
      propertyPath: m_StaticEditorFlags
      value: 4294967295
      objectReference: {fileID: 0}
    - target: {fileID: 100092, guid: 320b1c2af77554f99a1658df4a6d3d5c, type: 3}
      propertyPath: m_StaticEditorFlags
      value: 4294967295
      objectReference: {fileID: 0}
    - target: {fileID: 100094, guid: 320b1c2af77554f99a1658df4a6d3d5c, type: 3}
      propertyPath: m_StaticEditorFlags
      value: 4294967295
      objectReference: {fileID: 0}
    - target: {fileID: 100096, guid: 320b1c2af77554f99a1658df4a6d3d5c, type: 3}
      propertyPath: m_StaticEditorFlags
      value: 4294967295
      objectReference: {fileID: 0}
    - target: {fileID: 100098, guid: 320b1c2af77554f99a1658df4a6d3d5c, type: 3}
      propertyPath: m_StaticEditorFlags
      value: 4294967295
      objectReference: {fileID: 0}
    - target: {fileID: 100100, guid: 320b1c2af77554f99a1658df4a6d3d5c, type: 3}
      propertyPath: m_StaticEditorFlags
      value: 4294967295
      objectReference: {fileID: 0}
    - target: {fileID: 400000, guid: 320b1c2af77554f99a1658df4a6d3d5c, type: 3}
      propertyPath: m_LocalPosition.x
      value: -.441000015
      objectReference: {fileID: 0}
    - target: {fileID: 400000, guid: 320b1c2af77554f99a1658df4a6d3d5c, type: 3}
      propertyPath: m_LocalPosition.y
      value: .0199999996
      objectReference: {fileID: 0}
    - target: {fileID: 400000, guid: 320b1c2af77554f99a1658df4a6d3d5c, type: 3}
      propertyPath: m_LocalPosition.z
      value: -5.67000008
      objectReference: {fileID: 0}
    - target: {fileID: 400000, guid: 320b1c2af77554f99a1658df4a6d3d5c, type: 3}
      propertyPath: m_LocalRotation.x
      value: 0
      objectReference: {fileID: 0}
    - target: {fileID: 400000, guid: 320b1c2af77554f99a1658df4a6d3d5c, type: 3}
      propertyPath: m_LocalRotation.y
      value: .707106829
      objectReference: {fileID: 0}
    - target: {fileID: 400000, guid: 320b1c2af77554f99a1658df4a6d3d5c, type: 3}
      propertyPath: m_LocalRotation.z
      value: 0
      objectReference: {fileID: 0}
    - target: {fileID: 400000, guid: 320b1c2af77554f99a1658df4a6d3d5c, type: 3}
      propertyPath: m_LocalRotation.w
      value: .707106829
      objectReference: {fileID: 0}
    - target: {fileID: 400000, guid: 320b1c2af77554f99a1658df4a6d3d5c, type: 3}
      propertyPath: m_RootOrder
      value: 0
      objectReference: {fileID: 0}
    m_RemovedComponents: []
  m_SourcePrefab: {fileID: 100100000, guid: 320b1c2af77554f99a1658df4a6d3d5c, type: 3}
--- !u!1 &1750534347
GameObject:
  m_ObjectHideFlags: 0
  m_CorrespondingSourceObject: {fileID: 0}
  m_PrefabInstance: {fileID: 0}
  m_PrefabAsset: {fileID: 0}
  serializedVersion: 6
  m_Component:
  - component: {fileID: 1750534349}
  - component: {fileID: 1750534348}
  m_Layer: 0
  m_Name: GUI
  m_TagString: Untagged
  m_Icon: {fileID: 0}
  m_NavMeshLayer: 0
  m_StaticEditorFlags: 0
  m_IsActive: 1
--- !u!114 &1750534348
MonoBehaviour:
  m_ObjectHideFlags: 0
  m_CorrespondingSourceObject: {fileID: 0}
  m_PrefabInstance: {fileID: 0}
  m_PrefabAsset: {fileID: 0}
  m_GameObject: {fileID: 1750534347}
  m_Enabled: 1
  m_EditorHideFlags: 0
  m_Script: {fileID: 11500000, guid: b47fe81968aafb8419d6188884fdcf8b, type: 3}
  m_Name: 
  m_EditorClassIdentifier: 
  Prefabs:
  - {fileID: 100010, guid: 5a62e495046d9eb4d9a4b17e320aa1e3, type: 3}
  - {fileID: 100010, guid: 954e9172d1cc6064c8094bc624024e1e, type: 3}
  - {fileID: 100016, guid: fd864604740e1714a9ece037ff5410a4, type: 3}
  - {fileID: 100016, guid: f35f798ec1d6b0f41b15d67adcc4ec09, type: 3}
  - {fileID: 100014, guid: 0a1280bb98fb47b4fa12559887efddc5, type: 3}
  - {fileID: 100014, guid: 534da88928bef4945988cd2d2ef69ce4, type: 3}
  - {fileID: 100010, guid: d994687938122f94c8aa75e387eb898a, type: 3}
  - {fileID: 100010, guid: cb6cb6324c166914c96cca65192f09a9, type: 3}
  - {fileID: 100010, guid: da57d3017d52f8f4a953feb8584cdef2, type: 3}
  - {fileID: 100010, guid: 6e63997523a2e4644b00bb5cbd767389, type: 3}
  - {fileID: 100010, guid: 2f398b3b7cc78be46b92f0fb78286f37, type: 3}
  - {fileID: 100010, guid: 884b0843cb66f5f44a64ec96fb59323e, type: 3}
  - {fileID: 100006, guid: 8a76964fa67c2d64c99bb90e432abc86, type: 3}
  - {fileID: 100006, guid: 0da6fe0fb8bdec74dbd423d33b229d22, type: 3}
  - {fileID: 100006, guid: 67b0208041babc642b0ccf923aab21b2, type: 3}
  - {fileID: 100010, guid: c07377210c55e7a498fc806d7e535dfb, type: 3}
  - {fileID: 100006, guid: 8bd01a31e69c5bc449c6480ed8b20526, type: 3}
  - {fileID: 100010, guid: 0dd8c081326f4b54eaabbe14e8b18b94, type: 3}
  - {fileID: 100000, guid: dee0fb32388ba8249894f6297a2d35f7, type: 3}
  - {fileID: 100006, guid: 303b977275c6a8748be477a4fc634f12, type: 3}
  - {fileID: 100010, guid: fb5d3082bd28e604d99a3f1dd3e84749, type: 3}
  - {fileID: 100016, guid: cd6ed9920dc19624c9900000a448fe67, type: 3}
  - {fileID: 100014, guid: 624f74b219030654e8e4bcfd0eac5e58, type: 3}
  - {fileID: 100010, guid: 490434f2584d63b48a47d4c4bed4e617, type: 3}
  - {fileID: 100010, guid: 32cf279401af2b94482253bbf79d9ff7, type: 3}
  - {fileID: 100010, guid: 5aa9b4f432517364a88b628ab33dead8, type: 3}
  - {fileID: 100006, guid: 8f89695518631824782102af0bed7d9e, type: 3}
  - {fileID: 100000, guid: 34cef3d5b7c293f41a5a8767158f0d13, type: 3}
  - {fileID: 100008, guid: 422a38e538243fc4f97480652a929107, type: 3}
  - {fileID: 100012, guid: 19f295466dd043847805ed48e3561a66, type: 3}
  - {fileID: 100020, guid: 4ebdde569be2f5042911fbef94eb525b, type: 3}
  - {fileID: 100000, guid: b187af2752948364aaf8bc781fcbceec, type: 3}
  - {fileID: 100004, guid: 6c6b27577070d4f4780e0b4869607f56, type: 3}
  - {fileID: 100010, guid: 15f25467ee9e6af4890482384f5ad4e1, type: 3}
  - {fileID: 100000, guid: 4ae56777ec1aeb44883a977bf3e7d661, type: 3}
  - {fileID: 100000, guid: a18ddff79e91f834ab870cf3f8c1f5b0, type: 3}
  - {fileID: 100004, guid: 7c3fa5184535a4949b44caafe302db3d, type: 3}
  - {fileID: 100010, guid: f6ff7048251fa514fad8719b68cb953b, type: 3}
  - {fileID: 100010, guid: 7fc76988090ca6e48ad0196bfe2fa525, type: 3}
  - {fileID: 100000, guid: 48ac2929658ee214d87c8b22d6ed1315, type: 3}
  - {fileID: 100010, guid: 81b34b397e7983a47ac86d644059cd50, type: 3}
  - {fileID: 100004, guid: 653c5c4962547cc448d2906471cb4dc1, type: 3}
  - {fileID: 100004, guid: 5efdb5698f3718e46b583a1de0ddc51e, type: 3}
  - {fileID: 100024, guid: de670bf93ae4bb04bbfb3e04751e679d, type: 3}
  - {fileID: 100004, guid: e19df23a03aa7ab4e9b8247540444e38, type: 3}
  - {fileID: 100010, guid: 45f20b3adb98ff64c9a585ddb5ba8f1b, type: 3}
  - {fileID: 100010, guid: 12628deacec3f19488f012285d82e065, type: 3}
  - {fileID: 100000, guid: dc5e5afa8e31079449d7ca2287761dfd, type: 3}
  - {fileID: 100010, guid: 816cf1ccaf37c6d46a9ec94a9d085d0c, type: 3}
  - {fileID: 100000, guid: bd1b09ecbf112814399e16be0e5243a9, type: 3}
  - {fileID: 100016, guid: 9e90e86d867949940a7d3f62589530ec, type: 3}
  - {fileID: 100008, guid: 66176f9d14a037848abd852cebd1d57b, type: 3}
  - {fileID: 100004, guid: a92b61cd3cc81ba4489887addcc7f985, type: 3}
  - {fileID: 100010, guid: 8f3a22dddc22bda4fa4b8dea02969eaa, type: 3}
  - {fileID: 100002, guid: 2367155e1d832144f8230476675f9be7, type: 3}
  - {fileID: 100010, guid: 461747dfa4b0166438676dade397f2dc, type: 3}
  - {fileID: 100010, guid: a07ac4ef8f168dc4b89daf69215dab01, type: 3}
--- !u!4 &1750534349
Transform:
  m_ObjectHideFlags: 0
  m_CorrespondingSourceObject: {fileID: 0}
  m_PrefabInstance: {fileID: 0}
  m_PrefabAsset: {fileID: 0}
  m_GameObject: {fileID: 1750534347}
  m_LocalRotation: {x: 0, y: 0, z: 0, w: 1}
  m_LocalPosition: {x: -0.309, y: 1.326, z: -5.66}
  m_LocalScale: {x: 1, y: 1, z: 1}
  m_Children: []
  m_Father: {fileID: 0}
  m_RootOrder: 5
  m_LocalEulerAnglesHint: {x: 0, y: 0, z: 0}
--- !u!1 &1760006637
GameObject:
  m_ObjectHideFlags: 0
  m_CorrespondingSourceObject: {fileID: 0}
  m_PrefabInstance: {fileID: 0}
  m_PrefabAsset: {fileID: 0}
  serializedVersion: 6
  m_Component:
  - component: {fileID: 1760006638}
  m_Layer: 0
  m_Name: Target
  m_TagString: Untagged
  m_Icon: {fileID: 0}
  m_NavMeshLayer: 0
  m_StaticEditorFlags: 0
  m_IsActive: 1
--- !u!4 &1760006638
Transform:
  m_ObjectHideFlags: 0
  m_CorrespondingSourceObject: {fileID: 0}
  m_PrefabInstance: {fileID: 0}
  m_PrefabAsset: {fileID: 0}
  m_GameObject: {fileID: 1760006637}
  m_LocalRotation: {x: 0, y: 0, z: 0, w: 1}
  m_LocalPosition: {x: 0, y: 1.11, z: -5.85}
  m_LocalScale: {x: 1, y: 1, z: 1}
  m_Children: []
  m_Father: {fileID: 0}
  m_RootOrder: 4
  m_LocalEulerAnglesHint: {x: 0, y: 0, z: 0}
--- !u!1 &1927694593
GameObject:
  m_ObjectHideFlags: 0
  m_CorrespondingSourceObject: {fileID: 0}
  m_PrefabInstance: {fileID: 0}
  m_PrefabAsset: {fileID: 0}
  serializedVersion: 6
  m_Component:
  - component: {fileID: 1927694595}
  - component: {fileID: 1927694594}
  m_Layer: 0
  m_Name: Directional light
  m_TagString: Untagged
  m_Icon: {fileID: 0}
  m_NavMeshLayer: 0
  m_StaticEditorFlags: 0
  m_IsActive: 1
--- !u!108 &1927694594
Light:
  m_ObjectHideFlags: 0
  m_CorrespondingSourceObject: {fileID: 0}
  m_PrefabInstance: {fileID: 0}
  m_PrefabAsset: {fileID: 0}
  m_GameObject: {fileID: 1927694593}
  m_Enabled: 1
  serializedVersion: 9
  m_Type: 1
  m_Color: {r: 1, g: 1, b: 1, a: 1}
  m_Intensity: 1
  m_Range: 10
  m_SpotAngle: 30
  m_InnerSpotAngle: 21.80208
  m_CookieSize: 10
  m_Shadows:
    m_Type: 1
    m_Resolution: -1
    m_CustomResolution: -1
    m_Strength: 1
    m_Bias: 0.05
    m_NormalBias: 0.4
    m_NearPlane: 0.2
    m_CullingMatrixOverride:
      e00: 1
      e01: 0
      e02: 0
      e03: 0
      e10: 0
      e11: 1
      e12: 0
      e13: 0
      e20: 0
      e21: 0
      e22: 1
      e23: 0
      e30: 0
      e31: 0
      e32: 0
      e33: 1
    m_UseCullingMatrixOverride: 0
  m_Cookie: {fileID: 0}
  m_DrawHalo: 0
  m_Flare: {fileID: 0}
  m_RenderMode: 0
  m_CullingMask:
    serializedVersion: 2
    m_Bits: 4294967295
  m_RenderingLayerMask: 1
  m_Lightmapping: 1
  m_LightShadowCasterMode: 0
  m_AreaSize: {x: 1, y: 1}
  m_BounceIntensity: 1
  m_ColorTemperature: 6570
  m_UseColorTemperature: 0
  m_BoundingSphereOverride: {x: 0, y: 0, z: 0, w: 0}
  m_UseBoundingSphereOverride: 0
  m_ShadowRadius: 0
  m_ShadowAngle: 0
--- !u!4 &1927694595
Transform:
  m_ObjectHideFlags: 0
  m_CorrespondingSourceObject: {fileID: 0}
  m_PrefabInstance: {fileID: 0}
  m_PrefabAsset: {fileID: 0}
  m_GameObject: {fileID: 1927694593}
  m_LocalRotation: {x: 0.40821794, y: -0.23456973, z: 0.10938166, w: 0.8754261}
  m_LocalPosition: {x: -0.059788227, y: -0.18540911, z: -0.44332576}
  m_LocalScale: {x: 1, y: 1, z: 1}
  m_Children: []
  m_Father: {fileID: 0}
  m_RootOrder: 3
  m_LocalEulerAnglesHint: {x: 0, y: 0, z: 0}
