<?xml version="1.0" encoding="utf-8"?>
<!-- Generator: Adobe Illustrator 16.0.0, SVG Export Plug-In . SVG Version: 6.00 Build 0)  -->
<!DOCTYPE svg PUBLIC "-//W3C//DTD SVG 1.1//EN" "http://www.w3.org/Graphics/SVG/1.1/DTD/svg11.dtd">
<svg version="1.1" xmlns="http://www.w3.org/2000/svg" xmlns:xlink="http://www.w3.org/1999/xlink" x="0px" y="0px"
	 width="49.688px" height="49.688px" viewBox="0 0 49.688 49.688" enable-background="new 0 0 49.688 49.688" xml:space="preserve">
<g id="Layer_1" display="none">
	<g display="inline">
		<path fill="#E9E9E9" d="M46.9,6.167H2.7c-1.5,0-2.7,1.2-2.7,2.7v31.7c0,1.399,1.2,2.6,2.7,2.6H47c1.5,0,2.7-1.2,2.7-2.7v-31.6
			C49.6,7.367,48.4,6.167,46.9,6.167z M2,40.467v-31.6c0-0.4,0.3-0.7,0.7-0.7H47c0.4,0,0.7,0.3,0.7,0.7v19.5l-7.7-10.9
			c-0.2-0.3-0.5-0.4-0.8-0.4s-0.601,0.2-0.8,0.5l-6.9,10.8l-5.1-6.9c-0.2-0.3-0.5-0.4-0.801-0.4c-0.3,0-0.6,0.2-0.8,0.4l-14.4,19.7
			H2.7C2.3,41.167,2,40.867,2,40.467z M46.9,41.167h-34l12.7-17.4l5.101,6.9c0.2,0.3,0.5,0.4,0.8,0.4s0.6-0.2,0.8-0.5l6.8-10.8
			l8.301,12v8.601C47.6,40.867,47.3,41.167,46.9,41.167z"/>
		<path fill="#E9E9E9" d="M13,25.767c3,0,5.4-2.399,5.4-5.399s-2.4-5.4-5.4-5.4s-5.4,2.4-5.4,5.4C7.5,23.367,10,25.767,13,25.767z
			 M13,16.867c1.9,0,3.4,1.5,3.4,3.4s-1.5,3.4-3.4,3.4s-3.4-1.5-3.4-3.4C9.5,18.467,11.1,16.867,13,16.867z"/>
	</g>
</g>
<g id="Layer_2">
	<g>
		<path fill="#E9E9E9" d="M46.5,21.718H14.521c-1.793,0-3.188,1.395-3.188,3.188v14.446c0,1.793,1.396,3.188,3.188,3.188H46.5
			c1.794,0,3.188-1.395,3.188-3.188V24.807C49.688,23.113,48.294,21.718,46.5,21.718z M47.695,39.253
			c0,0.696-0.498,1.195-1.195,1.195H14.521c-0.698,0-1.196-0.499-1.196-1.195V24.807c0-0.697,0.498-1.195,1.196-1.195H46.5
			c0.697,0,1.195,0.498,1.195,1.195V39.253z"/>
		<path fill="#E9E9E9" d="M20.997,27.497h-2.989c-0.498,0-0.797,0.398-0.797,0.797v8.369c0,0.498,0.398,0.797,0.797,0.797
			c0.498,0,0.797-0.398,0.797-0.797v-2.59h1.992c2.392,0,3.985-1.396,3.985-3.388C24.782,28.792,23.288,27.497,20.997,27.497z
			 M23.089,30.784c0,1.096-0.896,1.793-2.292,1.793h-1.992v-3.586h2.092C21.495,29.091,23.089,29.19,23.089,30.784L23.089,30.784z
			 M29.664,27.497h-2.69c-0.498,0-0.797,0.398-0.797,0.797v8.369c0,0.498,0.398,0.797,0.797,0.797h2.789
			c3.089,0,5.28-2.092,5.28-4.981C34.944,29.589,32.752,27.497,29.664,27.497z M29.664,35.865h-1.893v-6.874h1.893
			c2.092,0,3.586,1.395,3.586,3.487C33.25,34.471,31.756,35.865,29.664,35.865z M43.213,27.497h-5.778
			c-0.498,0-0.797,0.398-0.797,0.797v8.369c0,0.498,0.398,0.797,0.797,0.797c0.499,0,0.797-0.398,0.797-0.797v-3.288h4.384
			c0.398,0,0.797-0.398,0.797-0.797c0-0.399-0.399-0.797-0.797-0.797h-4.384v-2.789h4.981c0.398,0,0.797-0.398,0.797-0.797
			C44.01,27.795,43.71,27.497,43.213,27.497z"/>
		<path fill="#E9E9E9" d="M38.83,44.234c-0.599,0-0.997,0.398-0.997,0.997v1.693c0,0.399-0.299,0.697-0.697,0.697H2.666
			c-0.398,0-0.698-0.298-0.698-0.697V2.69c0.1-0.399,0.398-0.697,0.698-0.697h26.5v7.472c0,0.598,0.398,0.996,0.996,0.996h7.571
			v8.07c0,0.598,0.399,0.997,0.996,0.997c0.599,0,0.997-0.398,0.997-0.997V9.464c0-0.698-0.299-1.395-0.797-1.893l-6.974-6.874
			C31.557,0.299,30.86,0,30.162,0H2.666c-1.395,0-2.59,1.196-2.59,2.69v44.333c0,1.494,1.196,2.69,2.69,2.69h34.47
			c1.494,0,2.69-1.196,2.69-2.69V45.33C39.826,44.632,39.328,44.234,38.83,44.234z M37.036,8.468h-5.877V2.69L37.036,8.468z"/>
	</g>
</g>
<g id="Layer_3" display="none">
	<path display="inline" fill="#E9E9E9" d="M43.05,22.533c0.301-1.1,0.5-2.2,0.5-3.3c0-6.9-5.6-12.5-12.5-12.5
		c-5.6,0-10.3,3.7-11.9,8.8c-1.1-0.5-2.4-0.8-3.7-0.8c-5.2,0-9.5,4.3-9.5,9.5c0,0.7,0.1,1.5,0.3,2.1c-3.6,1.4-6.1,4.8-6.1,8.9
		c0,3.2,1.6,6.1,4.1,7.8h17.6v-8.3h-6.7l11-11.7l10.7,11.7h-6.8v8.3h14.9c2.8-2.3,4.6-5.8,4.6-9.6
		C49.25,28.733,46.75,24.633,43.05,22.533L43.05,22.533z"/>
</g>
<g id="Layer_4" display="none">
	<g display="inline">
		<path fill="#E9E9E9" d="M16.213,23.899c0,1.611,1.309,3.021,3.021,3.021c1.611,0,3.021-1.309,3.021-3.021
			c0-1.611-1.309-3.021-3.021-3.021C17.622,20.979,16.213,22.288,16.213,23.899z M20.14,23.899c0,0.503-0.402,1.007-1.007,1.007
			c-0.604,0-1.007-0.403-1.007-1.007c0-0.503,0.403-1.007,1.007-1.007C19.737,22.893,20.14,23.396,20.14,23.899z M29.303,29.337
			c3.021,0,5.438-2.417,5.438-5.438s-2.417-5.438-5.438-5.438c-3.021,0-5.438,2.417-5.438,5.438S26.283,29.337,29.303,29.337z
			 M29.303,20.576c1.913,0,3.423,1.511,3.423,3.424c0,1.913-1.51,3.423-3.423,3.423c-1.914,0-3.424-1.51-3.424-3.423
			C25.879,22.087,27.39,20.576,29.303,20.576z M9.164,18.563c-3.021,0-5.438,2.417-5.438,5.438s2.417,5.438,5.438,5.438
			s5.437-2.417,5.437-5.438S12.083,18.563,9.164,18.563z M9.164,27.323c-1.914,0-3.424-1.511-3.424-3.424s1.511-3.423,3.424-3.423
			c1.913,0,3.423,1.51,3.423,3.423C12.487,25.813,10.977,27.323,9.164,27.323z M19.234,28.632c-3.021,0-5.438,2.417-5.438,5.438
			c0,3.021,2.417,5.438,5.438,5.438s5.437-2.417,5.437-5.438C24.57,31.049,22.153,28.632,19.234,28.632z M19.234,37.393
			c-1.914,0-3.424-1.511-3.424-3.424s1.511-3.423,3.424-3.423c1.913,0,3.423,1.51,3.423,3.423
			C22.557,35.882,21.046,37.393,19.234,37.393z M19.234,19.268c3.021,0,5.437-2.417,5.437-5.438c0-3.021-2.416-5.438-5.437-5.438
			s-5.438,2.417-5.438,5.438C13.796,16.851,16.213,19.268,19.234,19.268z M19.234,10.506c1.913,0,3.423,1.511,3.423,3.424
			c0,1.913-1.51,3.423-3.423,3.423c-1.914,0-3.424-1.51-3.424-3.423C15.81,12.017,17.32,10.506,19.234,10.506z"/>
		<path fill="#E9E9E9" d="M47.026,37.997c-3.323-2.316-9.365-1.51-14.299-0.302c3.524-3.524,5.74-8.358,5.74-13.694
			c0-10.674-8.659-19.233-19.232-19.233C8.559,4.767,0,13.427,0,24c0,10.673,8.661,19.232,19.234,19.232
			c2.114,0,4.128-0.302,5.94-1.007h0.101c0.101,0,0.202-0.1,0.402-0.1c0.403-0.202,0.907-0.303,1.31-0.503
			c5.135-1.914,15.003-4.733,18.931-2.014c1.208,0.906,1.813,2.215,1.712,4.229c0,0.604,0.402,1.007,1.007,1.007
			c0.503,0,1.007-0.402,1.007-1.007C49.745,41.219,48.939,39.205,47.026,37.997z M1.914,23.899c0-9.566,7.754-17.219,17.219-17.219
			c9.566,0,17.22,7.754,17.22,17.219c0,7.049-4.229,13.091-10.271,15.809c-0.604,0.202-1.007,0.403-1.309,0.504
			c-1.712,0.604-3.625,0.906-5.64,0.906C9.667,41.219,1.914,33.466,1.914,23.899z"/>
	</g>
</g>
</svg>
