<?xml version="1.0" encoding="utf-8"?>
<!-- Generator: Adobe Illustrator 16.0.0, SVG Export Plug-In . SVG Version: 6.00 Build 0)  -->
<!DOCTYPE svg PUBLIC "-//W3C//DTD SVG 1.1//EN" "http://www.w3.org/Graphics/SVG/1.1/DTD/svg11.dtd">
<svg version="1.1" id="Layer_1" xmlns="http://www.w3.org/2000/svg" xmlns:xlink="http://www.w3.org/1999/xlink" x="0px" y="0px"
	 width="64px" height="64px" viewBox="0 0 64 64" enable-background="new 0 0 64 64" xml:space="preserve">
<g>
	<path fill-rule="evenodd" clip-rule="evenodd" fill="#19B5FE" d="M58.707,27.512c-1.892-0.015-3.783,0.011-5.676-0.019
		c-0.765-0.012-1.593,0.099-2.227-0.43c-1.52-1.266-2.707-0.606-3.826,0.577c-2.697,2.852-5.304,5.772-6.89,9.438
		c-0.214,0.493-0.32,1.205-1.059,1.073c-0.651-0.118-0.746-0.774-0.816-1.333c-0.124-0.981-0.031-1.944,0.226-2.911
		c1.37-5.141,1.043-5.549-4.275-5.568c-1.682-0.006-3.372,0.128-5.04-0.106c-1.536-0.215-2.502-1.478-1.718-2.147
		c1.596-1.363,1.791-2.814,1.163-4.615c-0.061-0.172,0.07-0.411,0.17-0.595c1.046-1.908-0.008-4.493,2.021-6.127
		c0.382-0.307,0.032-1.058-0.132-1.602c-0.407-1.348,0.294-2.088,1.524-2.179c4.59-0.338,9.211-1.055,13.713,0.587
		c1.907,0.696,3.772,0.763,5.74,0.155c2.06-0.637,2.609-1.804,1.102-3.265c-3.83-3.709-8.201-6.6-13.565-7.502
		c-3.661-0.615-7.391-0.551-11.099-0.471c-4.77,0.104-9.284,1.093-13.303,3.844C7.014,9.603,1.717,16.288,1.306,25.821
		c0.085,0.745,0.086,1.498,0.002,2.243c0.014,0.492,0.008,0.984-0.059,1.471c-0.001,0.038-0.002,0.077-0.006,0.115
		c-0.002,0.016-0.001,0.033-0.002,0.05c-0.002,0.772,0,1.545,0.019,2.318c0.358,0.994,1.214,1.051,2.069,1.088
		c1.681,0.069,3.364,0.007,5.045,0.046c0.765,0.018,1.598-0.07,2.168,0.572c1.317,1.484,2.331,0.89,3.489-0.287
		c3.012-3.062,5.874-6.206,7.391-10.33c0.137-0.371,0.265-0.88,0.825-0.776c0.459,0.085,0.657,0.508,0.773,0.914
		c0.256,0.891,0.253,1.81,0.083,2.708c-0.17,0.893-0.413,1.772-0.639,2.654c-0.663,2.588,0.05,3.566,2.667,3.667
		c1.68,0.064,3.364,0.01,5.045,0.031c0.839,0.01,1.684-0.019,2.495,0.271c1.609,0.576,1.951,1.526,0.904,2.831
		c-0.499,0.623-1.082,1.232-0.93,2.025c0.255,1.317-0.382,2.42-0.556,3.599c-0.271,1.847-0.373,3.642-1.488,5.229
		c-0.183,0.261,0.007,0.68,0.054,1.026c0.25,1.896-0.202,2.706-2.097,2.794c-4.748,0.222-9.536,0.582-14.14-1.103
		c-1.393-0.51-2.653-0.479-4.035,0.186c-2.4,1.157-2.621,1.811-0.7,3.729c4.401,4.392,9.52,7.089,15.531,7.614
		c0.451-0.063,0.915-0.105,1.408-0.105c0.422,0,0.819,0.037,1.208,0.086c0.301,0.014,0.594,0.038,0.878,0.075
		c0.219,0.009,0.439,0.008,0.657,0.033h3.129c0.308-0.041,0.626-0.066,0.952-0.08c0.389-0.048,0.786-0.083,1.207-0.083
		c0.475,0,0.924,0.04,1.359,0.098c2.229-0.097,4.438-0.334,6.536-1.174c7.16-2.866,12.426-7.821,16.164-14.561
		c1.277-2.302,1.676-4.756,2.024-7.226c-0.1-1.14,0.003-2.292,0.277-3.396c0.011-0.525,0.057-1.049,0.146-1.565V28.43
		C60.529,27.626,59.646,27.52,58.707,27.512z"/>
	<path fill-rule="evenodd" clip-rule="evenodd" fill="#FEFEFE" d="M61.187,1.778c0.004-1.11-0.043-1.571-1.442-1.566
		C40.648,0.28,21.55,0.28,2.454,0.212C1.062,0.207,1.004,0.659,1.01,1.775C1.046,9.022,1.037,16.27,1.034,23.518
		c0.182,0.765,0.272,1.555,0.267,2.345c0.048,0.438,0.078,0.879,0.067,1.321c0.009-0.029,0.017-0.062,0.022-0.108
		C2.122,16.227,10.587,5.805,21.67,2.11C32.566-1.522,45.792,1.77,52.753,9.842c0.198,0.229,0.294,0.462,0.017,0.859
		c-1.508-0.679-2.868,1.079-4.301,0.534c-5.072-1.929-10.282-1.703-15.538-1.425c-3.489,0.185-4.466,1.839-2.689,4.838
		c-2.163,1.417-1.945,1.396-1.691,4.173c0.133,1.436-2.331,2.729-0.529,4.511c0.049,0.049,0.11,0.089,0.151,0.145
		c0.235,0.33,0.302,0.545-0.212,0.731c-1.464,0.53-2.51,1.485-1.926,3.158c0.568,1.627,2.02,1.942,3.606,1.917
		c2.521-0.042,5.044,0.048,7.563-0.034c1.262-0.042,1.396,0.425,1.103,1.487c-0.487,1.748-1.112,3.471-1.233,5.302
		c-0.108,1.665,0.392,3.028,1.969,3.853c0.583,0.305,1.042,0.429,1.262-0.383c1.301-4.79,4.552-8.268,7.872-11.699
		c0.697-0.721,1.45-2.211,1.709,0.252c0.072,0.68,0.771,0.48,1.213,0.478c3.355-0.019,6.712-0.068,10.067-0.108
		C61.163,19.545,61.145,10.661,61.187,1.778z"/>
	<path fill-rule="evenodd" clip-rule="evenodd" fill="#FEFEFE" d="M26.625,60.402c0.437,0,0.848,0.038,1.25,0.089
		c0.049,0.002,0.098,0.004,0.146,0.007c-0.033-0.018-0.065-0.034-0.12-0.049c-7.657-0.88-14.04-4.159-19.085-10.073
		c1.61,0.451,2.8-1.405,4.223-0.815c5.05,2.096,10.313,1.564,15.548,1.479c1.322-0.021,2.484-0.376,3.202-1.619
		c0.75-1.302-0.075-2.222-0.778-3.158c2.333-1.665,2.107-1.637,1.772-4.231c-0.183-1.427,2.266-2.721,0.574-4.51
		c-0.048-0.05-0.082-0.112-0.129-0.166c-0.356-0.398-0.094-0.627,0.249-0.775c1.354-0.584,2.352-1.491,1.847-3.058
		c-0.564-1.757-2.125-2.038-3.758-2.033c-2.451,0.007-4.903-0.036-7.354,0.012c-1.135,0.022-1.536-0.328-1.18-1.471
		c0.396-1.268,0.78-2.547,1.031-3.848c0.309-1.593,0.496-3.218-0.799-4.552c-1.274-1.311-1.954-1.183-2.504,0.506
		c-1.62,4.963-5.25,8.414-8.823,12.075c-0.598-1.994-0.598-1.988-2.693-1.998c-2.591-0.013-5.182-0.036-7.771-0.056
		c-0.18-0.24-0.326-0.221-0.44,0.056c0,9.075,0.026,18.153-0.033,27.229c-0.008,1.156,0.222,1.408,1.392,1.398
		c7.144-0.054,14.288-0.041,21.432-0.037C24.669,60.549,25.6,60.402,26.625,60.402z"/>
</g>
</svg>
