<?xml version="1.0"?>
<svg xmlns:rdf="http://www.w3.org/1999/02/22-rdf-syntax-ns#" xmlns="http://www.w3.org/2000/svg" xmlns:cc="http://creativecommons.org/ns#" xmlns:xlink="http://www.w3.org/1999/xlink" xmlns:dc="http://purl.org/dc/elements/1.1/" xmlns:svg="http://www.w3.org/2000/svg" id="svg1" height="128pt" width="128pt">
  <defs id="defs3">
    <linearGradient id="linearGradient924">
      <stop id="stop925" stop-color="#fff" stop-opacity="0" offset="0"/>
      <stop id="stop926" stop-color="#fff" offset="1"/>
    </linearGradient>
    <linearGradient id="linearGradient895" y2="1.4458" xlink:href="#linearGradient924" y1=".57031" x2=".69048" x1=".69048"/>
    <linearGradient id="linearGradient1535">
      <stop id="stop1536" stop-color="#797979" offset="0"/>
      <stop id="stop1537" stop-color="#fff" offset="1"/>
    </linearGradient>
    <linearGradient id="linearGradient580">
      <stop id="stop581" stop-color="#7e7e7e" offset="0"/>
      <stop id="stop582" stop-color="#fff" offset="1"/>
    </linearGradient>
    <linearGradient id="linearGradient1501">
      <stop id="stop1502" stop-color="#fff" offset="0"/>
      <stop id="stop1504" stop-color="#fff" stop-opacity="0" offset="1"/>
    </linearGradient>
    <linearGradient id="linearGradient957" y2="-.28125" xlink:href="#linearGradient924" y1=".59375" x2=".53216" x1=".49123"/>
    <linearGradient id="linearGradient955" y2="1.1016" xlink:href="#linearGradient580" y1="-.18299" x2=".54779" x1=".5"/>
    <linearGradient id="linearGradient912" y2=".025745" xlink:href="#linearGradient1535" y1="1.0659" x2=".35233" x1=".74646"/>
    <linearGradient id="linearGradient937" y2=".17876" xlink:href="#linearGradient580" y1=".35305" x2=".26504" x1=".68593"/>
    <linearGradient id="linearGradient682" y1="-.0625" x2=".6573" x1=".90909" y2=".61719">
      <stop id="stop677" stop-opacity=".30693" offset="0"/>
      <stop id="stop678" stop-opacity="0" offset="1"/>
    </linearGradient>
    <linearGradient id="linearGradient683" y2=".64844" xlink:href="#linearGradient1501" y1=".97656" x2=".80263" x1=".90789"/>
    <linearGradient id="linearGradient896" y2=".16024" xlink:href="#linearGradient1535" y1=".63025" x2="-.046128" x1=".90783"/>
    <linearGradient id="linearGradient589" y2=".90963" xlink:href="#linearGradient924" y1=".71812" x2="1.1189" x1=".73914"/>
    <linearGradient id="linearGradient1002" y2=".26562" xlink:href="#linearGradient1501" y1="-.42188" x2=".46711" x1=".125"/>
  </defs>
  <path id="text2539" stroke-width="1pt" d="m18.969 182.28v-8.59h1.711l2.034 6.08c0.187 0.57 0.324 1 0.41 1.28 0.097-0.32 0.25-0.78 0.457-1.38l2.056-5.98h1.53v8.59h-1.096v-7.19l-2.496 7.19h-1.025l-2.485-7.31v7.31h-1.096zm13.987 0v-0.91c-0.485 0.7-1.143 1.05-1.975 1.05-0.367 0-0.71-0.07-1.028-0.21-0.319-0.14-0.555-0.31-0.709-0.53-0.154-0.21-0.263-0.47-0.325-0.78-0.043-0.21-0.065-0.54-0.065-0.98v-3.86h1.055v3.45c0 0.55 0.021 0.92 0.064 1.11 0.067 0.28 0.207 0.5 0.422 0.66s0.481 0.24 0.797 0.24c0.317 0 0.613-0.09 0.891-0.25 0.277-0.16 0.473-0.38 0.589-0.66 0.115-0.28 0.172-0.68 0.172-1.22v-3.33h1.055v6.22h-0.943zm2.179-1.85l1.043-0.17c0.059 0.42 0.222 0.74 0.49 0.96 0.267 0.22 0.641 0.34 1.122 0.34 0.484 0 0.844-0.1 1.078-0.3s0.351-0.43 0.351-0.69c0-0.24-0.103-0.43-0.31-0.57-0.145-0.09-0.504-0.21-1.078-0.35-0.774-0.2-1.31-0.37-1.609-0.51-0.298-0.14-0.525-0.34-0.679-0.59-0.155-0.25-0.232-0.53-0.232-0.84 0-0.27 0.064-0.53 0.191-0.77 0.127-0.23 0.299-0.43 0.518-0.59 0.164-0.12 0.388-0.22 0.671-0.3 0.283-0.09 0.587-0.13 0.911-0.13 0.489 0 0.917 0.07 1.286 0.21 0.37 0.14 0.642 0.33 0.818 0.57s0.297 0.56 0.363 0.97l-1.031 0.14c-0.047-0.32-0.183-0.57-0.407-0.75-0.225-0.18-0.542-0.27-0.953-0.27-0.484 0-0.83 0.08-1.037 0.24s-0.31 0.34-0.31 0.56c0 0.14 0.043 0.26 0.129 0.37s0.22 0.21 0.404 0.28c0.105 0.04 0.416 0.13 0.932 0.27 0.746 0.2 1.266 0.36 1.561 0.49s0.527 0.31 0.694 0.55c0.168 0.24 0.252 0.55 0.252 0.9 0 0.36-0.102 0.69-0.307 1s-0.501 0.55-0.888 0.72-0.824 0.25-1.312 0.25c-0.809 0-1.425-0.16-1.849-0.5s-0.694-0.83-0.812-1.49zm6.428-5.52v-1.22h1.055v1.22h-1.055zm0 7.37v-6.22h1.055v6.22h-1.055zm6.727-2.28l1.037 0.14c-0.113 0.71-0.403 1.27-0.87 1.68-0.467 0.4-1.04 0.6-1.72 0.6-0.852 0-1.536-0.27-2.054-0.83-0.517-0.56-0.776-1.36-0.776-2.4 0-0.67 0.111-1.25 0.334-1.76 0.223-0.5 0.561-0.88 1.017-1.13 0.455-0.25 0.95-0.38 1.485-0.38 0.676 0 1.228 0.17 1.658 0.51s0.705 0.83 0.826 1.46l-1.025 0.16c-0.098-0.42-0.271-0.74-0.519-0.95s-0.548-0.31-0.899-0.31c-0.531 0-0.963 0.19-1.295 0.57s-0.498 0.98-0.498 1.81 0.16 1.44 0.48 1.82c0.321 0.38 0.739 0.57 1.254 0.57 0.414 0 0.76-0.13 1.037-0.38 0.278-0.26 0.454-0.65 0.528-1.18zm5.461 2.28v-8.59h5.795v1.02h-4.659v2.66h4.032v1.01h-4.032v3.9h-1.136zm7.148-7.37v-1.22h1.055v1.22h-1.055zm0 7.37v-6.22h1.055v6.22h-1.055zm2.643 0v-8.59h1.054v8.59h-1.054zm6.955-2l1.09 0.13c-0.172 0.64-0.491 1.13-0.955 1.49-0.465 0.35-1.059 0.52-1.782 0.52-0.91 0-1.632-0.28-2.165-0.84s-0.8-1.34-0.8-2.36c0-1.04 0.27-1.86 0.809-2.43 0.539-0.58 1.238-0.87 2.098-0.87 0.832 0 1.511 0.28 2.039 0.85 0.527 0.57 0.791 1.36 0.791 2.39 0 0.06-0.002 0.16-0.006 0.28h-4.641c0.039 0.68 0.233 1.21 0.58 1.57 0.348 0.36 0.782 0.55 1.301 0.55 0.387 0 0.717-0.11 0.99-0.31 0.274-0.2 0.491-0.53 0.651-0.97zm-3.463-1.71h3.475c-0.047-0.52-0.18-0.91-0.399-1.17-0.336-0.41-0.771-0.61-1.307-0.61-0.484 0-0.891 0.16-1.221 0.48-0.33 0.33-0.513 0.76-0.548 1.3z"/>
  <path id="path2493" d="m18.539 95.503s-7.289 27.437-3.322 36.057c4.063 8.82 26.488 25.06 37.233 24.21 10.744-0.84 36.647-10.77 35.397-15.39-1.25-4.63-59.462-59.129-69.308-44.877z" stroke-width=".96516pt" fill="#b2b2b2" fill-rule="evenodd"/>
  <path id="path2526" d="m19.032 105.24s-7.028 26.46-3.203 34.77c3.918 8.5 25.544 24.17 35.905 23.35s35.34-10.39 34.135-14.85c-1.206-4.46-57.342-57.014-66.837-43.27z" stroke-width=".96516pt" fill="url(#linearGradient1002)" fill-rule="evenodd"/>
  <path id="path2522" d="m20.948 94.621s-7.029 26.459-3.204 34.769c3.919 8.51 25.544 24.17 35.905 23.35s35.341-10.39 34.135-14.85c-1.205-4.45-57.341-57.013-66.836-43.269z" stroke-width=".96516pt" fill="url(#linearGradient683)" fill-rule="evenodd"/>
  <path id="path2494" d="m119.41 22.874a59.319 27.733 0 1 0 -118.64 0 59.319 27.733 0 1 0 118.64 0z" fill-rule="evenodd" transform="matrix(.89755 .62006 -.62006 .89755 23.163 48.585)" stroke="url(#linearGradient896)" stroke-width="1pt" fill="url(#linearGradient937)"/>
  <path id="path2492" d="m119.41 22.874a59.319 27.733 0 1 0 -118.64 0 59.319 27.733 0 1 0 118.64 0z" fill-rule="evenodd" transform="matrix(.82276 .56839 -.56839 .82276 28.227 50.866)" stroke-width="1pt" fill="url(#linearGradient955)"/>
  <path id="path2500" d="m14.357 73.912c10.939-15.984 40.176-14.939 72.988 13.666 32.815 28.602 33.885 45.862 23.125 57.002-11.068 11.47-30.182 3.21-61.476-19.74-30.583-22.42-40.009-43.08-34.637-50.928z" stroke-width="1pt" fill="url(#linearGradient682)" fill-rule="evenodd"/>
  <g id="g2545" fill-rule="evenodd" transform="matrix(.73641 0 0 .73641 72.115 -8.1895)">
    <path id="path2873" d="m-32.386-23.926a21.692 12.221 0 1 0 -43.384 0 21.692 12.221 0 1 0 43.384 0z" stroke-width="1pt" transform="matrix(1.1414 0 0 1.1414 122.73 153.34)"/>
    <path id="path2875" d="m-36.663-17.816a17.72 15.276 0 1 0 -35.441 0 17.72 15.276 0 1 0 35.441 0z" stroke-width="1pt" fill="url(#linearGradient957)" transform="matrix(1.2035 0 0 .799 126.51 139.92)"/>
    <path id="path2877" d="m-35.688-125.78v100.62h5.376v-93.504c3.054 0.95 7.551 2.5 12.281 5.13 3.491 1.94 6.462 4.33 7.719 6.5 1.256 2.17 1.4356 3.84-0.969 6.87-6.338 8.009-6.908 16.812-5.219 23.566 0.844 3.378 2.219 6.27 3.75 8.5 1.531 2.231 2.9361 3.924 5.2812 4.594 0 0-6.1482-10.459-5.9512-16.85 0.197-6.392 1.085-9.802 6.3575-16.462 3.4001-4.298 3.5296-9.238 1.4063-12.908-2.1234-3.67-5.8328-6.35-9.7498-8.53-7.835-4.36-16.906-6.66-16.906-6.66l-3.376-0.87z" stroke-width="5.375" transform="translate(116.1 150.82)"/>
  </g>
  <g id="g2479" fill-rule="evenodd" transform="matrix(.53467 0 0 .53467 53.407 -9.941)">
    <path id="path2480" d="m-32.386-23.926a21.692 12.221 0 1 0 -43.384 0 21.692 12.221 0 1 0 43.384 0z" stroke-width="1pt" transform="matrix(1.1414 0 0 1.1414 122.73 153.34)"/>
    <path id="path2481" d="m-36.663-17.816a17.72 15.276 0 1 0 -35.441 0 17.72 15.276 0 1 0 35.441 0z" stroke-width="1pt" fill="url(#linearGradient957)" transform="matrix(1.2035 0 0 .799 126.51 139.92)"/>
    <path id="path2482" d="m-35.688-125.78v100.62h5.376v-93.504c3.054 0.95 7.551 2.5 12.281 5.13 3.491 1.94 6.462 4.33 7.719 6.5 1.256 2.17 1.4356 3.84-0.969 6.87-6.338 8.009-6.908 16.812-5.219 23.566 0.844 3.378 2.219 6.27 3.75 8.5 1.531 2.231 2.9361 3.924 5.2812 4.594 0 0-6.1482-10.459-5.9512-16.85 0.197-6.392 1.085-9.802 6.3575-16.462 3.4001-4.298 3.5296-9.238 1.4063-12.908-2.1234-3.67-5.8328-6.35-9.7498-8.53-7.835-4.36-16.906-6.66-16.906-6.66l-3.376-0.87z" stroke-width="5.375" transform="translate(116.1 150.82)"/>
  </g>
  <path id="path2524" d="m119.41 22.874a59.319 27.733 0 1 0 -118.64 0 59.319 27.733 0 1 0 118.64 0z" fill-rule="evenodd" transform="matrix(.82276 .56839 -.56839 .82276 29.165 50.446)" stroke-width="1pt" fill="url(#linearGradient589)"/>
  <path id="path2491" d="m84.741 18.252a27.348 12.326 0 1 0 -54.697 0 27.348 12.326 0 1 0 54.697 0z" fill-rule="evenodd" transform="matrix(.85695 .59202 -.59202 .85695 20.957 59.903)" stroke-width="1pt" fill="url(#linearGradient912)"/>
  <path id="path2521" d="m45.123 96.039c-5.334 6.571 6.995 21.711 18.189 25.891 12.392 4.63 25.579 2.21 16.453-8.63-8.998-10.69-29.186-23.98-34.642-17.261z" stroke-width="1pt" fill="url(#linearGradient895)" fill-rule="evenodd"/>
  <metadata>
    <rdf:RDF>
      <cc:Work>
        <dc:format>image/svg+xml</dc:format>
        <dc:type rdf:resource="http://purl.org/dc/dcmitype/StillImage"/>
        <cc:license rdf:resource="http://creativecommons.org/licenses/publicdomain/"/>
        <dc:publisher>
          <cc:Agent rdf:about="http://openclipart.org/">
            <dc:title>Openclipart</dc:title>
          </cc:Agent>
        </dc:publisher>
        <dc:title>Audio File Icon</dc:title>
        <dc:date>2009-04-29T11:31:45</dc:date>
        <dc:description>An Audio file icon by Andrew Fitzsimon. Etiquette Icon set. From 0.18 OCAL database.</dc:description>
        <dc:source>http://openclipart.org/detail/25460/audio-file-icon-by-anonymous-25460</dc:source>
        <dc:creator>
          <cc:Agent>
            <dc:title>Anonymous</dc:title>
          </cc:Agent>
        </dc:creator>
        <dc:subject>
          <rdf:Bag>
            <rdf:li>clip art</rdf:li>
            <rdf:li>clipart</rdf:li>
            <rdf:li>computer</rdf:li>
            <rdf:li>etiquette</rdf:li>
            <rdf:li>gnome</rdf:li>
            <rdf:li>hardware</rdf:li>
            <rdf:li>icon</rdf:li>
            <rdf:li>image</rdf:li>
            <rdf:li>media</rdf:li>
            <rdf:li>music</rdf:li>
            <rdf:li>png</rdf:li>
            <rdf:li>public domain</rdf:li>
            <rdf:li>sound</rdf:li>
            <rdf:li>speaker</rdf:li>
            <rdf:li>svg</rdf:li>
          </rdf:Bag>
        </dc:subject>
      </cc:Work>
      <cc:License rdf:about="http://creativecommons.org/licenses/publicdomain/">
        <cc:permits rdf:resource="http://creativecommons.org/ns#Reproduction"/>
        <cc:permits rdf:resource="http://creativecommons.org/ns#Distribution"/>
        <cc:permits rdf:resource="http://creativecommons.org/ns#DerivativeWorks"/>
      </cc:License>
    </rdf:RDF>
  </metadata>
</svg>
