<?xml version="1.0" encoding="UTF-8"?>
<!-- Created with Inkscape (http://www.inkscape.org/) -->
<svg id="svg1141" width="512" height="512" version="1.1" viewBox="0 0 135.47 135.47" xmlns="http://www.w3.org/2000/svg">
 <g id="layer1">
  <rect id="rect1247" transform="rotate(45)" x="49.843" y="-45.946" width="91.893" height="91.893" ry="15.593" fill="#500" fill-opacity=".72157" stroke="#8dd35f" stroke-width="2.0131" style="paint-order:markers fill stroke"/>
  <text id="text7673" transform="scale(.26458)" font-family="'Quicksand Medium'" font-size="24px" style="line-height:1.25;shape-inside:url(#rect7675);white-space:pre" xml:space="preserve"/>
  <text id="text8297" x="44.710823" y="101.17942" fill="#ffaaee" font-family="'Quicksand Medium'" font-size="90.64px" stroke="#8800aa" stroke-width=".53109" style="line-height:1.25" xml:space="preserve"><tspan id="tspan8295" x="44.710823" y="101.17942" fill="#ffaaee" font-size="90.64px" stroke="#8800aa" stroke-width=".53109">?</tspan></text>
 </g>
</svg>
