<?xml version="1.0" encoding="UTF-8" standalone="no"?>
<svg
     xmlns:dc="http://purl.org/dc/elements/1.1/"
     xmlns:cc="http://creativecommons.org/ns#"
     xmlns:rdf="http://www.w3.org/1999/02/22-rdf-syntax-ns#"
     xmlns:svg="http://www.w3.org/2000/svg"
     xmlns="http://www.w3.org/2000/svg"
     xmlns:xlink="http://www.w3.org/1999/xlink"
     xmlns:sodipodi="http://sodipodi.sourceforge.net/DTD/sodipodi-0.dtd"
     xmlns:inkscape="http://www.inkscape.org/namespaces/inkscape"
     version="1.1"
     id="Layer_1"
     x="0px"
     y="0px"
     width="400px"
     height="400px"
     viewBox="0 0 400 400"
     enable-background="new 0 0 400 400"
     xml:space="preserve"
     sodipodi:docname="clipboard.svg"
     inkscape:version="1.0.2 (e86c870879, 2021-01-15)"
     inkscape:export-filename="/home/cosmos/Softwares/Projects/DesQ/DesQ-Utils/Clipboard/icons/clipboard.png"
     inkscape:export-xdpi="61.439999"
     inkscape:export-ydpi="61.439999"><metadata
     id="metadata75"><rdf:RDF><cc:Work
             rdf:about=""><dc:format>image/svg+xml</dc:format><dc:type
                 rdf:resource="http://purl.org/dc/dcmitype/StillImage" /><dc:title /></cc:Work></rdf:RDF></metadata><defs
     id="defs73"><linearGradient
         inkscape:collect="always"
         id="linearGradient34435"><stop
             style="stop-color:#000000;stop-opacity:1;"
             offset="0"
             id="stop34431" /><stop
             style="stop-color:#ffffff;stop-opacity:1"
             offset="1"
             id="stop34433" /></linearGradient><linearGradient
         inkscape:collect="always"
         id="linearGradient26782"><stop
             style="stop-color:#00ff00;stop-opacity:0.59720045"
             offset="0"
             id="stop26778" /><stop
             style="stop-color:#ff00ff;stop-opacity:0.56784099"
             offset="1"
             id="stop26780" /></linearGradient><linearGradient
         inkscape:collect="always"
         id="linearGradient26772"><stop
             style="stop-color:#ff0000;stop-opacity:0.4627451"
             offset="0"
             id="stop26768" /><stop
             style="stop-color:#ffa900;stop-opacity:0.73325098"
             offset="1"
             id="stop26770" /></linearGradient><linearGradient
         inkscape:collect="always"
         id="linearGradient26764"><stop
             style="stop-color:#ff3300;stop-opacity:1"
             offset="0"
             id="stop26760" /><stop
             style="stop-color:#ff9800;stop-opacity:0.6275413"
             offset="1"
             id="stop26762" /></linearGradient><linearGradient
         inkscape:collect="always"
         id="linearGradient26756"><stop
             style="stop-color:#00d8ff;stop-opacity:0.53725493"
             offset="0"
             id="stop26752" /><stop
             style="stop-color:#ff0000;stop-opacity:0.68741041"
             offset="1"
             id="stop26754" /></linearGradient><linearGradient
         inkscape:collect="always"
         id="linearGradient26748"><stop
             style="stop-color:#0000ff;stop-opacity:1;"
             offset="0"
             id="stop26744" /><stop
             style="stop-color:#00d8ff;stop-opacity:0.53889126"
             offset="1"
             id="stop26746" /></linearGradient><inkscape:perspective
         sodipodi:type="inkscape:persp3d"
         inkscape:vp_x="639.82889 : -57.475708 : 1"
         inkscape:vp_y="0 : 999.99993 : 0"
         inkscape:vp_z="178.149 : -86.854568 : 1"
         inkscape:persp3d-origin="121.39033 : -86.002848 : 1"
         id="perspective10" /><inkscape:perspective
         sodipodi:type="inkscape:persp3d"
         inkscape:vp_x="422.44923 : -69.597718 : 1"
         inkscape:vp_y="0 : 264.58332 : 0"
         inkscape:vp_z="300.29642 : -77.370868 : 1"
         inkscape:persp3d-origin="285.27902 : -77.145518 : 1"
         id="perspective10-3" /><linearGradient
         inkscape:collect="always"
         xlink:href="#linearGradient26748"
         id="linearGradient26750"
         x1="17.695654"
         y1="35.296341"
         x2="-15.964261"
         y2="37.008675"
         gradientUnits="userSpaceOnUse" /><linearGradient
         inkscape:collect="always"
         xlink:href="#linearGradient26756"
         id="linearGradient26758"
         x1="17.979218"
         y1="28.443516"
         x2="22.585917"
         y2="55.011868"
         gradientUnits="userSpaceOnUse"
         gradientTransform="translate(-17.462519)" /><linearGradient
         inkscape:collect="always"
         xlink:href="#linearGradient26764"
         id="linearGradient26766"
         x1="36.979591"
         y1="55.541668"
         x2="63.781723"
         y2="34.468697"
         gradientUnits="userSpaceOnUse"
         gradientTransform="translate(37.570848)" /><linearGradient
         inkscape:collect="always"
         xlink:href="#linearGradient26782"
         id="linearGradient26784"
         x1="-23.500893"
         y1="35.68605"
         x2="2.8681393"
         y2="15.43422"
         gradientUnits="userSpaceOnUse"
         gradientTransform="translate(15.874998)" /><linearGradient
         inkscape:collect="always"
         xlink:href="#linearGradient26772"
         id="linearGradient26786"
         gradientUnits="userSpaceOnUse"
         gradientTransform="translate(37.570848)"
         x1="52.803432"
         y1="18.438198"
         x2="42.272232"
         y2="32.295864" /><mask
         maskUnits="userSpaceOnUse"
         id="mask34445"><rect
             style="opacity:1;fill:url(#linearGradient34449);fill-opacity:1;stroke:#000000;stroke-width:2.07557;stroke-linecap:round;stroke-linejoin:round;stroke-miterlimit:4;stroke-dasharray:none;stroke-opacity:1"
             id="rect34447"
             width="145.86618"
             height="77.430176"
             x="-34.207047"
             y="-70.732597"
             transform="scale(1,-1)" /></mask><linearGradient
         inkscape:collect="always"
         xlink:href="#linearGradient34435"
         id="linearGradient34449"
         gradientUnits="userSpaceOnUse"
         x1="31.318277"
         y1="79.766197"
         x2="31.318277"
         y2="55.203121"
         gradientTransform="matrix(1.1860411,0,0,1.1860411,-4.9978147,-126.0058)" /><filter
         inkscape:collect="always"
         style="color-interpolation-filters:sRGB"
         id="filter34965"
         x="-0.076522593"
         width="1.1530452"
         y="-0.073536816"
         height="1.1470736"><feGaussianBlur
             inkscape:collect="always"
             stdDeviation="1.8161693"
             id="feGaussianBlur34967" /></filter><linearGradient
         inkscape:collect="always"
         xlink:href="#linearGradient26782"
         id="linearGradient362"
         gradientUnits="userSpaceOnUse"
         gradientTransform="translate(15.874998)"
         x1="-23.500893"
         y1="35.68605"
         x2="2.8681393"
         y2="15.43422" /><linearGradient
         inkscape:collect="always"
         xlink:href="#linearGradient26756"
         id="linearGradient364"
         gradientUnits="userSpaceOnUse"
         gradientTransform="translate(-17.462519)"
         x1="17.979218"
         y1="28.443516"
         x2="22.585917"
         y2="55.011868" /><linearGradient
         inkscape:collect="always"
         xlink:href="#linearGradient26772"
         id="linearGradient366"
         gradientUnits="userSpaceOnUse"
         gradientTransform="translate(37.570848)"
         x1="52.803432"
         y1="18.438198"
         x2="42.272232"
         y2="32.295864" /><linearGradient
         inkscape:collect="always"
         xlink:href="#linearGradient26764"
         id="linearGradient368"
         gradientUnits="userSpaceOnUse"
         gradientTransform="translate(37.570848)"
         x1="36.979591"
         y1="55.541668"
         x2="63.781723"
         y2="34.468697" /><linearGradient
         inkscape:collect="always"
         xlink:href="#linearGradient26748"
         id="linearGradient370"
         gradientUnits="userSpaceOnUse"
         x1="17.695654"
         y1="35.296341"
         x2="-15.964261"
         y2="37.008675" /></defs><sodipodi:namedview
     pagecolor="#ffffff"
     bordercolor="#666666"
     borderopacity="1"
     objecttolerance="10"
     gridtolerance="10"
     guidetolerance="10"
     inkscape:pageopacity="0"
     inkscape:pageshadow="2"
     inkscape:window-width="1366"
     inkscape:window-height="744"
     id="namedview71"
     showgrid="false"
     inkscape:zoom="0.73375"
     inkscape:cx="200"
     inkscape:cy="200"
     inkscape:window-x="0"
     inkscape:window-y="0"
     inkscape:window-maximized="1"
     inkscape:current-layer="Layer_1"
     inkscape:document-rotation="0" />


























<g
     id="g141"><path
         fill="#771214"
         stroke="#000000"
         stroke-width="2"
         stroke-miterlimit="10"
         d="M312.648,362.539  c0,5.501-5.531,9.961-12.355,9.961H87.677c-6.823,0-12.355-4.46-12.355-9.961V57.453c0-5.501,5.532-9.961,12.355-9.961h212.616  c6.824,0,12.355,4.46,12.355,9.961V362.539z"
         id="path2" /><rect
         x="88.071"
         y="60.154"
         fill="#FFFFFF"
         stroke="#000000"
         stroke-width="2"
         stroke-miterlimit="10"
         width="210.445"
         height="300.386"
         id="rect4" /><path
         fill="#BFBFBF"
         stroke="#000000"
         stroke-miterlimit="10"
         d="M199.262,38.206"
         id="path6" /><path
         fill="none"
         stroke="#000000"
         stroke-miterlimit="10"
         d="M198.406,38.211"
         id="path8" /><path
         fill="none"
         stroke="#000000"
         stroke-miterlimit="10"
         d="M183.207,39.21"
         id="path10" /><path
         fill="#A8A5A5"
         stroke="#A8A5A5"
         stroke-miterlimit="10"
         d="M197.827,33.206"
         id="path12" /><g
         id="g22">
	<path
     fill="#828282"
     d="M232.667,42.367v8.366v-0.288v4.039h0.124h18.875c4.453,0,8.064,3.983,8.064,8.898v4.898H126.858v-4.898   c0-4.915,3.61-8.898,8.064-8.898h18.87h0.13v-3.944v0.288v-8.465c0,0,30.099,0,30.117,0c2.829,0,5.553,0.188,8.45,0.064   c2.492-0.106,4.517-0.126,6.722-0.06c1.235,0.038,2.252,0.021,3.486-0.002c1.916-0.036,3.835,0,5.751,0   c5.171,0,10.341,0,15.513,0.001C226.863,42.366,229.764,42.367,232.667,42.367z"
     id="path14" />
	<path
     fill="#828282"
     d="M185.541,41.672c1.29,0,3.727,0.553,3.965-1.125c0.14-0.981-0.435-1.236-0.682-1.959   c-0.266-0.777-0.176-2.024-0.274-2.852c-0.216-1.818,0.869-3.695,2.528-4.5c1.394-0.677,3.443-1.688,4.783-0.442   c1.135,1.053,1.788,2.97,2.239,4.521c0.681,2.335-0.75,5.395-2.634,6.552c-0.34,0.208-0.69,0.5-1.074,0.59   c-0.292,0.069-0.647,0.005-0.944,0.007c-0.439,0.002-0.896,0.001-1.323-0.125c-0.459-0.135-0.465-0.319-0.725-0.67   c-0.479-0.65-1.433-0.601-2.108-0.746c-1.02-0.219-2.191,0.09-3.102,0.607c-0.391,0.222-0.977,0.594-1.147,1.077   c-0.209,0.594,0.371,0.52,0.774,0.525c3.108,0.04,6.216,0.086,9.324,0.144c1.25,0.023,2.5,0.043,3.749,0.054   c0.474,0.004,1.369,0.205,1.801-0.001c0.364-0.173,0.483-0.871,0.565-1.255c0.324-1.498,0.656-2.986,0.999-4.479   c0.021-0.092,0.04-0.186,0.06-0.279c0.137-0.695-0.039-1.591-0.15-2.283c-0.238-1.489-0.74-2.928-1.557-4.15   c-0.34-0.509-0.558-1.032-1.02-1.466c-0.514-0.483-1.167-0.735-1.699-1.202c-0.502-0.439-0.841-0.852-1.465-1.13   c-0.454-0.203-0.996-0.375-1.467-0.372c-0.545,0.003-1.115-0.064-1.63,0.106c-0.505,0.168-1.033,0.333-1.554,0.435   c-1.2,0.234-2.417,0.201-3.417,1.042c-0.597,0.501-1.093,1.028-1.566,1.668c-0.477,0.645-0.755,1.441-1.118,2.196   c-0.456,0.946-0.91,1.904-1.232,2.917c-0.252,0.792-0.214,1.64-0.144,2.468c0.052,0.609,0.333,1.2,0.454,1.797   c0.228,1.116,0.607,2.229,0.982,3.289"
     id="path16" />
	<path
     fill="none"
     stroke="#000000"
     stroke-miterlimit="10"
     d="M185.528,41.975c-0.588-1.418-1.132-3.155-1.132-4.94   c0-5.659,3.984-10.246,8.899-10.246c4.915,0,8.995,4.148,8.9,10.246c-0.025,1.581-0.679,3.776-1.503,5.33l0,0l31.975,0.002v8.366   v-0.289v4.039h0.124h18.875c4.453,0,8.064,3.984,8.064,8.898v4.898H126.858v-4.898c0-4.915,3.61-8.898,8.064-8.898h18.87h0.13   v-3.945v0.289v-8.465h30.117l1.656,0.004C185.639,42.239,185.583,42.108,185.528,41.975"
     id="path18" />
	<ellipse
     fill="none"
     stroke="#000000"
     stroke-miterlimit="10"
     cx="193.405"
     cy="36.258"
     rx="5.174"
     ry="6.108"
     id="ellipse20" />
</g><rect
         x="110.708"
         y="104.993"
         fill="none"
         stroke="#000000"
         stroke-width="2"
         stroke-miterlimit="10"
         width="25"
         height="26.352"
         id="rect24" /><polygon
         fill="#5E92CC"
         stroke="#000000"
         stroke-width="2"
         stroke-miterlimit="10"
         points="110.708,114.396 129.677,119.759   171.06,80.446 132.324,129.54 "
         id="polygon26" /><line
         fill="none"
         stroke="#000000"
         stroke-width="2"
         stroke-miterlimit="10"
         x1="159.352"
         y1="131.345"
         x2="280.514"
         y2="131.345"
         id="line28" /><rect
         x="111.083"
         y="165.475"
         fill="none"
         stroke="#000000"
         stroke-width="2"
         stroke-miterlimit="10"
         width="25"
         height="26.352"
         id="rect30" /><polygon
         fill="#5E92CC"
         stroke="#000000"
         stroke-width="2"
         stroke-miterlimit="10"
         points="111.083,174.877 130.052,180.24   171.435,140.928 132.699,190.021 "
         id="polygon32" /><line
         fill="none"
         stroke="#000000"
         stroke-width="2"
         stroke-miterlimit="10"
         x1="159.727"
         y1="191.826"
         x2="280.889"
         y2="191.826"
         id="line34" /><rect
         x="110.736"
         y="229.339"
         fill="none"
         stroke="#000000"
         stroke-width="2"
         stroke-miterlimit="10"
         width="25"
         height="26.352"
         id="rect36" /><polygon
         fill="#5E92CC"
         stroke="#000000"
         stroke-width="2"
         stroke-miterlimit="10"
         points="110.736,238.741 129.706,244.104   171.088,204.792 132.353,253.885 "
         id="polygon38" /><line
         fill="none"
         stroke="#000000"
         stroke-width="2"
         stroke-miterlimit="10"
         x1="159.38"
         y1="255.69"
         x2="280.543"
         y2="255.69"
         id="line40" /><rect
         x="111.111"
         y="289.82"
         fill="none"
         stroke="#000000"
         stroke-width="2"
         stroke-miterlimit="10"
         width="25"
         height="26.352"
         id="rect42" /><polygon
         fill="#5E92CC"
         stroke="#000000"
         stroke-width="2"
         stroke-miterlimit="10"
         points="111.111,299.223 130.081,304.586   171.463,265.273 132.728,314.366 "
         id="polygon44" /><line
         fill="none"
         stroke="#000000"
         stroke-width="2"
         stroke-miterlimit="10"
         x1="159.755"
         y1="316.172"
         x2="280.918"
         y2="316.172"
         id="line46" /><path
         fill="none"
         stroke="#000000"
         stroke-miterlimit="10"
         d="M301.413,190.232"
         id="path52" /><path
         fill="none"
         stroke="#000000"
         stroke-miterlimit="10"
         d="M289.7,179.529"
         id="path54" /><path
         fill="none"
         stroke="#000000"
         stroke-miterlimit="10"
         d="M191.403,284.391"
         id="path56" /><path
         fill="none"
         stroke="#000000"
         stroke-miterlimit="10"
         d="M296.464,199.998"
         id="path60" /><path
         fill="none"
         stroke="#000000"
         stroke-miterlimit="10"
         d="M281.654,186.465"
         id="path62" /></g>



<g
     inkscape:label="Layer 1"
     id="layer1"
     transform="matrix(1.8848216,0,0,1.8848216,185.81537,246.33636)"><g
         id="g34839"
         transform="matrix(1.033988,0,0,0.99364359,-2.3540623,0.40254502)"
         style="opacity:0.54;filter:url(#filter34965)"><path
             style="opacity:0.994253;mix-blend-mode:normal;fill:#3c3c3c;fill-opacity:0.6;stroke:none;stroke-width:0.265;stroke-linecap:butt;stroke-linejoin:miter;stroke-miterlimit:4;stroke-dasharray:none;stroke-opacity:1"
             d="M 11.163091,46.456485 C 13.717473,31.967051 18.459991,17.595353 35.049029,3.8610707 L 63.510599,22.092559 C 48.549331,33.270223 35.439016,45.272021 35.49223,63.134868 Z"
             id="path34817"
             sodipodi:nodetypes="ccccc" /><g
             id="g34825"
             transform="translate(17.462501)"><path
                 style="opacity:0.994253;fill:url(#linearGradient362);fill-opacity:1;stroke:#1e1e1e;stroke-width:1.9;stroke-linecap:round;stroke-linejoin:round;stroke-miterlimit:4;stroke-dasharray:none;stroke-opacity:1"
                 d="M 17.586512,3.8610718 V 26.846386 L -6.29942,46.456485 -10.912895,22.412236 Z"
                 id="path34819"
                 sodipodi:nodetypes="ccccc" /><path
                 style="opacity:0.994253;fill:none;stroke:#1e1e1e;stroke-width:2.1;stroke-linecap:round;stroke-linejoin:bevel;stroke-miterlimit:4;stroke-dasharray:none;stroke-opacity:1"
                 d="M 18.029719,40.149555 V 63.134869"
                 id="path34821" /><path
                 style="opacity:0.994253;fill:url(#linearGradient364);fill-opacity:1;stroke:#1e1e1e;stroke-width:2.1;stroke-linecap:round;stroke-linejoin:round;stroke-miterlimit:4;stroke-dasharray:none;stroke-opacity:1"
                 d="m -10.912895,22.412236 4.613473,24.044249 24.329141,16.678384 V 40.149555 Z"
                 id="path34823"
                 sodipodi:nodetypes="ccccc" /></g><g
             id="g34831"
             transform="translate(-37.570835)"><path
                 style="opacity:0.994253;fill:url(#linearGradient366);fill-opacity:1;stroke:#1e1e1e;stroke-width:1.9;stroke-linecap:round;stroke-linejoin:round;stroke-miterlimit:4;stroke-dasharray:none;stroke-opacity:1"
                 d="M 72.619882,26.846387 97.392231,46.456486 101.08148,22.09256 72.619884,3.8610718 Z"
                 id="path34827" /><path
                 style="opacity:0.994253;fill:url(#linearGradient368);fill-opacity:1;stroke:#1e1e1e;stroke-width:2.1;stroke-linecap:round;stroke-linejoin:round;stroke-miterlimit:4;stroke-dasharray:none;stroke-opacity:1"
                 d="M 101.08148,22.09256 97.392231,46.456485 73.063086,63.134869 V 40.149555 Z"
                 id="path34829"
                 sodipodi:nodetypes="ccc" /></g><path
             style="opacity:0.994253;fill:none;stroke:#1e1e1e;stroke-width:1.75;stroke-linecap:round;stroke-linejoin:round;stroke-miterlimit:4;stroke-dasharray:none;stroke-opacity:1"
             d="M 8.0443998,28.586699 35.622719,47.042475 62.544653,28.280144"
             id="path34833"
             sodipodi:nodetypes="ccc" /><rect
             style="opacity:0.994253;fill:url(#linearGradient370);fill-opacity:1;stroke:#1e1e1e;stroke-width:2.20195;stroke-linecap:round;stroke-linejoin:round;stroke-miterlimit:4;stroke-dasharray:none;stroke-opacity:1"
             id="rect34835"
             width="33.332928"
             height="33.800117"
             x="-16.122261"
             y="24.443062"
             transform="matrix(0.84056131,-0.54171643,0.8420553,0.53939121,0,0)" /><g
             id="g34837"
             transform="matrix(1,0,0,-1,0,150.23453)" /></g><g
         id="g34393"
         transform="matrix(0.892042,0,0,0.892042,2.5024154,3.940433)"><path
             style="opacity:0.994253;mix-blend-mode:normal;fill:#3c3c3c;fill-opacity:0.6;stroke:none;stroke-width:0.265;stroke-linecap:butt;stroke-linejoin:miter;stroke-miterlimit:4;stroke-dasharray:none;stroke-opacity:1"
             d="M 11.163091,46.456485 C 13.717473,31.967051 18.459991,17.595353 35.049029,3.8610707 L 63.510599,22.092559 C 48.549331,33.270223 35.439016,45.272021 35.49223,63.134868 Z"
             id="path26776"
             sodipodi:nodetypes="ccccc" /><g
             id="g34380"
             transform="translate(17.462501)"><path
                 style="opacity:0.994253;fill:url(#linearGradient26784);fill-opacity:1;stroke:#1e1e1e;stroke-width:1.9;stroke-linecap:round;stroke-linejoin:round;stroke-miterlimit:4;stroke-dasharray:none;stroke-opacity:1"
                 d="M 17.586512,3.8610718 V 26.846386 L -6.29942,46.456485 -10.912895,22.412236 Z"
                 id="path26673-7"
                 sodipodi:nodetypes="ccccc" /><path
                 style="opacity:0.994253;fill:none;stroke:#1e1e1e;stroke-width:2.1;stroke-linecap:round;stroke-linejoin:bevel;stroke-miterlimit:4;stroke-dasharray:none;stroke-opacity:1"
                 d="M 18.029719,40.149555 V 63.134869"
                 id="path26673" /><path
                 style="opacity:0.994253;fill:url(#linearGradient26758);fill-opacity:1;stroke:#1e1e1e;stroke-width:2.1;stroke-linecap:round;stroke-linejoin:round;stroke-miterlimit:4;stroke-dasharray:none;stroke-opacity:1"
                 d="m -10.912895,22.412236 4.613473,24.044249 24.329141,16.678384 V 40.149555 Z"
                 id="path26673-6-1"
                 sodipodi:nodetypes="ccccc" /></g><g
             id="g34375"
             transform="translate(-37.570835)"><path
                 style="opacity:0.994253;fill:url(#linearGradient26786);fill-opacity:1;stroke:#1e1e1e;stroke-width:1.9;stroke-linecap:round;stroke-linejoin:round;stroke-miterlimit:4;stroke-dasharray:none;stroke-opacity:1"
                 d="M 72.619882,26.846387 97.392231,46.456486 101.08148,22.09256 72.619884,3.8610718 Z"
                 id="path26741" /><path
                 style="opacity:0.994253;fill:url(#linearGradient26766);fill-opacity:1;stroke:#1e1e1e;stroke-width:2.1;stroke-linecap:round;stroke-linejoin:round;stroke-miterlimit:4;stroke-dasharray:none;stroke-opacity:1"
                 d="M 101.08148,22.09256 97.392231,46.456485 73.063086,63.134869 V 40.149555 Z"
                 id="path26673-6-1-8"
                 sodipodi:nodetypes="ccc" /></g><path
             style="opacity:0.994253;fill:none;stroke:#1e1e1e;stroke-width:1.75;stroke-linecap:round;stroke-linejoin:round;stroke-miterlimit:4;stroke-dasharray:none;stroke-opacity:1"
             d="M 8.0443998,28.586699 35.622719,47.042475 62.544653,28.280144"
             id="path26722"
             sodipodi:nodetypes="ccc" /><rect
             style="opacity:0.994253;fill:url(#linearGradient26750);fill-opacity:1;stroke:#1e1e1e;stroke-width:2.20195;stroke-linecap:round;stroke-linejoin:round;stroke-miterlimit:4;stroke-dasharray:none;stroke-opacity:1"
             id="rect26671"
             width="33.332928"
             height="33.800117"
             x="-16.122261"
             y="24.443062"
             transform="matrix(0.84056131,-0.54171643,0.8420553,0.53939121,0,0)" /><g
             id="g26920"
             transform="matrix(1,0,0,-1,0,150.23453)" /></g></g></svg>
