module gitlab.com/deltabyte_/littleurl/api

go 1.18

require (
	github.com/aws/aws-lambda-go v1.33.0
	github.com/aws/aws-sdk-go-v2/config v1.15.14
	github.com/aws/aws-sdk-go-v2/feature/dynamodb/attributevalue v1.9.7
	github.com/aws/aws-sdk-go-v2/feature/dynamodb/expression v1.4.13
	github.com/aws/aws-sdk-go-v2/service/dynamodb v1.15.9
	github.com/google/uuid v1.3.0
	github.com/jinzhu/configor v1.2.1
	github.com/lumigo-io/lumigo-go-tracer v0.4.1
	go.uber.org/zap v1.21.0
)

require (
	github.com/go-playground/locales v0.14.0 // indirect
	github.com/go-playground/universal-translator v0.18.0 // indirect
	github.com/leodido/go-urn v1.2.1 // indirect
	github.com/stretchr/testify v1.8.0 // indirect
	golang.org/x/crypto v0.0.0-20211215153901-e495a2d5b3d3 // indirect
)

require (
	github.com/BurntSushi/toml v1.2.0 // indirect
	github.com/aws/aws-sdk-go-v2 v1.17.6
	github.com/aws/aws-sdk-go-v2/credentials v1.12.9 // indirect
	github.com/aws/aws-sdk-go-v2/feature/ec2/imds v1.12.8 // indirect
	github.com/aws/aws-sdk-go-v2/internal/configsources v1.1.30 // indirect
	github.com/aws/aws-sdk-go-v2/internal/endpoints/v2 v2.4.24 // indirect
	github.com/aws/aws-sdk-go-v2/internal/ini v1.3.15 // indirect
	github.com/aws/aws-sdk-go-v2/service/cognitoidentityprovider v1.21.1
	github.com/aws/aws-sdk-go-v2/service/dynamodbstreams v1.13.10 // indirect
	github.com/aws/aws-sdk-go-v2/service/internal/accept-encoding v1.9.3 // indirect
	github.com/aws/aws-sdk-go-v2/service/internal/endpoint-discovery v1.7.8 // indirect
	github.com/aws/aws-sdk-go-v2/service/internal/presigned-url v1.9.8 // indirect
	github.com/aws/aws-sdk-go-v2/service/ses v1.15.4
	github.com/aws/aws-sdk-go-v2/service/sso v1.11.12 // indirect
	github.com/aws/aws-sdk-go-v2/service/sts v1.16.9 // indirect
	github.com/aws/smithy-go v1.13.5 // indirect
	github.com/fsnotify/fsnotify v1.5.1 // indirect
	github.com/go-logr/logr v1.2.1 // indirect
	github.com/go-logr/stdr v1.2.0 // indirect
	github.com/go-playground/validator/v10 v10.11.1
	github.com/hashicorp/hcl v1.0.0 // indirect
	github.com/jinzhu/copier v0.3.5
	github.com/jmespath/go-jmespath v0.4.0 // indirect
	github.com/magiconair/properties v1.8.5 // indirect
	github.com/mitchellh/mapstructure v1.4.2 // indirect
	github.com/pelletier/go-toml v1.9.4 // indirect
	github.com/pkg/errors v0.9.1 // indirect
	github.com/segmentio/ksuid v1.0.4 // indirect
	github.com/sirupsen/logrus v1.8.1 // indirect
	github.com/spf13/afero v1.6.0 // indirect
	github.com/spf13/cast v1.4.1 // indirect
	github.com/spf13/jwalterweatherman v1.1.0 // indirect
	github.com/spf13/pflag v1.0.5 // indirect
	github.com/spf13/viper v1.9.0 // indirect
	github.com/subosito/gotenv v1.2.0 // indirect
	go.opentelemetry.io/contrib/detectors/aws/lambda v0.27.0 // indirect
	go.opentelemetry.io/contrib/instrumentation/github.com/aws/aws-lambda-go/otellambda v0.27.0 // indirect
	go.opentelemetry.io/otel v1.3.0 // indirect
	go.opentelemetry.io/otel/exporters/stdout/stdouttrace v1.2.0 // indirect
	go.opentelemetry.io/otel/sdk v1.3.0 // indirect
	go.opentelemetry.io/otel/trace v1.3.0 // indirect
	go.uber.org/atomic v1.9.0 // indirect
	go.uber.org/multierr v1.8.0 // indirect
	golang.org/x/net v0.0.0-20220708220712-1185a9018129 // indirect
	golang.org/x/sys v0.0.0-20220722155257-8c9f86f7a55f // indirect
	golang.org/x/text v0.3.7 // indirect
	gopkg.in/ini.v1 v1.63.2 // indirect
	gopkg.in/yaml.v2 v2.4.0 // indirect
)
