AWSTATS DATA FILE 7.2 (build 1.992)
# If you remove this file, all statistics for date 201803 will be lost/reset.
# Last config file used to build this data file was /etc/awstats/inetadmin/awstats.232652.conf.

# Position (offset in bytes) in this file for beginning of each section for
# direct I/O access. If you made changes somewhere in this file, you should
# also remove completely the MAP section (AWStats will rewrite it at next
# update).
BEGIN_MAP 28
POS_GENERAL 2047                
POS_TIME 2718                
POS_VISITOR 15612               
POS_DAY 29083               
POS_DOMAIN 3621                
POS_LOGIN 4193                
POS_ROBOT 4348                
POS_WORMS 5054                
POS_EMAILSENDER 5185                
POS_EMAILRECEIVER 5328                
POS_SESSION 29711               
POS_SIDER 29902               
POS_FILETYPES 5463                
POS_DOWNLOADS 5708                
POS_OS 5789                
POS_BROWSER 6034                
POS_SCREENSIZE 7497                
POS_UNKNOWNREFERER 7571                
POS_UNKNOWNREFERERBROWSER 8583                
POS_ORIGIN 8879                
POS_SEREFERRALS 9021                
POS_PAGEREFS 9188                
POS_SEARCHWORDS 9384                
POS_KEYWORDS 9577                
POS_MISC 2382                
POS_ERRORS 9683                
POS_CLUSTER 4049                
POS_SIDER_404 9787                
POS_PLUGIN_geoip_city_maxmind 15252               
END_MAP

# LastLine    = Date of last record processed - Last record line number in last log - Last record offset in last log - Last record signature value
# FirstTime   = Date of first visit for history file
# LastTime    = Date of last visit for history file
# LastUpdate  = Date of last update - Nb of parsed records - Nb of parsed old records - Nb of parsed new records - Nb of parsed corrupted - Nb of parsed dropped
# TotalVisits = Number of visits
# TotalUnique = Number of unique visitors
# MonthHostsKnown   = Number of hosts known
# MonthHostsUnKnown = Number of hosts unknown
BEGIN_GENERAL 8
LastLine 20180322000315 1 0 8936985226423
FirstTime 20180301022411
LastTime 20180321214832
LastUpdate 20180322000513 1 1 0 0 0
TotalVisits 186                 
TotalUnique 154                 
MonthHostsKnown 0                   
MonthHostsUnknown 430                 
END_GENERAL

# Misc ID - Pages - Hits - Bandwidth
BEGIN_MISC 10
WindowsMediaPlayerSupport 0 0 0
QuickTimeSupport 0 0 0
FlashSupport 0 0 0
JavaEnabled 0 0 0
PDFSupport 0 0 0
TotalMisc 0 0 0
DirectorSupport 0 0 0
JavascriptDisabled 0 0 0
AddToFavourites 0 0 0
RealPlayerSupport 0 0 0
END_MISC

# Hour - Pages - Hits - Bandwidth - Not viewed Pages - Not viewed Hits - Not viewed Bandwidth
BEGIN_TIME 24
0 7 99 8284551 16 71 2637503
1 13 66 9809348 14 60 4039886
2 18 19 568480 55 124 5901938
3 22 96 12736020 31 72 2736931
4 4 7 455673 41 113 5213234
5 7 55 3855155 13 68 3346358
6 2 51 7131795 12 60 4019992
7 17 192 19092727 59 108 3828615
8 23 287 33015507 12 64 3111032
9 16 344 34201901 12 101 4191332
10 29 479 79364088 34 106 3536293
11 25 489 47091033 13 51 3345740
12 22 455 60182160 17 118 5504507
13 34 612 95248893 20 100 8589936
14 21 325 65973967 32 122 4056838
15 84 525 59025273 111 178 4618125
16 16 271 35740210 31 116 4252727
17 14 271 34363886 23 68 6638099
18 18 296 45179185 18 81 8286994
19 6 136 16131673 25 192 10939912
20 16 336 71781894 11 46 1686926
21 52 200 19292555 54 99 3180776
22 36 565 112817738 45 166 2569486
23 12 175 28414025 38 80 4511295
END_TIME

# Domain - Pages - Hits - Bandwidth
# The 10 first Pages must be first (order not required for others)
BEGIN_DOMAIN 24
pl 278 5616 782166643
us 66 123 7210427
cn 66 66 668567
ie 31 31 676519
fr 25 25 343885
cz 15 233 65541244
de 11 165 27974952
ua 7 8 592444
ru 3 5 452014
lt 3 40 6076521
at 0 2 270556
ch 0 1 298972
ba 0 2 179725
es 0 7 2444118
gb 2 14 3158427
se 0 3 582898
nl 1 3 715106
kr 1 1 5864
by 1 1 29385
br 1 1 5864
in 1 1 5864
jp 1 1 29385
ca 0 1 298972
it 1 1 29385
END_DOMAIN

# Cluster ID - Pages - Hits - Bandwidth
BEGIN_CLUSTER 0
END_CLUSTER

# Login - Pages - Hits - Bandwidth - Last visit
# The 10 first Pages must be first (order not required for others)
BEGIN_LOGIN 0
END_LOGIN

# Robot ID - Hits - Bandwidth - Last visit - Hits on robots.txt
# The 10 first Hits must be first (order not required for others)
BEGIN_ROBOT 16
googlebot 647 49561591 20180322000315 0
bingbot 345 17583434 20180321223857 0
bot[\s_+:,\.\;\/\\-] 326 10217988 20180320211324 0
bingpreview 132 12612559 20180318190714 0
robot 118 18591302 20180321215440 0
yandex 44 398556 20180321122250 0
baiduspider 19 114671 20180321033815 0
yeti 15 60966 20180308105425 0
no_user_agent 7 64569 20180314212720 0
mail\.ru 7 391749 20180317124224 0
surveybot 1 5864 20180305101705 0
crawl 1 0 20180320010038 0
netcraft 1 0 20180303170804 0
mj12bot 4 117540 20180321045910 0
exabot 2 7707 20180321010709 0
checker 2 8280 20180318115738 0
END_ROBOT

# Worm ID - Hits - Bandwidth - Last visit
# The 5 first Hits must be first (order not required for others)
BEGIN_WORMS 0
END_WORMS

# EMail - Hits - Bandwidth - Last visit
# The 20 first Hits must be first (order not required for others)
BEGIN_EMAILSENDER 0
END_EMAILSENDER

# EMail - Hits - Bandwidth - Last visit
# The 20 first hits must be first (order not required for others)
BEGIN_EMAILRECEIVER 0
END_EMAILRECEIVER

# Files type - Hits - Bandwidth - Bandwidth without compression - Bandwidth after compression
BEGIN_FILETYPES 9
js 1467 12996701 0 0
png 439 8126936 0 0
eot 3 225660 0 0
woff 4 356304 0 0
css 914 5083013 0 0
woff2 94 6648432 0 0
gif 239 1145152 0 0
jpg 2778 860978269 0 0
html 413 4197270 0 0
END_FILETYPES

# Downloads - Hits - Bandwidth
BEGIN_DOWNLOADS 1
/images/cennik-sc.pdf 8 0 352384
END_DOWNLOADS

# OS ID - Hits
BEGIN_OS ID - Hits - Pages 13
win7 1876 162
Unknown 129 38
macosx9 2 0
winxp 254 68
linuxandroid 1259 65
winvista 277 11
win2000 8 8
macosx 507 40
winlong 117 7
winnt 1852 103
win2003 11 8
win8 2 0
linux 57 4
END_OS

# Browser ID - Hits - Pages
BEGIN_BROWSER 70
firefox43.0 2 0
iphone 7 0
msie7.0 11 8
chrome65.0.3325.146 2 0
chrome38.0.2125.102 34 3
safari9.1.2 75 4
firefox56.0.4 1 0
chrome60.0.3112.116 1 0
msie8.0 2 2
chrome55.0.2883.91 38 2
chrome61.0.3163.98 1 0
chrome35.0.1916.141 1 0
msie5.01 8 8
chrome10.0.648.204 5 5
chrome56.0.2924.87 89 5
firefox58.0.2 1 0
chrome40.0.2214.93 1 1
chrome57.17.2987.98 1 0
firefox48.0 1 1
chrome49.0.2623.112 166 8
firefox3.6.8 30 30
safari5.1 38 2
chrome34.0.1847.116 1 1
firefox2.0.0.13 15 15
chrome64.0.3282.168 4 0
chrome61.0.3163.100 7 7
chrome64.0.3282.140 55 2
chrome64.0.3282.123 1 0
chrome51.0.2704.79 1 0
firefox56.0 1 0
firefox54.0 1 0
chrome65.0.3325.162 243 10
chrome50.0.2661.102 1 0
chrome64.0.3282.137 620 32
Unknown 62 23
chrome64.0.3282.167 78 3
firefox35.0 59 3
chrome53.0.2785.146 1 0
chrome65.0.3325.181 1 0
firefox52.0 52 2
firefox57.0 39 3
firefox8.0.1 1 1
firefox51.0 1 1
msie9.0 66 66
firefox32.0 7 7
safari10.0 70 6
firefox53.0 1 1
chrome46.0.2490.76 50 2
chrome63.0.3239.111 47 2
chrome64.0.3282.189 1 0
firefox58.0 1080 60
chrome44.0.2403.133 6 0
safari8.0 7 0
safari11.0 5 0
mozilla 249 28
chrome62.0.3202.84 1 0
android 36 2
firefox45.0 2 0
firefox10.0.1 3 3
firefox3.5.5 4 4
safari11.0.3 219 9
chrome64.0.3282.186 1782 82
firefox18.0 2 1
chrome53.0.2785.143 3 3
firefox59.0 519 22
chrome63.0.3239.132 49 6
chrome65.0.3325.109 334 18
chrome49.0.2623.87 4 4
chrome58.0.3029.110 11 4
firefox42.0 34 2
END_BROWSER

# Screen size - Hits
BEGIN_SCREENSIZE 0
END_SCREENSIZE

# Unknown referer OS - Last visit date
BEGIN_UNKNOWNREFERER 15
com.google.GoogleMobile/44.0.0_iPhone/11.2.6_hw/iPhone8_1 20180314215911
com.google.GoogleMobile/33.0.0_iPhone/11.2.6_hw/iPhone8_1 20180311175436
Mozilla/5.0_(Android_7.0;_Mobile;_rv:58.0.2)_Gecko/58.0.2_Firefox/58.0.2 20180318185326
BUbiNG_(_http://law.di.unimi.it/BUbiNG.html#wc) 20180316071455
com.google.GoogleMobile/43.0.0_iPhone/11.2.5_hw/iPhone9_4 20180305102238
com.google.GoogleMobile/33.0.0_iPhone/11.2.5_hw/iPhone8_1 20180301184334
SEMrushBot 20180312125334
Xenu_Link_Sleuth/1.3.8 20180320132040
Mozilla/5.0_(compatible;_ips-agent) 20180310151015
EDS_EXIF/1.0_(https://www.exif-search.com) 20180304193620
Magic_Browser 20180309143256
Mozilla/5.0_(compatible;_Google-Site-Verification/1.0) 20180303220446
com.google.GoogleMobile/44.0.0_iPhone/11.2.6_hw/iPhone9_3 20180311213228
Mozilla/3.0_(compatible;_Indy_Library) 20180304235611
Mozilla/5.0_(Android_7.0;_Mobile;_rv:58.0)_Gecko/58.0_Firefox/58.0 20180318185324
END_UNKNOWNREFERER

# Unknown referer Browser - Last visit date
BEGIN_UNKNOWNREFERERBROWSER 5
EDS_EXIF/1.0_(https://www.exif-search.com) 20180304193620
Magic_Browser 20180309143256
SEMrushBot 20180312125334
Xenu_Link_Sleuth/1.3.8 20180320132040
BUbiNG_(_http://law.di.unimi.it/BUbiNG.html#wc) 20180316071455
END_UNKNOWNREFERERBROWSER

# Origin - Pages - Hits 
BEGIN_ORIGIN 6
From0 213 377
From1 1 1
From2 95 436
From3 1 1
From4 204 5536
From5 0 0
END_ORIGIN

# Search engine referers ID - Pages - Hits
BEGIN_SEREFERRALS 2
bing 0 6
google 95 430
END_SEREFERRALS

# External page referers - Pages - Hits
# The 10 first Pages must be first (order not required for others)
BEGIN_PAGEREFS 1
http://nowycrm.pikseo.pl/crm/random_client/ 1 1
END_PAGEREFS

# Search keyphrases - Number of search
# The 10 first number of search must be first (order not required for others)
BEGIN_SEARCHWORDS 2
kostka+granitowa+cena 1
bohus+czerwany 1
END_SEARCHWORDS

# Search keywords - Number of search
# The 10 first number of search must be first (order not required for others)
BEGIN_KEYWORDS 5
granitowa 1
czerwany 1
kostka 1
bohus 1
cena 1
END_KEYWORDS

# Errors - Hits - Bandwidth
BEGIN_ERRORS 2
206 58 887529
404 609 120170
END_ERRORS

# URL with 404 errors - Hits - Last URL referer
BEGIN_SIDER_404 99
/sbb.cgi 2 -
/modules.php 3 -
/images/joomgallery/details/realizacje_1/produkty_10_20140611_1264101501.jpg 1 -
//wp-content/plugins/xaisyndicate/idx.php 2 -
/tel:+48603110680 4 -
/license.php 4 -
/components/com_b2jcontact/css/b2jcontact.css 2 -
/wp/wp-includes/wlwmanifest.xml 3 -
/kostka-granitowa-strzegom 22 -
/g_book.cgi 3 -
/images/joomgallery/details/realizacje_1/produkty_12_20140611_1341815113.jpg 2 -
/wp-includes/wlwmanifest.xml 3 -
/images/joomgallery/details/realizacje_1/11_2_20140809_1424484581.png 2 -
/images/joomgallery/details/realizacje_1/produkty_2_20140611_1890180613.jpg 1 -
/apps/guestbook 3 -
/prettyPhoto[galeria-1]/7/prettyPhoto[galeria-1]/8/prettyPhoto[galeria-1]/8/prettyPhoto[galeria-1]/5/prettyPhoto[galeria-1]/5/prettyPhoto[galeria-1]/1/prettyPhoto[galeria-1]/0/prettyPhoto[galeria-1]/0/prettyPhoto[galeria-1]/1/prettyPhoto[galeria-1]/1/ 1 http://www.scanstone.pl/plyty-chodnikowe-granitowe.html
/images/joomgallery/details/realizacje_1/produkty_7_20140611_1067684057.jpg 1 -
/images/joomgallery/details/realizacje_1/produkty_19_20140611_1896711460.jpg 1 -
/images/joomgallery/details/realizacje_1/11_11_20140809_1765106466.jpg 1 -
/images/joomgallery/details/realizacje_1/11_12_20140809_1972124769.jpg 2 -
/images/joomgallery/details/realizacje_1/produkty_5_20140611_2000851979.jpg 2 -
/wordpress/ 1 -
/wp/ 1 -
/wp-content/plugins/cherry-plugin/admin/css/cherry-admin-plugin.css 4 -
/images/joomgallery/details/realizacje_1/11_13_20140809_2009702908.jpg 1 -
/images/joomgallery/details/realizacje_1/11_1_20140809_1734908620.png 1 -
/guestbook.html 3 -
/images/joomgallery/details/realizacje_1/produkty_5_20140611_1677584095.jpg 1 -
/images/joomgallery/details/realizacje_1/produkty_20_20140611_1249031360.jpg 1 -
/guestbook.php 6 -
/prettyPhoto[galeria-1]/0/prettyPhoto[galeria-1]/0/prettyPhoto[galeria-1]/0/prettyPhoto[galeria-1]/1/prettyPhoto[galeria-1]/1/prettyPhoto[galeria-1]/1/prettyPhoto[galeria-2]/1/prettyPhoto[galeria-2]/0/prettyPhoto[galeria-2]/1/prettyPhoto[galeria-2]/1/prett 1 https://www.google.pl/
/light.cgi 3 -
/wordpress/wp-includes/wlwmanifest.xml 2 -
/administrator/index.php 2 -
/images/joomgallery/details/realizacje_1/produkty_16_20140611_1208019984.jpg 1 -
/cennik.html 4 -
/.ftpconfig 1 -
/googleb14c8470624a789a.html 2 -
/images/joomgallery/details/realizacje_1/produkty_4_20140611_1290250068.jpg 2 -
/bbs.cgi 3 -
/yabb.pl 2 -
/gaestebuch.php 3 -
/default.asp 3 -
/xmlrpc.php 4 -
/mailto:biuro@scanstone.pl 4 -
/aska.cgi 3 -
/yapgb.php 2 -
/index.php 6 -
/images/joomgallery/details/realizacje_1/produkty_7_20140611_1207837435.jpg 1 -
/album.cgi 3 -
/cms/wp-includes/wlwmanifest.xml 3 -
/realizacja.html 1 -
/member/ 3 -
/index.php/component/users/ 3 -
/images/cennik-scanstonee.pdf 1 -
/images/joomgallery/details/realizacje_1/produkty_6_20140611_1238860438.jpg 2 -
/images/joomgallery/details/realizacje_1/11_8_20140809_1225109662.png 2 -
/images/joomgallery/details/realizacje_1/11_10_20140809_1930680692.jpg 2 -
/home.php 3 -
/images/joomgallery/details/realizacje_1/produkty_17_20140611_1962619485.jpg 1 -
/scarbook.php 3 -
/prettyPhoto[galeria-1]/7/prettyPhoto[galeria-1]/8/prettyPhoto[galeria-1]/8/ 1 http://www.scanstone.pl/plyty-chodnikowe-granitowe.html
/images/joomgallery/details/realizacje_1/11_9_20140809_1600286812.png 1 -
/prettyPhoto[galeria-5]/2/prettyPhoto[galeria-5]/0/prettyPhoto[galeria-5]/1/prettyPhoto[galeria-5]/2/prettyPhoto[galeria-5]/0/prettyPhoto[galeria-5]/1/prettyPhoto[galeria-5]/2/prettyPhoto[galeria-5]/0/prettyPhoto[galeria-5]/1/prettyPhoto[galeria-5]/0/prett 1 http://scanstone.pl/niesort-granitowy.html
/guestbook 3 -
/images/joomgallery/details/realizacje_1/11_4_20140809_1078420575.png 2 -
/images/joomgallery/details/realizacje_1/11_5_20140809_1006720582.png 1 -
/YaBB.cgi 2 -
/gb.php 3 -
/yybbs.cgi 3 -
/site/wp-includes/wlwmanifest.xml 2 -
/jax_guestbook.php 3 -
/images/joomgallery/details/realizacje_1/produkty_1_20140611_1186348458.jpg 1 -
/images/joomgallery/details/realizacje_1/11_6_20140809_2042611750.png 1 -
/prettyPhoto[galeria-1]/3/ 1 http://scanstone.pl/prettyPhoto[galeria-5]/2/prettyPhoto[galeria-5]/0/prettyPhoto[galeria-5]/1/prettyPhoto[galeria-5]/2/prettyPhoto[galeria-5]/0/prettyPhoto[galeria-5]/1/prettyPhoto[galeria-5]/2/prettyPhoto[galeria-5]/0/prettyPhoto[galeria-5]/1/prettyPhoto[galeria-5]/0/prettyPhoto[galeria-5]/0/
/tel:+48601567990 5 -
/robots.txt 370 -
/sftp-config.json 1 -
/Guestbook.php 3 -
/book.php 2 -
/blog/robots.txt 1 -
/images/joomgallery/details/realizacje_1/produkty_4_20140611_1519328182.jpg 1 -
/images/cennik-scanstone.pdf 10 -
/CGI/guestbook 3 -
/seo-joy.cgi 3 -
/sunbbs.cgi 2 -
/images/joomgallery/details/realizacje_1/produkty_8_20140611_1376336451.jpg 1 -
/images/joomgallery/details/realizacje_1/11_3_20140809_1600759672.png 1 -
/oferta.html 4 -
/images/joomgallery/details/realizacje_1/produkty_6_20140611_1137409000.jpg 1 -
/images/joomgallery/details/realizacje_1/produkty_3_20140611_1380772435.jpg 1 -
/blog/wp-includes/wlwmanifest.xml 3 -
/images/joomgallery/details/realizacje_1/11_7_20140809_1950507684.png 1 -
/gastenboek.php 3 -
/wp-login.php 3 https://google.com
/blog/ 1 -
/images/joomgallery/details/realizacje_1/produkty_13_20140611_1506952427.jpg 1 -
/images/joomgallery/details/realizacje_1/produkty_14_20140611_1926527095.jpg 2 -
/images/joomgallery/details/realizacje_1/produkty_9_20140611_1284214617.jpg 1 -
END_SIDER_404

# Plugin key - Pages - Hits - Bandwidth - Last access
BEGIN_PLUGIN_geoip_city_maxmind 1
unknown 0 6351 0 0
END_PLUGIN_geoip_city_maxmind

# Host - Pages - Hits - Bandwidth - Last visit date - [Start date of last visit] - [Last page of last visit]
# [Start date of last visit] and [Last page of last visit] are saved only if session is not finished
# The 10 first Hits must be first (order not required for others)
BEGIN_VISITOR 430
27.23.209.96 66 66 668567 20180312210647
54.236.43.212 17 17 67486 20180316071455
193.70.122.214 15 15 285115 20180309152349
185.148.214.196 15 233 65541244 20180320145240
94.254.177.155 11 112 30676701 20180309083312
5.174.67.130 10 197 23980514 20180301115142
69.58.178.56 10 10 205358 20180310151015
176.109.160.104 8 151 23723578 20180319220159
38.100.21.65 8 11 323874 20180316011344
188.165.200.217 8 8 0 20180321012534
185.58.160.83 2 2 58770 20180314152255
82.177.124.66 0 1 245060 
37.248.157.173 3 64 8928392 20180315161642
159.205.24.158 0 1 83953 
94.254.150.65 2 35 3973469 20180319204352
217.17.32.22 0 3 853509 
83.22.122.192 3 61 8009124 20180306125625
37.47.16.135 3 75 11830313 20180311032221
212.244.185.8 2 34 4877357 20180315100636
83.22.252.178 0 1 354326 
5.226.96.141 0 1 74801 
83.26.131.40 2 48 3396725 20180313052106
158.46.213.142 1 1 5864 20180302223205
188.105.31.163 0 1 293511 
193.107.248.204 0 2 1203404 
31.183.197.118 0 1 372833 
217.99.172.60 2 50 4292395 20180321115953
83.23.178.171 0 1 82750 
37.47.78.125 2 31 3522809 20180314143235
89.234.68.90 6 6 128734 20180321035824
83.22.121.233 0 2 329013 
83.20.255.96 0 1 343726 
188.146.225.240 3 60 7823906 20180316160550
37.47.109.79 0 1 45266 
94.254.141.109 2 34 3607518 20180313114629
46.171.78.90 0 1 75396 
81.219.213.13 3 76 10525536 20180319070853
24.84.254.172 0 1 298972 
191.96.181.103 1 1 5864 20180308230440
162.208.51.36 0 2 180516 
83.31.55.79 2 31 2569771 20180310075000
217.99.185.36 3 51 4298259 20180314164955
31.183.129.230 0 1 45266 
83.20.39.56 0 1 343726 
91.226.228.86 0 1 83953 
94.246.170.128 0 1 354326 
31.11.128.94 0 1 245060 
79.186.208.155 0 1 343726 
31.1.126.59 0 1 142609 
37.248.71.6 0 1 297730 
188.146.39.176 0 1 245060 
83.242.121.83 0 5 1594414 
94.254.156.227 0 1 298972 
195.136.152.188 0 1 191519 
188.146.105.44 0 1 386749 
78.9.64.226 2 33 3852053 20180308104439
80.133.45.10 2 33 3852053 20180308225144
78.88.101.180 0 1 83953 
176.109.162.141 3 49 2955935 20180314084353
37.248.164.236 2 50 4292395 20180312214058
31.0.125.177 0 1 135697 
87.204.251.253 0 1 673926 
78.31.215.250 0 1 79037 
91.18.67.114 0 1 197954 
62.133.152.226 0 2 480713 
109.231.5.63 0 1 168007 
91.228.8.182 0 2 90532 
83.26.244.188 1 42 1438747 20180320121739
46.174.24.3 3 57 9302321 20180301122515
185.51.116.4 0 1 298972 
193.200.133.224 0 3 1007624 
37.7.52.187 0 1 245060 
46.169.146.135 0 1 245060 
95.211.94.107 1 1 29385 20180304235611
150.70.188.178 1 1 29385 20180304055017
185.25.121.222 0 1 354326 
199.19.249.196 1 1 29385 20180319125320
83.4.146.193 0 1 96975 
83.15.84.69 2 33 3939830 20180321195609
77.112.144.130 0 2 547832 
83.30.77.241 0 5 3240873 
34.244.37.247 1 1 29385 20180302164101
37.47.37.98 0 1 151744 
188.146.224.138 0 1 67779 
31.0.125.234 0 1 297730 
46.171.191.145 0 1 241111 
31.0.126.48 0 1 298972 
188.122.20.100 0 1 298972 
94.40.61.3 0 1 248860 
185.56.211.210 2 47 2722799 20180314071911
178.37.148.96 0 1 45266 
91.212.223.20 0 1 245060 
80.187.100.2 3 42 5406656 20180309135836
185.56.211.150 2 36 3729051 20180317141513
5.226.68.194 6 65 8763396 20180313225106
146.185.223.240 1 1 29385 20180316033859
192.162.167.23 1 42 1438747 20180321150827
5.89.36.212 1 1 29385 20180320132040
162.208.50.92 0 1 429855 
217.99.253.199 0 1 354326 
46.149.223.39 0 1 298972 
85.221.243.34 2 36 4962012 20180315152706
83.15.86.179 0 1 248860 
31.178.174.49 2 47 2722799 20180318185322
80.53.83.99 0 1 248860 
52.34.24.33 2 2 11728 20180309143256
37.47.144.104 0 6 1760613 
188.146.2.147 0 1 82750 
185.82.250.61 0 1 245060 
83.28.226.217 0 1 354326 
193.141.243.201 0 1 298972 
83.10.77.43 4 70 14983344 20180319181925
54.183.175.64 1 1 29385 20180313045156
198.12.153.176 1 1 29385 20180318023339
62.141.197.205 2 34 3607518 20180316182921
31.1.158.252 0 1 360685 
83.26.255.120 3 66 10574710 20180309083850
66.249.89.156 1 1 53 20180303220445
46.235.158.196 1 1 29385 20180311041612
109.173.157.249 0 1 248860 
192.243.53.51 1 1 5864 20180312125334
66.249.89.77 1 1 53 20180303220446
82.132.221.149 0 4 998691 
162.208.51.43 0 2 234144 
46.235.154.123 0 1 305507 
37.47.233.107 0 1 245060 
79.203.151.17 4 83 17701747 20180316223817
79.190.247.221 1 42 1438747 20180309093017
77.65.10.23 0 1 25357 
162.208.51.38 0 1 219239 
176.101.161.231 0 1 245060 
83.4.240.120 0 1 354326 
66.102.9.156 0 1 327040 
91.228.8.197 0 1 45266 
89.231.179.118 0 1 45266 
78.8.103.122 7 108 22997346 20180320105119
193.35.41.73 0 1 372833 
91.228.8.207 0 1 45266 
46.118.155.165 2 2 58770 20180308024728
188.137.95.205 0 1 360685 
91.237.228.7 0 1 45266 
91.227.217.124 3 57 9205856 20180320105622
83.30.34.94 2 36 3729051 20180304132642
188.146.137.154 0 1 79037 
87.207.32.2 0 1 248860 
195.189.52.138 0 1 327040 
188.146.38.174 0 1 604097 
82.177.87.20 0 2 554367 
37.47.15.181 0 1 241111 
37.7.198.16 0 1 248860 
83.28.252.90 2 45 4588149 20180318001540
89.64.24.67 0 1 245060 
46.76.48.22 0 1 298972 
85.31.243.4 3 38 4634250 20180307085230
94.254.152.174 2 47 2722799 20180303090458
37.7.255.10 0 1 354326 
176.109.160.169 0 1 293511 
91.228.8.159 0 1 45266 
94.240.8.171 0 1 248860 
83.14.176.141 0 1 386749 
91.228.8.153 0 1 45266 
109.196.56.212 0 1 248860 
46.101.80.192 1 1 5864 20180320111236
91.228.8.156 0 5 226330 
178.151.181.145 0 1 386749 
83.27.133.100 0 1 297730 
46.36.86.2 3 40 6076521 20180319134912
188.146.33.176 0 1 259411 
188.146.195.49 0 2 478229 
94.154.25.25 0 2 547832 
5.184.254.159 0 1 75396 
89.229.98.163 2 47 2722799 20180314130627
67.215.191.143 1 1 29385 20180302094305
62.68.106.232 0 2 179725 
79.191.61.14 0 2 329013 
91.228.8.136 0 5 226330 
46.229.170.197 1 1 29385 20180308024444
89.231.229.23 0 2 329013 
83.15.12.218 2 46 4786103 20180314222028
188.146.138.86 0 1 96975 
83.22.247.30 0 1 354326 
94.254.253.18 0 1 327040 
91.250.39.226 3 3 88155 20180309173241
83.22.173.83 0 2 310616 
188.146.224.110 0 2 659833 
94.40.109.242 0 1 245060 
46.169.237.52 6 125 41097959 20180319220341
5.226.73.154 0 1 108943 
94.254.150.49 2 47 2722799 20180315173410
37.190.151.132 0 1 72617 
83.28.255.219 0 1 248860 
37.248.152.206 0 1 248860 
46.171.202.214 0 1 354326 
90.154.68.42 0 1 386749 
50.112.194.65 1 1 17093 20180305154832
91.206.154.11 2 50 4292395 20180321131412
165.225.84.55 0 2 138198 
91.222.117.218 0 1 75396 
176.103.170.150 0 1 354326 
80.61.0.218 0 1 386749 
83.19.231.150 5 93 15035803 20180307150712
5.133.248.150 2 2 46019 20180304054914
178.165.130.227 0 1 191519 
83.30.122.131 0 1 83953 
83.22.80.44 0 1 386749 
79.185.63.206 0 1 604097 
185.56.211.161 2 34 1801671 20180312010917
81.219.174.4 0 1 248860 
90.156.35.219 0 1 298972 
85.232.252.14 0 2 680260 
178.212.79.202 1 1 29385 20180307181357
83.182.95.153 0 1 142609 
94.254.226.1 0 1 245060 
82.132.222.249 0 1 245060 
83.15.79.42 3 58 6242992 20180308101615
37.247.56.77 2 30 2990924 20180312085229
77.252.158.55 0 1 83953 
89.234.68.108 6 6 128734 20180310031859
5.172.247.37 0 1 207801 
80.53.110.49 0 1 543149 
89.66.26.17 0 1 343726 
91.223.212.219 0 1 194810 
195.35.80.58 1 38 1662567 20180302134813
89.206.1.154 0 1 298972 
89.64.0.55 0 2 478229 
89.231.194.239 3 65 10605955 20180311201045
89.230.36.219 0 1 75396 
109.241.78.87 0 1 298972 
185.56.174.2 0 1 245060 
162.208.50.75 0 38 2848322 
89.229.73.234 2 50 6505234 20180315233831
83.9.20.183 0 2 483724 
87.239.222.209 1 1 29385 20180301150838
78.11.163.222 0 2 205862 
91.208.93.197 0 1 604097 
31.1.16.104 0 1 206602 
176.107.47.194 0 4 1237574 
94.254.159.149 0 1 298972 
217.69.143.217 1 2 6495 20180319042150
188.146.107.144 0 1 270168 
109.241.105.138 0 1 168007 
94.254.177.91 0 1 327040 
85.221.239.202 0 1 354326 
83.10.174.83 0 1 91480 
89.77.8.142 2 40 3871631 20180304220259
198.71.57.228 1 1 29385 20180313210954
31.179.232.10 5 72 21360654 20180312223312
188.146.200.79 0 2 653298 
178.235.247.77 0 1 83953 
83.25.51.155 2 55 9746107 20180313182730
5.172.233.64 0 1 248860 
178.37.219.11 2 52 4874403 20180320090127
188.146.36.254 2 51 4401314 20180305113629
62.156.163.5 1 1 29385 20180309165859
83.30.148.146 2 48 3396725 20180312163954
156.67.99.82 0 1 83953 
67.215.191.147 2 2 58770 20180314183640
46.215.110.131 2 46 4290206 20180310150348
82.138.95.202 1 1 29385 20180319103252
87.205.6.126 3 65 9837690 20180315091436
5.172.234.215 0 1 218359 
79.185.139.69 0 2 653298 
31.0.222.70 2 34 3607518 20180320145414
83.27.216.189 0 1 248860 
91.192.144.31 0 1 352435 
83.78.197.138 0 1 298972 
162.208.50.76 0 2 379618 
83.22.254.192 0 1 327040 
91.90.78.17 0 1 135697 
194.107.18.5 5 91 17481921 20180319205257
79.110.1.220 0 1 245060 
91.228.8.179 0 1 45266 
66.102.9.129 0 1 352435 
83.22.253.96 0 1 233565 
91.228.8.178 0 6 271596 
91.227.89.131 0 2 546590 
83.26.253.222 2 28 1636430 20180313151937
83.10.167.57 2 42 8629085 20180320151227
195.136.6.170 0 1 145780 
91.228.8.148 0 4 181064 
94.254.233.36 0 1 327040 
79.184.47.163 0 1 91480 
79.189.46.38 0 2 478229 
54.67.59.131 7 7 41048 20180320233259
159.205.120.35 1 42 1438747 20180321114805
95.40.127.38 0 1 82750 
178.37.151.221 0 1 54118 
79.191.2.219 0 1 292842 
83.25.63.1 0 1 327040 
94.254.188.118 0 1 79037 
31.179.65.166 0 1 135697 
89.72.155.158 0 1 83953 
46.118.115.22 1 1 29385 20180320021807
83.31.146.212 0 1 91480 
83.29.106.12 0 1 248860 
88.73.137.118 0 1 74801 
83.14.92.33 7 160 30277714 20180320100329
95.160.152.239 4 65 10003463 20180319010017
150.254.141.92 2 35 5294324 20180305181440
217.117.138.4 0 1 354326 
46.235.152.93 0 1 245060 
95.48.21.186 0 1 108943 
5.174.98.105 0 1 297730 
79.186.23.148 2 35 3766735 20180306181513
94.254.159.221 0 2 173496 
164.126.220.52 0 1 72617 
37.47.142.254 1 42 1438747 20180307095908
79.185.63.13 0 3 574073 
31.0.69.68 2 36 3932991 20180309191818
94.246.164.80 0 3 381036 
80.52.210.218 0 2 685721 
37.47.105.161 0 1 298972 
217.99.97.249 2 33 3939830 20180321212502
185.56.208.75 5 129 19481511 20180307074614
37.7.255.124 0 1 245060 
176.115.31.177 0 1 218359 
185.93.72.183 2 33 3852053 20180320133550
194.29.176.246 0 1 239602 
79.227.163.177 0 1 83953 
213.108.117.82 0 1 83953 
79.190.110.177 0 3 946912 
193.106.245.186 3 59 10342044 20180301145712
79.189.253.13 5 109 13072069 20180301142257
67.215.191.156 1 1 29385 20180307100838
37.196.30.152 0 2 440289 
92.186.231.115 0 7 2444118 
89.234.68.77 6 6 130466 20180321214832
91.219.106.169 0 1 298972 
94.254.128.218 2 37 4992859 20180317094520
91.228.8.180 0 1 45266 
31.11.202.206 0 3 685936 
188.146.106.65 0 1 241111 
94.229.84.203 0 1 298972 
165.225.80.80 0 1 297730 
78.11.31.130 0 3 620651 
18.232.116.165 1 1 29385 20180320145627
188.146.100.211 0 3 254709 
91.228.8.183 0 3 135798 
91.201.122.14 0 1 75396 
176.103.79.211 2 38 5219672 20180304173605
185.39.161.195 2 32 3196290 20180305095029
188.146.97.32 2 47 5870431 20180302064948
94.254.149.140 0 1 386749 
89.69.40.113 0 1 354326 
109.207.55.87 0 1 386749 
37.47.128.23 0 1 65581 
89.64.56.251 0 1 239602 
91.228.8.185 0 7 316862 
188.121.11.238 0 2 653298 
31.130.98.66 0 1 83953 
88.156.17.137 0 1 82750 
87.239.222.16 0 1 83953 
188.121.14.9 2 40 5823982 20180305143842
78.11.46.39 0 1 83953 
213.5.147.12 3 61 8980212 20180307125858
37.47.37.48 0 1 75396 
83.71.247.36 6 6 130466 20180305214042
193.106.192.17 0 1 327040 
91.189.0.162 0 1 327040 
188.146.228.31 0 1 327040 
31.0.122.105 2 45 4428190 20180313211025
89.78.6.98 4 4 117540 20180318163739
37.47.199.55 0 1 298972 
31.0.42.242 2 31 1721139 20180305110858
91.205.73.34 0 1 360685 
178.37.187.90 3 57 6725556 20180316152755
85.14.70.30 2 46 5674068 20180316122149
188.146.44.230 0 1 20451 
91.228.8.201 0 1 45266 
91.196.10.30 0 1 45266 
83.23.46.22 0 1 352435 
67.215.191.166 1 1 29385 20180302020419
46.45.78.135 0 1 293511 
91.234.127.150 3 70 9686400 20180321130129
81.30.80.127 1 1 29385 20180312110402
217.99.129.130 0 1 231764 
87.239.222.18 0 1 298972 
158.46.163.73 1 1 5864 20180315024311
188.146.160.89 0 1 327040 
217.149.162.71 0 1 79037 
31.182.149.168 0 1 298972 
35.162.70.167 2 2 11728 20180308094837
213.155.161.91 2 30 2053451 20180316222047
83.26.116.36 0 3 668767 
89.64.30.82 0 1 82750 
188.146.5.44 0 2 603186 
195.62.14.130 1 1 29385 20180307181508
85.221.205.58 0 1 85491 
85.222.103.58 0 1 293511 
91.222.24.126 0 2 329013 
5.172.238.20 0 1 83953 
104.129.192.79 4 4 0 20180314073609
162.208.51.34 0 3 425663 
31.178.114.187 0 1 305507 
89.234.68.81 6 6 128734 20180310030734
94.254.154.169 0 1 248860 
109.231.48.22 0 1 83953 
83.168.71.148 0 1 245060 
91.228.8.164 0 1 45266 
46.76.41.248 0 1 233565 
80.55.39.38 2 34 3607518 20180316130402
83.238.233.251 0 1 74471 
184.94.240.92 1 1 29385 20180311174928
217.99.106.5 4 65 8653380 20180315101730
162.208.50.90 0 1 211345 
162.208.51.42 0 2 588866 
88.156.253.154 0 1 218359 
82.132.219.224 0 2 329013 
193.239.125.190 3 64 9289635 20180307165056
86.63.83.22 0 1 354326 
5.172.237.216 4 75 9957327 20180320175340
109.173.147.175 0 3 756808 
79.189.41.170 0 1 245060 
37.47.213.206 3 34 3855533 20180317085739
94.254.170.71 0 1 354326 
37.47.36.204 0 1 119918 
178.19.179.58 2 47 5870431 20180305155635
85.232.224.226 0 1 354326 
83.6.37.2 0 5 1596042 
91.239.249.64 0 1 83953 
31.2.19.156 2 53 6156054 20180305082707
51.254.97.56 1 1 29385 20180301183650
31.42.13.107 0 1 79037 
94.254.146.125 0 1 354326 
79.189.90.194 0 1 386749 
54.200.215.87 1 1 5864 20180311111314
77.112.37.209 0 1 83953 
91.228.8.147 0 2 90532 
195.205.110.21 0 1 248860 
178.235.236.6 5 95 12029027 20180312121903
END_VISITOR

# Date - Pages - Hits - Bandwidth - Visits
BEGIN_DAY 21
20180301 27 508 69278220 10
20180302 8 106 11669549 7
20180303 8 80 9809247 6
20180304 12 177 18908142 7
20180305 41 669 112907751 12
20180306 8 118 15872259 5
20180307 20 345 45984682 10
20180308 18 246 46660053 8
20180309 36 222 23898567 13
20180310 26 106 8357072 5
20180311 9 167 27550291 5
20180312 88 452 56174730 12
20180313 18 295 35084135 8
20180314 19 293 24390330 10
20180315 25 450 68594125 11
20180316 44 402 55120819 11
20180317 7 124 15015699 3
20180318 9 113 11619897 6
20180319 31 560 106989757 12
20180320 34 565 98564920 15
20180321 26 353 37307492 10
END_DAY

# Session range - Number of visits
BEGIN_SESSION 5
30mn-1h 1
30s-2mn 19
0s-30s 145
5mn-15mn 6
2mn-5mn 15
END_SESSION

# URL - Pages - Bandwidth - Entry - Exit
# The 10 first Pages must be first (order not required for others)
BEGIN_SIDER 20
/ 159 2296919 121 75
/images/fonts/fontawesome-webfont.woff2 94 6648432 3 56
/kontakt.html 35 240714 9 14
/kostka-granitowa-strzegom.html 29 249588 8 8
/bloki-bryly-granitowe.html 26 168354 12 3
/kostka-czarna-szwed-vanga-bohus.html 25 155272 2 5
/plyty-chodnikowe-granitowe.html 20 96948 10 1
/krawezniki-granitowe.html 19 172357 7 3
/kamien-murowy.html 18 116336 3 4
/schody-granitowe.html 17 154701 3 3
/oporniki-granitowe.html 8 70594 0 0
/rodzaje-granitu.html 3 9780 1 0
/images/fonts/fontawesome-webfont.eot 3 225660 0 1
/grysy-granitowe.html 16 123775 3 4
/images/fonts/fontawesome-webfont.woff 4 356304 0 2
/zastosowanie-granitu.html 2 6520 0 1
/googlefa91ec6b03e30623.html 2 106 2 2
/parapety-granitowe.html 10 67483 1 3
/firma.html 11 152040 0 1
/niesort-granitowy.html 13 115783 1 0
END_SIDER
