AWSTATS DATA FILE 7.2 (build 1.992)
# If you remove this file, all statistics for date 201706 will be lost/reset.
# Last config file used to build this data file was /etc/awstats/inetadmin/awstats.232652.conf.

# Position (offset in bytes) in this file for beginning of each section for
# direct I/O access. If you made changes somewhere in this file, you should
# also remove completely the MAP section (AWStats will rewrite it at next
# update).
BEGIN_MAP 28
POS_GENERAL 2047                
POS_TIME 2719                
POS_VISITOR 11670               
POS_DAY 24466               
POS_DOMAIN 3609                
POS_LOGIN 4093                
POS_ROBOT 4248                
POS_WORMS 4937                
POS_EMAILSENDER 5068                
POS_EMAILRECEIVER 5211                
POS_SESSION 25325               
POS_SIDER 25534               
POS_FILETYPES 5346                
POS_DOWNLOADS 5634                
POS_OS 5757                
POS_BROWSER 6012                
POS_SCREENSIZE 7256                
POS_UNKNOWNREFERER 7330                
POS_UNKNOWNREFERERBROWSER 8239                
POS_ORIGIN 8601                
POS_SEREFERRALS 8745                
POS_PAGEREFS 8921                
POS_SEARCHWORDS 9324                
POS_KEYWORDS 9531                
POS_MISC 2383                
POS_ERRORS 9636                
POS_CLUSTER 3949                
POS_SIDER_404 9740                
POS_PLUGIN_geoip_city_maxmind 11310               
END_MAP

# LastLine    = Date of last record processed - Last record line number in last log - Last record offset in last log - Last record signature value
# FirstTime   = Date of first visit for history file
# LastTime    = Date of last visit for history file
# LastUpdate  = Date of last update - Nb of parsed records - Nb of parsed old records - Nb of parsed new records - Nb of parsed corrupted - Nb of parsed dropped
# TotalVisits = Number of visits
# TotalUnique = Number of unique visitors
# MonthHostsKnown   = Number of hosts known
# MonthHostsUnKnown = Number of hosts unknown
BEGIN_GENERAL 8
LastLine 20170701012939 1 0 12980400088476
FirstTime 20170601143856
LastTime 20170630174217
LastUpdate 20170702000433 1 0 0 0 0
TotalVisits 163                 
TotalUnique 121                 
MonthHostsKnown 0                   
MonthHostsUnknown 422                 
END_GENERAL

# Misc ID - Pages - Hits - Bandwidth
BEGIN_MISC 10
JavaEnabled 0 0 0
TotalMisc 0 0 0
QuickTimeSupport 0 0 0
WindowsMediaPlayerSupport 0 0 0
RealPlayerSupport 0 0 0
JavascriptDisabled 0 0 0
PDFSupport 0 0 0
FlashSupport 0 0 0
AddToFavourites 0 0 0
DirectorSupport 0 0 0
END_MISC

# Hour - Pages - Hits - Bandwidth - Not viewed Pages - Not viewed Hits - Not viewed Bandwidth
BEGIN_TIME 24
0 23 377 87558918 26 197 9085226
1 2 18 6802064 39 265 8992056
2 0 2 647837 23 193 10229002
3 1 4 1031286 20 187 5170810
4 0 0 0 18 151 3923398
5 0 0 0 35 120 3518353
6 4 69 9819295 13 68 3912745
7 11 228 32721977 36 218 6448341
8 23 374 65043850 21 190 8062442
9 48 656 105366236 19 65 5437982
10 30 448 56359297 11 166 7414797
11 26 426 75284999 20 85 3532953
12 33 633 86177807 7 30 1144609
13 29 443 61612685 30 70 5084130
14 37 496 97184500 25 67 4282634
15 21 434 58990814 19 125 14699161
16 48 722 106320070 21 78 9759657
17 39 746 101472483 15 57 8495486
18 17 235 35539720 26 58 4363834
19 5 78 10921502 20 42 2110538
20 12 319 55953858 11 54 3418739
21 20 245 36332820 20 139 3148440
22 22 371 67400021 18 102 1729348
23 18 259 39919237 18 185 11386317
END_TIME

# Domain - Pages - Hits - Bandwidth
# The 10 first Pages must be first (order not required for others)
BEGIN_DOMAIN 16
pl 328 5774 942534330
us 49 423 31985865
gb 24 436 64381664
ca 12 14 805063
de 11 247 30411603
sk 10 192 37368223
cn 9 9 51129
ua 6 110 27231594
no 5 101 19536635
lt 5 106 12839663
it 2 37 4833458
cz 4 64 8625891
es 0 1 218359
se 4 64 16344151
dk 0 2 653298
eu 0 3 557266
END_DOMAIN

# Cluster ID - Pages - Hits - Bandwidth
BEGIN_CLUSTER 0
END_CLUSTER

# Login - Pages - Hits - Bandwidth - Last visit
# The 10 first Pages must be first (order not required for others)
BEGIN_LOGIN 0
END_LOGIN

# Robot ID - Hits - Bandwidth - Last visit - Hits on robots.txt
# The 10 first Hits must be first (order not required for others)
BEGIN_ROBOT 15
bot[\s_+:,\.\;\/\\-] 1689 29069504 20170630101802 0
googlebot 610 94031856 20170630234440 0
robot 84 14044321 20170630183607 0
bingbot 56 1036543 20170630181805 0
baiduspider 46 296950 20170630082843 0
crawl 32 128566 20170618184226 0
checker 18 67174 20170614200024 0
yandex 18 82086 20170627033603 0
[\s_+:,\.\;\/\\-]bot 11 41417 20170604173800 0
scanner 9 710702 20170625225509 0
mail\.ru 1 5681 20170617191259 0
favicon 2 6319 20170630124439 0
no_user_agent 1 29158 20170610045511 0
surveybot 2 11369 20170629132940 0
netcraft 1 29158 20170608170708 0
END_ROBOT

# Worm ID - Hits - Bandwidth - Last visit
# The 5 first Hits must be first (order not required for others)
BEGIN_WORMS 0
END_WORMS

# EMail - Hits - Bandwidth - Last visit
# The 20 first Hits must be first (order not required for others)
BEGIN_EMAILSENDER 0
END_EMAILSENDER

# EMail - Hits - Bandwidth - Last visit
# The 20 first hits must be first (order not required for others)
BEGIN_EMAILRECEIVER 0
END_EMAILRECEIVER

# Files type - Hits - Bandwidth - Bandwidth without compression - Bandwidth after compression
BEGIN_FILETYPES 11
js 1648 15021980 0 0
woff 28 2315976 0 0
ttf 4 603680 0 0
png 467 6881323 0 0
pdf 31 1404524 0 0
gif 271 1377594 0 0
css 1023 5948022 0 0
html 315 2251123 0 0
eot 28 1955720 0 0
woff2 94 6506976 0 0
jpg 3674 1154111274 0 0
END_FILETYPES

# Downloads - Hits - Bandwidth
BEGIN_DOWNLOADS 2
/images/cennik-scanstone.pdf 18 1 834406
/images/cennik-sc.pdf 14 1 658214
END_DOWNLOADS

# OS ID - Hits
BEGIN_OS ID - Hits - Pages 14
winvista 576 41
win8 34 2
j2me 4 0
winunknown 3 0
linux 68 5
macosx 1614 125
winxp 144 9
Unknown 42 27
macosx6 1 0
winnt 1793 88
win7 1560 78
win2003 11 9
winlong 72 4
linuxandroid 1663 81
END_OS

# Browser ID - Hits - Pages
BEGIN_BROWSER 61
chrome59.0.3071.109 2 0
firefox43.0 1 0
firefox47.0 1 0
chrome43.0.2357.134 1 0
chrome40.0.2214.115 1 1
chrome39.0.0.0 1 0
safari9.0 53 11
safari8.0 1 0
firefox51.0 2 0
chrome50.0.2661.89 57 0
iphone 11 0
safari9.0.3 1 0
chrome54.0.2840.98 84 6
chrome56.0.2924.87 2 0
firefox31.0 1 0
chrome17.0.963.12 1 1
safari10.0 244 16
chrome54.0.2840.85 2 0
safari9.1.3 1 0
opera9.80 4 0
chrome55.0.2883.91 46 2
chrome55.0.2883.95 2 2
chrome55.0.2883.87 1 0
firefox53.0 572 25
nokia 1084 81
safari5.1 1 0
samsung 47 2
chrome49.0.2623.112 135 6
chrome31.0.1650.57 3 0
firefox34.0 1 0
chrome46.0.2486.0 1 0
Unknown 6 2
chrome59.0.3071.115 286 15
chrome58.0.3029.110 2115 118
android 7 0
chrome33.0.0.0 3 0
chrome59.0.3071.104 5 0
safari10.0.1 1 0
firefox2.0.0.1 2 2
chrome38.0.2125.102 119 8
chrome57.0.2987.132 43 2
firefox52.0 80 5
msie10.0 31 3
chrome58.0.3029.81 1 0
safari10.1.1 2 0
firefox48.0 1 0
firefox40.1 1 1
mozilla 375 45
chrome44.0.2403.133 2 0
chrome42.0.2311.135 1 0
chrome51.0.2704.106 154 8
msie7.0 11 9
chrome30.0.0.0 8 0
safari10.0.3 88 6
chrome59.0.3071.86 151 8
firefox54.0 298 12
chrome51.0.2704.79 139 6
chrome58.0.3029.83 1238 62
safari9.1.2 1 0
chrome45.0.2454.94 1 1
safari 51 3
END_BROWSER

# Screen size - Hits
BEGIN_SCREENSIZE 0
END_SCREENSIZE

# Unknown referer OS - Last visit date
BEGIN_UNKNOWNREFERER 12
com.google.GoogleMobile/27.0.0_iPad/9.3.5_hw/iPad3_3 20170604155508
Mozilla/5.0_(compatible;_Dataprovider.com;) 20170628165628
com.google.GoogleMobile/27.0.0_iPhone/10.3.2_hw/iPhone9_4 20170601135953
Mozilla/5.0_(compatible;_ips-agent) 20170623092148
com.google.GoogleMobile/28.0.0_iPad/10.1.1_hw/iPad5_4 20170622214626
com.google.GoogleMobile/28.0.0_iPhone/10.3_hw/iPhone9_3 20170613222321
com.google.GoogleMobile/28.0.0_iPad/10.3.2_hw/iPad4_2 20170613154119
Mozilla/5.0_(compatible;_Google-Site-Verification/1.0) 20170605184127
com.google.GoogleMobile/28.0.0_iPhone/10.3.2_hw/iPhone7_2 20170611013757
com.google.GoogleMobile/27.0.0_iPhone/10.2_hw/iPhone9_3 20170603234655
com.google.GoogleMobile/27.0.0_iPhone/10.3.2_hw/iPhone9_3 20170604202049
DowntimeDetector/1.0_(_http://downforeveryoneorjustme.com) 20170618232328
END_UNKNOWNREFERER

# Unknown referer Browser - Last visit date
BEGIN_UNKNOWNREFERERBROWSER 4
com.google.GoogleMobile/28.0.0_iPad/10.3.2_hw/iPad4_2 20170613154119
com.google.GoogleMobile/27.0.0_iPad/9.3.5_hw/iPad3_3 20170604155508
DowntimeDetector/1.0_(_http://downforeveryoneorjustme.com) 20170618232328
com.google.GoogleMobile/28.0.0_iPad/10.1.1_hw/iPad5_4 20170622214626
END_UNKNOWNREFERERBROWSER

# Origin - Pages - Hits 
BEGIN_ORIGIN 6
From0 74 206
From1 2 2
From2 111 497
From3 2 164
From4 280 6716
From5 0 0
END_ORIGIN

# Search engine referers ID - Pages - Hits
BEGIN_SEREFERRALS 2
google 111 493
google_image 0 4
END_SEREFERRALS

# External page referers - Pages - Hits
# The 10 first Pages must be first (order not required for others)
BEGIN_PAGEREFS 2
http://webcache.googleusercontent.com/search 1 163
https://panoramafirm.pl/dolno%C5%9Bl%C4%85skie,%C5%9Bwidnicki,strzegom,rynek,23_lok._14/scanstone_romstone_przedsiebiorstwo_produkcyjno_uslugowo_handlowe_roman_rog_sebastian_rymarczyk-afaboh_lbm.html 1 1
END_PAGEREFS

# Search keyphrases - Number of search
# The 10 first number of search must be first (order not required for others)
BEGIN_SEARCHWORDS 3
scanstone.pl 10
scanstone 9
scanstone+rogo%c5%banica 1
END_SEARCHWORDS

# Search keywords - Number of search
# The 10 first number of search must be first (order not required for others)
BEGIN_KEYWORDS 3
scanstone.pl 10
scanstone 10
rogo%c5%banica 1
END_KEYWORDS

# Errors - Hits - Bandwidth
BEGIN_ERRORS 2
404 197 41274
206 20 1031856
END_ERRORS

# URL with 404 errors - Hits - Last URL referer
BEGIN_SIDER_404 22
/wp-login.php 4 -
/apple-touch-icon-76x76.png 1 -
/sitemap.xml 2 -
/apple-touch-icon.png 4 -
/kostka-granitowa-strzegom/ 1 -
/prettyPhoto[galeria-1]/2/prettyPhoto[galeria-1]/2/prettyPhoto[galeria-1]/2/prettyPhoto[galeria-1]/0/prettyPhoto[galeria-1]/0/prettyPhoto[galeria-1]/0/prettyPhoto[galeria-1]/1/prettyPhoto[galeria-1]/2/prettyPhoto[galeria-1]/3/prettyPhoto[galeria-1]/0/prett 1 http://www.scanstone.pl/prettyPhoto[galeria-5]/1/prettyPhoto[galeria-5]/2/prettyPhoto[galeria-5]/0/prettyPhoto[galeria-5]/0/prettyPhoto[galeria-5]/1/prettyPhoto[galeria-5]/2/prettyPhoto[galeria-5]/0/prettyPhoto[galeria-5]/1/prettyPhoto[galeria-5]/1/prettyPhoto[galeria-5]/1/prettyPhoto[galeria-2]/1/prettyPhoto[galeria-2]/0/prettyPhoto[galeria-2]/1/
/kostka-granitowa-strzegom 8 http://www.scanstone.pl/
/tel:+48603110680 1 -
/prettyPhoto[galeria-1]/1/prettyPhoto[galeria-3]/0/ 1 -
/images/cennik-sc.pdf 4 http://www.scanstone.pl/kostka-granitowa-strzegom.html
/apple-touch-icon-76x76-precomposed.png 1 -
/xnqdbywlqpkt.html 1 -
/prettyPhoto%5Bgaleria-1%5D/2/prettyPhoto%5Bgaleria-1%5D/3/prettyPhoto%5Bgaleria-1%5D/3/prettyPhoto%5Bgaleria-1%5D/3/prettyPhoto%5Bgaleria-1%5D/1/prettyPhoto%5Bgaleria-1%5D/1/ 2 -
/niesort-granitowy/niesort-granitowy-0.jpg 1 -
/googleb14c8470624a789a.html 1 -
/images/cennik-scanstone.pdf 1 http://www.scanstone.pl/
/oferta.html 1 -
/apple-touch-icon76x76.png 2 -
/robots.txt 155 -
/apple-touch-icon120x120.png 2 -
/apple-touch-icon152x152.png 2 -
/tel:+48601567990 1 -
END_SIDER_404

# Plugin key - Pages - Hits - Bandwidth - Last access
BEGIN_PLUGIN_geoip_city_maxmind 1
unknown 0 7585 0 0
END_PLUGIN_geoip_city_maxmind

# Host - Pages - Hits - Bandwidth - Last visit date - [Start date of last visit] - [Last page of last visit]
# [Start date of last visit] and [Last page of last visit] are saved only if session is not finished
# The 10 first Hits must be first (order not required for others)
BEGIN_VISITOR 422
31.2.42.245 47 556 113183207 20170620143303
37.249.85.26 16 196 24076423 20170616101822
86.24.170.174 15 334 53656555 20170610160047
79.189.78.141 12 140 26580084 20170629105634
46.215.156.202 12 182 26837808 20170628190045
167.114.209.38 12 12 257231 20170628165629
37.248.50.145 10 147 27324523 20170623091859
69.58.178.56 10 10 206058 20170623092148
46.215.32.67 9 134 20606961 20170621152244
38.100.21.64 9 11 301107 20170610215218
193.41.175.22 0 2 477969 
78.8.174.251 0 1 65581 
159.205.71.176 0 1 83953 
46.171.112.237 4 69 7259157 20170621111157
212.91.12.212 1 1 5681 20170606110724
80.55.69.41 0 1 298972 
94.254.129.154 0 8 2090972 
83.6.196.184 0 1 245060 
176.109.163.58 2 32 3621995 20170602214845
94.232.216.67 0 1 83953 
83.15.46.62 2 48 3396549 20170628095436
217.89.109.174 0 1 248860 
83.10.50.108 0 1 360685 
188.123.215.103 0 1 20451 
46.169.75.230 3 65 10438127 20170611225342
37.47.25.36 2 36 4370873 20170612140614
87.105.187.234 0 1 248860 
176.109.160.247 2 34 3607554 20170617073653
213.77.40.1 0 1 82750 
85.167.88.104 0 1 75396 
188.146.134.245 0 1 293511 
85.219.170.98 0 1 197954 
79.186.248.159 0 1 248860 
37.47.129.251 0 1 245060 
78.10.110.105 0 2 698052 
79.186.175.136 0 1 354326 
83.7.54.177 0 1 245060 
80.242.45.17 4 78 18493513 20170630152937
94.254.146.72 0 1 360685 
94.254.155.69 0 2 537037 
178.37.175.62 5 90 16093445 20170601144945
217.171.48.146 0 1 245060 
217.99.91.11 0 1 197954 
188.33.135.168 0 2 698052 
89.73.74.230 0 2 478229 
84.10.168.189 3 71 9235086 20170629210559
178.16.43.156 5 105 12760626 20170619092541
37.248.155.121 0 1 75396 
83.17.38.26 0 1 245060 
66.249.88.46 3 23 1767273 20170610115059
178.217.251.250 0 1 82750 
66.102.6.157 1 19 1461195 20170603104813
80.244.157.244 0 1 245060 
46.174.211.30 0 1 75396 
77.113.54.19 0 1 20451 
31.0.66.250 0 11 5546000 
37.61.161.2 3 49 8536632 20170613104510
31.0.44.190 3 47 2815553 20170606103159
178.43.208.124 2 50 4292212 20170614225416
37.47.33.144 0 1 91480 
208.114.126.106 0 1 245060 
93.181.141.85 2 30 1965710 20170612101846
83.21.239.196 0 1 91480 
83.28.205.105 0 1 245060 
212.160.87.106 0 1 293511 
188.117.136.46 0 1 386749 
86.63.101.122 0 1 83953 
83.11.252.213 0 1 293511 
73.210.66.27 0 1 360685 
81.219.237.194 0 5 2019191 
95.51.60.242 0 2 414049 
91.216.213.170 0 3 728825 
83.29.243.115 0 1 245060 
82.160.41.100 0 1 293511 
109.173.155.42 0 1 248860 
188.146.130.166 2 53 6169542 20170601153509
85.222.58.149 0 1 91480 
83.24.1.3 0 1 386749 
109.173.148.180 0 1 20451 
37.248.156.244 0 1 83953 
89.67.99.245 0 2 478229 
217.96.186.239 0 1 354326 
66.102.8.214 4 38 3260449 20170628175307
194.181.62.3 0 1 245060 
94.254.131.227 2 43 1430875 20170623150920
83.29.159.44 0 2 329013 
89.67.235.75 0 1 96563 
66.102.8.216 2 48 3555080 20170628175306
89.72.5.168 0 1 83953 
5.172.237.24 0 1 245060 
46.134.140.146 0 1 75396 
31.2.116.146 3 46 8623887 20170608163503
87.197.128.48 3 64 9983752 20170607150321
188.146.99.240 0 1 604097 
46.170.246.75 0 2 497720 
188.146.74.56 0 2 329013 
156.17.108.121 2 39 5201945 20170614075333
212.59.238.60 0 1 270168 
176.109.160.196 5 63 13206564 20170622003954
46.227.36.200 0 1 360685 
31.1.176.196 2 30 1970202 20170610135809
83.26.246.169 0 4 1328908 
159.205.237.8 0 3 772224 
212.160.135.130 0 1 262482 
83.8.242.113 0 1 29476 
31.0.65.52 0 1 54118 
87.105.133.79 2 31 2569807 20170612231316
83.15.64.213 0 1 74471 
78.8.73.111 0 5 672613 
31.42.13.23 0 1 108943 
185.122.144.172 0 1 83953 
185.56.210.15 0 1 108943 
178.37.46.221 0 1 248860 
83.30.243.183 0 2 329013 
89.66.35.7 0 1 354326 
217.99.220.162 2 47 5870474 20170607083852
37.47.65.156 0 1 245060 
81.190.227.199 0 1 343726 
94.254.147.104 0 1 191519 
89.204.153.248 0 1 85491 
94.254.178.75 0 1 245060 
37.47.8.76 0 1 245060 
188.125.136.137 0 2 329013 
87.148.203.243 3 67 11809224 20170625164534
83.30.213.166 0 1 83953 
188.146.4.47 2 31 2502213 20170610124502
81.109.190.65 0 1 83953 
188.146.137.68 8 101 14467347 20170604181108
95.49.92.86 0 1 604097 
77.179.119.232 2 45 4555991 20170627175310
34.210.58.164 1 1 5681 20170602131734
5.172.238.91 0 1 343726 
46.76.134.43 2 49 3670192 20170625183325
64.233.172.182 1 19 2779169 20170617124852
83.4.255.233 3 62 9234736 20170609080650
5.60.42.185 3 45 1368501 20170630081705
188.47.127.224 0 1 248860 
77.65.85.183 0 1 343726 
176.103.32.11 0 1 79037 
188.146.166.32 3 26 4958552 20170613140155
81.15.137.6 0 1 343726 
31.0.87.66 0 8 3977035 
217.31.42.245 0 1 354326 
91.231.100.37 0 1 248860 
95.116.197.148 0 1 83953 
83.27.25.208 0 2 331610 
178.62.7.178 2 2 58316 20170618232326
37.47.75.202 0 1 245060 
37.47.37.123 0 1 354326 
192.227.198.70 1 1 29158 20170618232323
37.7.2.156 0 5 3240873 
80.87.37.210 0 1 87713 
5.172.234.128 0 1 96975 
66.102.6.24 0 33 3437260 
79.186.23.245 0 1 54118 
79.185.38.89 0 2 154433 
188.146.104.19 0 1 245060 
83.25.132.168 0 1 83953 
91.215.1.210 0 1 75396 
195.66.68.37 6 134 17728857 20170630174217
185.112.119.221 0 1 352435 
176.109.160.156 8 140 23864215 20170629101611
79.189.60.209 0 1 82750 
89.64.31.72 3 71 9423329 20170612203533
83.23.182.206 0 1 245060 
79.189.217.241 0 1 132793 
91.189.143.20 4 88 15628912 20170605160741
66.102.8.212 1 58 3515128 20170621165141
31.6.188.63 0 1 245060 
188.146.19.133 2 41 6484227 20170608124209
95.175.8.181 0 1 87713 
82.58.170.197 2 37 4833458 20170623154618
31.178.249.46 2 48 3396542 20170612131457
31.1.78.150 3 61 9810367 20170618121501
89.64.45.106 0 2 526418 
157.25.133.4 0 4 1195669 
31.0.123.2 0 4 1002606 
37.47.5.0 5 90 19631137 20170621143444
87.101.39.18 0 1 85491 
66.249.88.50 0 14 564267 
94.40.25.2 0 1 91480 
79.186.5.167 0 1 354326 
188.146.12.96 0 1 83953 
83.28.119.242 0 1 318668 
188.137.74.70 0 1 85491 
188.146.68.18 4 55 12882733 20170602010219
94.254.136.84 4 51 10174646 20170611231935
46.238.100.102 3 38 4722106 20170614122200
37.47.174.111 0 1 248860 
83.24.90.188 0 1 87713 
83.21.100.217 0 1 354326 
178.43.255.57 0 1 87713 
31.0.124.99 4 75 15510997 20170621175241
188.252.31.148 0 2 329013 
94.254.241.50 3 62 9036183 20170613150303
95.49.92.72 0 1 354326 
194.181.252.2 0 1 386749 
83.6.224.119 0 3 250996 
37.47.2.129 0 1 75396 
217.144.192.209 3 72 9985364 20170610112732
188.114.68.10 0 1 29476 
109.95.144.231 0 1 108943 
178.219.123.126 0 1 673926 
195.238.169.130 0 1 360685 
82.145.221.81 0 3 557266 
91.224.47.160 0 3 841343 
85.229.105.28 0 1 298972 
93.198.80.189 0 1 354326 
83.28.13.243 0 1 82750 
178.42.64.227 0 1 87713 
109.231.48.38 0 1 206602 
83.24.95.187 0 1 245060 
83.18.144.117 0 1 245060 
91.226.39.100 0 4 545659 
37.47.31.217 0 2 446387 
94.254.161.242 0 1 343726 
83.22.115.161 0 1 297730 
46.76.118.134 0 1 75396 
91.233.184.2 0 1 315700 
122.96.129.45 1 1 5681 20170607174856
195.246.216.216 0 2 982712 
77.236.218.167 4 64 8625891 20170605084306
89.22.209.3 0 3 271205 
5.172.235.150 0 1 354326 
188.146.13.104 2 32 3621995 20170608080836
37.47.159.111 0 1 354326 
195.136.92.233 0 1 74471 
148.81.198.154 0 2 126735 
176.221.123.157 0 1 83953 
31.0.125.5 0 1 75396 
81.26.28.34 0 2 563728 
2.99.145.15 0 4 349830 
178.42.75.137 0 1 297730 
83.5.5.87 0 2 315188 
66.102.9.148 0 1 83953 
193.34.178.24 0 1 91480 
83.9.16.26 0 1 245060 
80.50.139.238 0 1 83953 
165.225.84.61 0 1 327040 
178.217.195.3 0 1 248860 
77.255.107.83 0 1 354326 
112.80.139.1 1 1 5681 20170607183711
77.254.99.96 0 1 74801 
37.248.24.83 8 140 43028403 20170629000616
78.31.146.251 0 3 345651 
77.254.123.55 0 1 221416 
87.105.53.84 0 2 596702 
83.9.235.244 0 2 653527 
85.164.39.34 5 97 18847399 20170616002025
91.192.205.198 0 1 297730 
31.0.46.186 3 59 8234278 20170612172130
64.233.172.180 1 11 764841 20170617124849
37.248.160.165 3 23 2647434 20170608145308
91.239.36.21 0 1 83953 
185.93.242.120 0 1 218359 
37.7.82.140 0 1 96975 
79.185.182.79 0 1 680568 
37.47.162.106 0 2 174230 
185.61.4.250 0 1 83953 
31.0.36.88 0 4 1030082 
176.120.127.7 0 2 603186 
88.199.163.87 0 1 87713 
66.249.88.48 0 13 2544913 
37.8.230.70 0 1 305507 
37.47.50.50 0 1 343726 
188.146.132.43 0 1 680568 
5.172.235.102 0 2 687725 
188.146.136.6 0 1 245060 
93.158.233.218 0 1 293511 
172.245.236.198 1 1 29158 20170602131726
83.9.17.226 6 135 16486927 20170619160816
217.173.202.100 0 2 653298 
66.102.6.158 1 12 837950 20170603104810
109.173.212.51 0 1 293511 
212.33.67.90 0 1 262482 
79.188.202.126 3 64 8655459 20170626120809
95.41.169.64 4 82 10890235 20170616093235
79.185.24.192 0 2 584276 
94.254.129.233 0 1 270168 
180.212.200.98 1 1 5681 20170607190915
83.8.209.162 0 1 354326 
178.235.40.229 0 1 83953 
114.221.125.8 1 1 5681 20170607181630
77.253.43.24 0 1 248860 
31.0.37.251 0 38 21503515 
37.47.171.164 0 2 150197 
94.254.233.32 0 1 83953 
109.173.220.115 0 1 91480 
83.10.230.61 0 1 354326 
83.144.94.80 0 1 248860 
83.28.252.37 3 96 18708895 20170606200701
95.40.230.126 3 70 18333917 20170608122544
123.158.48.143 1 1 5681 20170607183629
151.226.185.123 0 4 889295 
95.48.249.13 0 1 354326 
188.146.3.231 6 97 26066565 20170609092302
89.73.6.217 2 40 5824003 20170621214420
80.53.241.40 0 2 315582 
37.47.22.27 0 1 83953 
66.102.6.22 4 31 981712 20170614155422
156.17.87.250 0 1 292842 
194.181.147.218 0 2 478229 
79.74.217.21 0 1 386749 
83.4.38.175 0 1 87713 
83.7.232.102 0 1 83953 
62.225.75.172 2 50 4292212 20170608123755
31.0.44.29 0 1 75396 
80.72.44.58 0 1 245060 
83.17.247.146 0 1 298972 
213.108.225.53 0 2 478229 
60.1.132.168 1 1 5681 20170607190734
83.8.223.204 0 2 149272 
5.174.1.193 0 1 297730 
83.4.253.147 0 1 241111 
31.0.37.161 0 2 329013 
66.102.6.159 1 19 2577308 20170603104813
77.65.107.165 0 1 83953 
83.20.255.117 0 1 83953 
188.146.7.8 0 3 1062978 
79.185.193.20 0 1 75396 
88.220.123.81 0 4 909321 
91.60.30.130 2 37 4365167 20170627205938
54.190.54.137 1 1 5681 20170618232328
91.206.154.61 0 1 75396 
178.212.155.6 0 1 318668 
195.128.114.21 0 1 75396 
88.199.88.98 0 1 20451 
79.189.79.177 0 1 298972 
80.54.255.146 0 1 297730 
188.146.8.12 0 1 245060 
195.76.205.243 0 1 218359 
178.42.106.206 0 1 673926 
83.29.195.26 3 50 6700879 20170629091924
95.160.152.199 0 1 354326 
83.29.115.142 0 1 245060 
188.146.128.70 6 84 12896037 20170610235722
83.23.211.250 0 1 245837 
141.0.12.227 0 1 197527 
85.181.56.130 2 44 4616379 20170607232723
180.213.125.170 1 1 5681 20170607203147
83.20.201.56 0 1 91480 
79.186.123.115 0 2 325045 
83.15.98.218 5 74 12856354 20170623163517
93.105.104.57 0 1 245060 
109.173.209.221 0 1 604097 
122.96.128.232 1 1 5681 20170607182350
193.46.187.252 0 1 245060 
89.231.11.209 0 1 248860 
31.0.80.67 0 1 87713 
37.47.240.207 0 4 803274 
176.38.251.12 6 110 27231594 20170613111225
194.33.77.53 4 90 10239402 20170627172849
36.106.251.57 1 1 5681 20170607172841
204.195.157.44 0 1 293511 
87.239.168.216 0 1 360685 
52.87.86.158 2 2 11369 20170624000616
188.146.10.30 0 1 245060 
91.230.116.150 0 1 245060 
89.231.204.47 0 2 296812 
46.46.195.147 0 2 416313 
83.11.93.50 0 2 1226124 
66.102.6.20 0 30 1035244 
212.244.10.163 3 36 4040271 20170621124239
31.121.215.190 0 1 354326 
83.27.212.20 3 58 6606655 20170613113344
37.47.9.63 0 1 233565 
37.47.12.23 0 1 245060 
78.131.200.2 0 1 231764 
83.168.82.98 0 1 604097 
37.248.160.77 0 1 231530 
188.146.15.40 0 1 194810 
176.109.163.210 2 49 3670192 20170626075611
176.96.170.242 0 1 91480 
66.249.89.216 1 1 53 20170605102300
213.155.162.133 0 2 416313 
78.8.211.15 0 2 628478 
109.232.29.148 0 1 91480 
83.29.37.26 0 1 82016 
46.227.245.70 0 1 354326 
66.249.89.212 3 3 159 20170605184127
185.34.76.227 0 1 343726 
37.7.26.6 8 100 7801923 20170605214301
2.124.253.166 1 1 29145 20170623033151
77.114.120.166 2 47 3347111 20170619172127
94.254.240.192 0 1 248860 
91.192.146.4 0 1 83953 
94.254.137.33 0 1 83953 
185.78.149.104 0 1 297730 
188.69.199.193 0 1 79037 
92.207.97.81 6 88 8573495 20170628100750
83.22.248.33 0 1 245060 
79.188.73.110 0 1 245060 
185.28.251.24 0 1 248860 
89.231.10.232 0 1 245060 
83.24.180.55 0 1 343726 
159.205.69.147 0 2 150197 
31.0.33.147 3 23 2647434 20170611091326
88.156.72.209 0 1 293511 
81.231.36.75 4 63 16045179 20170630173206
178.183.235.84 0 1 74471 
83.26.232.9 0 3 1025374 
94.254.165.145 0 1 74471 
37.47.162.82 2 31 2657591 20170607151607
176.103.162.39 3 57 12948992 20170626171720
64.233.172.184 1 20 1332443 20170617124852
159.205.18.161 0 2 150197 
141.119.184.130 0 2 547832 
193.59.36.165 0 1 91480 
188.146.96.144 0 2 170517 
94.254.242.59 0 1 354326 
159.255.186.11 3 69 9338832 20170612181202
176.23.32.245 0 2 653298 
94.254.130.41 0 1 75396 
178.217.199.140 0 1 82750 
37.47.171.22 2 34 3607554 20170612125346
83.23.96.127 0 1 622027 
83.28.130.66 2 54 5890052 20170623142325
94.254.146.222 0 1 248860 
94.254.128.96 0 1 65581 
83.7.129.221 2 35 3723814 20170605144454
94.254.147.186 0 1 293511 
5.172.255.70 0 2 145598 
END_VISITOR

# Date - Pages - Hits - Bandwidth - Visits
BEGIN_DAY 30
20170601 7 153 23563415 2
20170602 13 155 25781110 6
20170603 9 209 30946315 5
20170604 11 201 31812083 2
20170605 18 253 35324408 8
20170606 10 234 39547891 4
20170607 20 266 30966642 14
20170608 15 266 42917889 6
20170609 13 261 52633943 3
20170610 28 346 48315558 7
20170611 10 162 30760006 3
20170612 23 492 59960622 10
20170613 29 472 84247001 10
20170614 12 219 29693186 5
20170615 0 8 1221959 0
20170616 14 245 37588305 4
20170617 8 141 13561596 5
20170618 9 129 20595012 5
20170619 26 422 58720957 6
20170620 29 323 83385664 3
20170621 29 496 77711502 12
20170622 11 203 33747230 3
20170623 32 375 54934202 7
20170624 4 61 6341333 3
20170625 5 130 19042036 2
20170626 11 224 33556846 4
20170627 10 202 29056444 5
20170628 33 395 50219760 9
20170629 17 297 69460750 5
20170630 13 243 42847611 5
END_DAY

# Session range - Number of visits
BEGIN_SESSION 7
0s-30s 110
30s-2mn 29
30mn-1h 2
1h+ 1
5mn-15mn 10
15mn-30mn 2
2mn-5mn 9
END_SESSION

# URL - Pages - Bandwidth - Entry - Exit
# The 10 first Pages must be first (order not required for others)
BEGIN_SIDER 19
/ 124 1174154 95 34
/images/fonts/fontawesome-webfont.woff2 94 6506976 5 37
/kostka-granitowa-strzegom.html 34 177354 15 9
/kontakt.html 34 168988 9 15
/kostka-czarna-szwed-vanga-bohus.html 33 176348 4 17
/images/fonts/fontawesome-webfont.eot 28 1955720 2 8
/images/fonts/fontawesome-webfont.woff 28 2315976 2 14
/grysy-granitowe.html 21 124774 5 7
/firma.html 14 119932 5 4
/kamien-murowy.html 12 78763 4 2
/parapety-granitowe.html 4 15129 0 2
/krawezniki-granitowe.html 5 46434 2 2
/oporniki-granitowe.html 4 27041 1 1
/schody-granitowe.html 2 18393 0 0
/plyty-chodnikowe-granitowe.html 11 61756 4 2
/googlefa91ec6b03e30623.html 4 212 4 4
/images/fonts/fontawesome-webfont.ttf 4 603680 0 1
/bloki-bryly-granitowe.html 9 46055 4 4
/niesort-granitowy.html 4 15790 2 0
END_SIDER
