{
  "response": {
    "mimeType": "application/json"
  },
  "request": {
    "name": "featureEvent-day-summary",
    "pipeline": [{
      "source": {
        "featureEvents": null,
        "timeSeries": {
          "period": "dayRange",
          "first": "now()",
          "count": 1
        }
      }
    }, {
    	"group": {
    		"group": ["featureId", "accountId", "visitorId", "userAgent"],
    		"fields": [{
	          "numClicks": {
	            "sum": "numEvents"
	          }
	        }, {
	        	"minutes": {
	        		"sum": "numMinutes"
	        	}
	        }]
    	}
    },{
      "useragent": {
        "userAgent": "userAgent"
      }
    },{
      "select": {
       "accountId": "accountId",
        "featureId": "featureId",
        "browser": "userAgent.name",
        "visitorId": "visitorId",
    	"numClicks": "numClicks",
    	"minutes": "minutes"
      }
    }],
    "requestId": "featureEvent-day-summary"
  }
}
