{
  "response": {
    "mimeType": "application/json"
  },
  "request": {
    "name": "features-detail",
    "pipeline": [{
      "source": {
        "features": null
      }
    }, {
      "eval": {
        "featureId": "id",
        "lastUpdatedTimestamp": "formatTime(`2006-01-02 15:04:05-07:00`, lastUpdatedAt)"
      }
    }, {
    	"select": {
    		"featureId": "featureId",
    		"elementPathRules": "elementPathRules",
    		"group": "group.name",
    		"kind": "kind",
    		"lastUpdatedTimestamp": "lastUpdatedTimestamp",
    		"featureName": "name",
    		"pageId": "pageId"
    	}
    }],
    "requestId": "features-detail"
  }
}
