{
  "$schema": "../../node_modules/ng-packagr/ng-package.schema.json",
  "dest": "../../dist/dfx-bootstrap-table",
  "lib": {
    "entryFile": "src/public-api.ts"
  },
  "assets": ["./styles/**/*.scss"]
}
