<!DOCTYPE svg PUBLIC "-//W3C//DTD SVG 1.1//EN" "http://www.w3.org/Graphics/SVG/1.1/DTD/svg11.dtd">
<!-- Uploaded to: SVG Repo, www.svgrepo.com, Transformed by: SVG Repo Mixer Tools -->
<svg fill="#EFA00B" width="800px" height="800px" viewBox="0 0 1920 1920" xmlns="http://www.w3.org/2000/svg" stroke="#EFA00B">
<g id="SVGRepo_bgCarrier" stroke-width="0"/>
<g id="SVGRepo_tracerCarrier" stroke-linecap="round" stroke-linejoin="round"/>
<g id="SVGRepo_iconCarrier"> <path d="M1556.611 1920c-54.084 0-108.168-20.692-149.333-61.857L740.095 1190.96c-198.162 41.712-406.725-19.269-550.475-163.019C14.449 852.771-35.256 582.788 65.796 356.27l32.406-72.696 390.194 390.193c24.414 24.305 64.266 24.305 88.68 0l110.687-110.686c11.824-11.934 18.283-27.59 18.283-44.34 0-16.751-6.46-32.516-18.283-44.34L297.569 84.207 370.265 51.8C596.893-49.252 866.875.453 1041.937 175.515c155.026 155.136 212.833 385.157 151.851 594.815l650.651 650.651c39.961 39.852 61.967 92.95 61.967 149.443 0 56.383-22.006 109.482-61.967 149.334l-138.275 138.385c-41.275 41.165-95.36 61.857-149.553 61.857Z" fill-rule="evenodd"/> </g>
</svg>