<!DOCTYPE svg PUBLIC "-//W3C//DTD SVG 1.1//EN" "http://www.w3.org/Graphics/SVG/1.1/DTD/svg11.dtd">
<!-- Uploaded to: SVG Repo, www.svgrepo.com, Transformed by: SVG Repo Mixer Tools -->
<svg width="800px" height="800px" viewBox="0 0 32 32" version="1.1" xmlns="http://www.w3.org/2000/svg" xmlns:xlink="http://www.w3.org/1999/xlink" xmlns:sketch="http://www.bohemiancoding.com/sketch/ns" fill="#000000">
<g id="SVGRepo_bgCarrier" stroke-width="0"/>
<g id="SVGRepo_tracerCarrier" stroke-linecap="round" stroke-linejoin="round"/>
<g id="SVGRepo_iconCarrier"> <title>comment 3</title> <desc>Created with Sketch Beta.</desc> <defs> </defs> <g id="Page-1" stroke="none" stroke-width="1" fill="none" fill-rule="evenodd" sketch:type="MSPage"> <g id="Icon-Set-Filled" sketch:type="MSLayerGroup" transform="translate(-207.000000, -257.000000)" fill="#EFA00B"> <path d="M231,273 C229.896,273 229,272.104 229,271 C229,269.896 229.896,269 231,269 C232.104,269 233,269.896 233,271 C233,272.104 232.104,273 231,273 L231,273 Z M223,273 C221.896,273 221,272.104 221,271 C221,269.896 221.896,269 223,269 C224.104,269 225,269.896 225,271 C225,272.104 224.104,273 223,273 L223,273 Z M215,273 C213.896,273 213,272.104 213,271 C213,269.896 213.896,269 215,269 C216.104,269 217,269.896 217,271 C217,272.104 216.104,273 215,273 L215,273 Z M223,257 C214.164,257 207,263.269 207,271 C207,275.419 209.345,279.354 213,281.919 L213,289 L220.009,284.747 C220.979,284.907 221.977,285 223,285 C231.836,285 239,278.732 239,271 C239,263.269 231.836,257 223,257 L223,257 Z" id="comment-3" sketch:type="MSShapeGroup"> </path> </g> </g> </g>
</svg>