{
  "repo": {
    "name": {
      "en-US": "Dan electronics"
    },
    "description": {
      "en-US": "This is a repository of apps to be used with F-Droid. Applications in this repository are either official binaries built by the original application developers, or are binaries built from source by the admin of f-droid.org using the tools on https://gitlab.com/fdroid."
    },
    "icon": {
      "en-US": {
        "name": "/icons/icon.png",
        "sha256": "7b8e410f1692c3bb11ad543092037c1be48f76dfdc24cb4228c5ea5a2f605987",
        "size": 1113
      }
    },
    "address": "https://main-dankalinin-gitlab-pages-ab0163631732bce931bc3be4a349c7e5e6.gitlab.io/en/fdroid/repo",
    "timestamp": 1713133884000
  },
  "packages": {
    "a.intercom": {
      "metadata": {
        "added": 1713133884000,
        "categories": [
          "fdroid"
        ],
        "lastUpdated": 1713133884000,
        "authorName": "Dan electronics",
        "name": {
          "en-US": "Intercom"
        },
        "description": {
          "en-US": "Bug fixes\nUI improvements\nAdded new styles"
        },
        "preferredSigner": "c806c29ade915c4d1d749d42b79b6a714996f744b28970d551a493bb09b0ed6a"
      },
      "versions": {
        "7853bcf9e209788011f1bee276e90af8158a1aafd2cad9cfd7786beda5db3968": {
          "added": 1713133884000,
          "file": {
            "name": "/a.intercom_2.apk",
            "sha256": "7853bcf9e209788011f1bee276e90af8158a1aafd2cad9cfd7786beda5db3968",
            "size": 134452324
          },
          "manifest": {
            "nativecode": [
              "arm64-v8a",
              "armeabi-v7a"
            ],
            "versionName": "1.1",
            "versionCode": 2,
            "features": [
              {
                "name": "android.hardware.usb.host"
              }
            ],
            "usesSdk": {
              "minSdkVersion": 26,
              "targetSdkVersion": 28
            },
            "signer": {
              "sha256": [
                "c806c29ade915c4d1d749d42b79b6a714996f744b28970d551a493bb09b0ed6a"
              ]
            },
            "usesPermission": [
              {
                "name": "android.permission.INTERNET"
              },
              {
                "name": "android.permission.RECORD_AUDIO"
              },
              {
                "name": "android.permission.FOREGROUND_SERVICE"
              },
              {
                "name": "android.permission.WAKE_LOCK"
              },
              {
                "name": "android.permission.CHANGE_WIFI_MULTICAST_STATE"
              },
              {
                "name": "android.permission.VIBRATE"
              },
              {
                "name": "android.permission.USE_FULL_SCREEN_INTENT"
              },
              {
                "name": "android.permission.CAMERA"
              },
              {
                "name": "android.permission.POST_NOTIFICATIONS"
              },
              {
                "name": "android.permission.MODIFY_AUDIO_SETTINGS"
              },
              {
                "name": "android.permission.REQUEST_INSTALL_PACKAGES"
              },
              {
                "name": "android.permission.ACCESS_NETWORK_STATE"
              },
              {
                "name": "com.google.android.c2dm.permission.RECEIVE"
              }
            ]
          }
        }
      }
    }
  }
}