{
  "timestamp": 1713134998000,
  "version": 20002,
  "index": {
    "name": "/index-v2.json",
    "sha256": "1d6381bc2613bb790a6de8a7065c35164cb9f70f950c21d74ceaff2bec8e3ac2",
    "size": 3447,
    "numPackages": 1
  },
  "diffs": {
    "1710546471000": {
      "name": "/diff/1710546471000.json",
      "sha256": "5777da4834a89f11b837ed3e9d8b85fc8ddf88fc4475cbf30787e36b5e9e9aed",
      "size": 2744,
      "numPackages": 2
    },
    "1710547985000": {
      "name": "/diff/1710547985000.json",
      "sha256": "bd6f721925826159e423bd33c4ca54af19b6ae6568142029a39d23bf2f41c2dc",
      "size": 2644,
      "numPackages": 2
    },
    "1713104874000": {
      "name": "/diff/1713104874000.json",
      "sha256": "bf548ef4d6da34675b0a13e08dc4ec2cc67a798f63b603e40bbea980c6029027",
      "size": 2650,
      "numPackages": 1
    },
    "1713106305000": {
      "name": "/diff/1713106305000.json",
      "sha256": "bf548ef4d6da34675b0a13e08dc4ec2cc67a798f63b603e40bbea980c6029027",
      "size": 2650,
      "numPackages": 1
    },
    "1713106383000": {
      "name": "/diff/1713106383000.json",
      "sha256": "bf548ef4d6da34675b0a13e08dc4ec2cc67a798f63b603e40bbea980c6029027",
      "size": 2650,
      "numPackages": 1
    },
    "1713106601000": {
      "name": "/diff/1713106601000.json",
      "sha256": "5c4573a9a8767f9b1df954fc67e37195f313d4e59b50f974f63a163512b5e6a6",
      "size": 2548,
      "numPackages": 1
    },
    "1713106651000": {
      "name": "/diff/1713106651000.json",
      "sha256": "bf548ef4d6da34675b0a13e08dc4ec2cc67a798f63b603e40bbea980c6029027",
      "size": 2650,
      "numPackages": 1
    },
    "1713107067000": {
      "name": "/diff/1713107067000.json",
      "sha256": "7c266f92c98e7edb067cdaa23e5e3a5f5ca578946ddffdbfcb4eb8004f921dc8",
      "size": 2609,
      "numPackages": 1
    },
    "1713107084000": {
      "name": "/diff/1713107084000.json",
      "sha256": "7c266f92c98e7edb067cdaa23e5e3a5f5ca578946ddffdbfcb4eb8004f921dc8",
      "size": 2609,
      "numPackages": 1
    },
    "1713133884000": {
      "name": "/diff/1713133884000.json",
      "sha256": "21b728d71c745093d9a9a655be111b99ecec00f63104c445da060d7039b516c5",
      "size": 2507,
      "numPackages": 1
    }
  }
}