{
  "repo": {
    "name": {
      "en-US": "Dan electronics"
    },
    "description": {
      "en-US": "This is a repository of apps to be used with F-Droid. Applications in this repository are either official binaries built by the original application developers, or are binaries built from source by the admin of f-droid.org using the tools on https://gitlab.com/fdroid."
    },
    "icon": {
      "en-US": {
        "name": "/icons/icon.png",
        "sha256": "9cdf004bc8fafecb04d38c26bf20a09666bbc882743590494f87051273919ca7",
        "size": 1096
      }
    },
    "address": "https://main-dankalinin-gitlab-pages-ab0163631732bce931bc3be4a349c7e5e6.gitlab.io/ru/fdroid/repo",
    "timestamp": 1710547970000
  },
  "packages": {
    "a.intercom": {
      "metadata": {
        "added": 1710547968000,
        "categories": [
          "fdroid"
        ],
        "lastUpdated": 1710547968000,
        "authorName": "Dan electronics",
        "name": {
          "en-US": "Домофон"
        },
        "description": {
          "en-US": "Исправления и улучшения"
        },
        "preferredSigner": "c806c29ade915c4d1d749d42b79b6a714996f744b28970d551a493bb09b0ed6a"
      },
      "versions": {
        "71f2913fcb25ca9e50c6b45e640e3bdf6509e168e90a34126ae2113e485f078a": {
          "added": 1710547968000,
          "file": {
            "name": "/a.intercom_1.apk",
            "sha256": "71f2913fcb25ca9e50c6b45e640e3bdf6509e168e90a34126ae2113e485f078a",
            "size": 134366492
          },
          "manifest": {
            "nativecode": [
              "arm64-v8a",
              "armeabi-v7a"
            ],
            "versionName": "1.0",
            "versionCode": 1,
            "features": [
              {
                "name": "android.hardware.usb.host"
              }
            ],
            "usesSdk": {
              "minSdkVersion": 26,
              "targetSdkVersion": 28
            },
            "signer": {
              "sha256": [
                "c806c29ade915c4d1d749d42b79b6a714996f744b28970d551a493bb09b0ed6a"
              ]
            },
            "usesPermission": [
              {
                "name": "android.permission.INTERNET"
              },
              {
                "name": "android.permission.RECORD_AUDIO"
              },
              {
                "name": "android.permission.FOREGROUND_SERVICE"
              },
              {
                "name": "android.permission.WAKE_LOCK"
              },
              {
                "name": "android.permission.CHANGE_WIFI_MULTICAST_STATE"
              },
              {
                "name": "android.permission.VIBRATE"
              },
              {
                "name": "android.permission.USE_FULL_SCREEN_INTENT"
              },
              {
                "name": "android.permission.CAMERA"
              },
              {
                "name": "android.permission.POST_NOTIFICATIONS"
              },
              {
                "name": "android.permission.MODIFY_AUDIO_SETTINGS"
              },
              {
                "name": "android.permission.REQUEST_INSTALL_PACKAGES"
              },
              {
                "name": "android.permission.ACCESS_NETWORK_STATE"
              },
              {
                "name": "com.google.android.c2dm.permission.RECEIVE"
              }
            ]
          }
        }
      }
    },
    "dan.electronics.kiosk": {
      "metadata": {
        "added": 1710547969000,
        "categories": [
          "fdroid"
        ],
        "lastUpdated": 1710547970000,
        "name": {
          "en-US": "Kiosk"
        },
        "preferredSigner": "c806c29ade915c4d1d749d42b79b6a714996f744b28970d551a493bb09b0ed6a"
      },
      "versions": {
        "50e0800f688a02118c8f5f4dc6f278426624fce2622ebee40a07abf596318034": {
          "added": 1710547969000,
          "file": {
            "name": "/dan.electronics.kiosk_101.apk",
            "sha256": "50e0800f688a02118c8f5f4dc6f278426624fce2622ebee40a07abf596318034",
            "size": 11483536
          },
          "manifest": {
            "versionName": "1.0",
            "versionCode": 101,
            "usesSdk": {
              "minSdkVersion": 26,
              "targetSdkVersion": 33
            },
            "signer": {
              "sha256": [
                "c806c29ade915c4d1d749d42b79b6a714996f744b28970d551a493bb09b0ed6a"
              ]
            },
            "usesPermission": [
              {
                "name": "android.permission.REQUEST_INSTALL_PACKAGES"
              },
              {
                "name": "android.permission.CAMERA"
              },
              {
                "name": "android.permission.INTERNET"
              }
            ]
          }
        },
        "84bf504f4d742f123f52f737d074a27c9a3356d20f7f4df1f64748b595c211a6": {
          "added": 1710547970000,
          "file": {
            "name": "/dan.electronics.kiosk_89.apk",
            "sha256": "84bf504f4d742f123f52f737d074a27c9a3356d20f7f4df1f64748b595c211a6",
            "size": 11483532
          },
          "manifest": {
            "versionName": "1.0",
            "versionCode": 89,
            "usesSdk": {
              "minSdkVersion": 26,
              "targetSdkVersion": 33
            },
            "signer": {
              "sha256": [
                "c806c29ade915c4d1d749d42b79b6a714996f744b28970d551a493bb09b0ed6a"
              ]
            },
            "usesPermission": [
              {
                "name": "android.permission.REQUEST_INSTALL_PACKAGES"
              },
              {
                "name": "android.permission.CAMERA"
              },
              {
                "name": "android.permission.INTERNET"
              }
            ]
          }
        },
        "aa61582d163926173862bf0e212e04fe92ee33883fd7c5349b49da2ee44e0655": {
          "added": 1710547969000,
          "file": {
            "name": "/dan.electronics.kiosk_20.apk",
            "sha256": "aa61582d163926173862bf0e212e04fe92ee33883fd7c5349b49da2ee44e0655",
            "size": 11483529
          },
          "manifest": {
            "versionName": "1.0",
            "versionCode": 20,
            "usesSdk": {
              "minSdkVersion": 26,
              "targetSdkVersion": 33
            },
            "signer": {
              "sha256": [
                "c806c29ade915c4d1d749d42b79b6a714996f744b28970d551a493bb09b0ed6a"
              ]
            },
            "usesPermission": [
              {
                "name": "android.permission.REQUEST_INSTALL_PACKAGES"
              },
              {
                "name": "android.permission.CAMERA"
              },
              {
                "name": "android.permission.INTERNET"
              }
            ]
          }
        }
      }
    }
  }
}