%YAML 1.1
%TAG !u! tag:unity3d.com,2011:
--- !u!1045 &1
EditorBuildSettings:
  m_ObjectHideFlags: 0
  serializedVersion: 2
  m_Scenes:
  - enabled: 1
    path: Assets/Scenes/Derrota.unity
    guid: d853df3a31bf37d4bb9c4051b4adca73
  - enabled: 1
    path: Assets/Scenes/Juego.unity
    guid: 9fc0d4010bbf28b4594072e72b8655ab
  - enabled: 1
    path: Assets/Scenes/Victoria.unity
    guid: 118a837cbe47dc34fa5fd4f0d96e9590
  m_configObjects: {}
