vingt_pond,taux_effort_sans_aide_annee_sim,taux_effort_avecAPA_annee_sim,taux_effort_annee_sim,taux_effort_bis_annee_sim
"[0,869)",65.3948383045887,0.0615425019353309,0.0307712509676654,8.6534471154541
"[869,933)",55.2037881985505,1.2690254049608,0.634512702480399,10.1270328290071
"[933,1003)",51.0981787145015,2.17456497823308,1.08728248911654,10.3030967693491
"[1003,1068)",46.4046469661672,2.9253773346793,1.46268866733965,10.2098718653022
"[1068,1133)",43.380640382996,3.60444478441045,1.80222239220523,10.2704847862907
"[1133,1192)",40.4898718329336,4.18213606663738,2.09106803331869,10.2816440989724
"[1192,1252)",38.059810746401,4.66430500126982,2.33215250063491,10.2306639254528
"[1252,1318)",35.6862578155739,5.12388638700596,2.56194319350298,10.1106733893618
"[1318,1387)",33.5309956324529,5.59374221094761,2.7968711054738,10.2413156211598
"[1387,1463)",31.2827377029794,6.03056499061324,3.01528249530662,10.0363808169717
"[1463,1550)",29.4084390535171,6.53035239971985,3.26517619985993,9.86526275575262
"[1550,1653)",27.7051665566874,7.10946236713688,3.55473118356844,9.82670761280274
"[1653,1776)",25.9065647300131,7.75442218018985,3.87721109009493,9.70579179499923
"[1776,1933)",24.1111518028145,8.51349490600676,4.25674745300338,9.71005653638582
"[1933,2161)",21.9405504746321,9.44774395756154,4.72387197878077,9.6267811106531
"[2161,2579)",19.5830648589255,11.0339138847369,5.51695694236844,9.72653298919363
2579 et plus,17.1541596017808,14.3018139044498,7.2121752316193,9.90561327323646
