year,Nb_analyses,count
2014,11,69445
2014,72,2539
2015,87,1645
2011,222,62
2016,218,81
2015,318,32
2008,176,34
2013,463,9
2010,289,24
2015,456,10
2015,412,7
2013,541,3
2010,664,2
2010,431,5
2014,691,2
2016,665,2
2009,846,1
2016,93,1232
2011,38,8437
2016,6,46344
2012,226,69
2012,293,25
2010,576,4
2010,345,14
2016,489,9
2012,1886,1
2010,581,1
2010,564,1
2009,682,1
2014,761,2
2015,726,1
2009,1208,1
2009,875,1
2015,799,1
2012,20,32200
2012,67,2750
2016,656,2
2011,215,71
2012,171,171
2009,734,1
2014,431,8
2011,487,5
2010,626,3
2008,591,1
2014,1334,1
2013,666,1
2013,678,2
2013,895,2
2016,78,1977
2016,1,2635
2010,24,21108
2009,153,142
2008,107,227
2011,187,105
2010,277,24
2016,265,56
2014,192,122
2013,325,25
2010,1091,1
2011,576,1
2008,239,6
2013,872,1
2009,408,3
2013,48,6336
2008,52,2540
2014,232,65
2011,635,2
2009,722,1
2014,766,1
2015,75,2288
2014,117,660
2009,429,7
2008,97,355
2009,192,66
2010,265,32
2009,274,15
2010,229,46
2012,582,2
2009,357,4
2016,501,4
2010,684,3
2010,550,2
2013,845,1
2011,661,1
2008,343,3
2015,1549,1
2013,785,1
2015,777,1
2015,93,1328
2014,287,50
2015,477,11
2008,214,21
2012,502,6
2009,279,14
2015,431,12
2014,566,5
2011,617,1
2009,449,2
2008,539,1
2015,167,216
2011,314,17
2016,165,197
2016,413,12
2016,272,48
2011,856,1
2009,683,1
2009,361,5
2015,602,2
2013,485,6
2009,527,3
2009,422,3
2011,1614,1
2010,643,1
2014,3588,1
2012,66,3025
2008,121,160
2012,547,2
2016,273,48
2011,257,44
2010,361,7
2016,417,13
2008,384,2
2011,480,3
2012,1348,1
2010,2651,1
2014,589,2
2012,960,1
2010,1038,2
2008,714,1
2014,850,2
2015,906,1
2014,10,64891
2013,56,4412
2011,33,11648
2016,222,86
2013,183,175
2009,180,90
2015,552,3
2015,513,7
2014,504,8
2012,874,1
2013,486,4
2012,1090,3
2016,878,1
2015,187,128
2010,130,329
2015,807,1
2011,213,62
2016,300,40
2015,544,1
2015,472,7
2008,299,7
2015,459,5
2011,749,1
2009,517,1
2013,875,3
2010,479,2
2012,1145,1
2009,725,1
2016,54,4934
2016,13,66645
2015,326,29
2009,87,1005
2014,110,743
2011,165,180
2009,112,384
2014,698,3
2016,512,5
2011,623,2
2011,454,13
2009,796,1
2015,608,2
2011,553,2
2013,737,1
2009,744,1
2011,52,4456
2015,70,2718
2009,19,28396
2011,171,137
2010,356,8
2013,239,58
2012,352,22
2008,181,32
2015,307,22
2012,735,1
2009,651,1
2014,775,1
2009,563,1
2009,584,1
2010,31,12152
2013,145,318
2013,102,910
2013,98,1028
2012,83,1577
2016,188,159
2010,166,123
2011,519,4
2011,201,75
2010,744,2
2014,567,3
2012,652,2
2015,1495,1
2012,1248,1
2011,581,2
2011,1320,1
2013,57,4193
2015,79,1926
2015,125,519
2010,216,51
2014,179,167
2009,142,187
2014,520,6
2008,116,203
2013,448,12
2016,657,2
2013,405,8
2016,470,3
2008,305,4
2016,1608,1
2009,828,1
2011,445,4
2012,879,1
2011,468,3
2011,1111,1
2009,883,1
2011,1492,1
2015,1095,1
2015,1087,1
2010,149,182
2008,80,652
2014,265,53
2012,232,69
2012,224,73
2012,437,4
2010,514,2
2011,564,1
2008,561,1
2009,533,1
2015,2467,1
2013,21,29854
2014,198,119
2010,73,1928
2013,200,111
2015,347,28
2013,291,37
2015,491,6
2008,260,9
2013,334,14
2010,321,14
2014,635,1
2008,766,1
2012,14,58665
2015,119,630
2015,344,23
2012,384,14
2013,478,9
2015,433,9
2008,209,12
2008,325,5
2010,796,1
2016,1012,1
2014,60,3888
2011,194,100
2011,310,27
2012,294,24
2016,418,13
2009,324,12
2012,635,3
2016,388,7
2013,930,1
2016,107,800
2014,17,43377
2011,14,55487
2014,77,1988
2012,528,2
2009,163,112
2013,1087,1
2016,526,5
2014,734,2
2016,503,7
2014,470,5
2008,685,1
2013,819,2
2015,492,7
2016,1276,1
2008,730,1
2009,498,3
2016,779,1
2008,599,1
2009,566,1
2013,76,1951
2011,77,1731
2014,125,514
2008,100,302
2008,126,140
2016,171,178
2014,342,28
2014,320,27
2008,192,24
2008,187,23
2012,740,2
2009,484,2
2015,784,2
2011,351,13
2015,1271,1
2016,1074,1
2014,1376,1
2014,1223,1
2012,749,1
2015,78,2077
2016,161,230
2013,322,18
2009,177,77
2009,1650,1
2015,442,9
2009,253,22
2011,410,10
2012,466,4
2015,534,1
2010,615,1
2011,414,5
2008,496,1
2008,575,1
2010,730,1
2012,651,2
2016,65,3097
2011,252,44
2010,136,268
2011,158,191
2016,167,193
2016,284,48
2011,182,132
2015,217,85
2011,451,9
2009,301,8
2013,733,1
2012,589,4
2011,664,2
2013,961,1
2009,464,3
2011,740,1
2009,1067,1
2016,27,20180
2012,11,69652
2013,69,2562
2012,122,524
2010,118,421
2008,180,44
2015,435,13
2015,865,2
2012,274,40
2016,285,43
2015,249,64
2012,638,1
2016,731,1
2016,450,8
2011,552,1
2016,241,46
2013,796,3
2010,1574,1
2012,974,2
2016,994,1
2009,758,1
2014,620,1
2016,879,1
2011,12,69654
2015,162,197
2011,99,866
2009,156,112
2011,234,32
2014,645,4
2013,451,14
2013,280,39
2013,273,46
2013,848,1
2016,699,2
2013,726,3
2015,742,2
2012,653,2
2015,1431,1
2009,113,430
2009,16,39530
2013,585,3
2011,185,109
2010,727,1
2008,406,1
2015,1089,1
2010,460,1
2016,21,30908
2013,148,277
2016,231,70
2014,278,43
2015,772,2
2014,343,28
2015,486,6
2010,631,1
2008,275,8
2016,427,10
2013,792,2
2011,663,1
2015,46,6775
2008,41,4346
2013,170,157
2010,212,52
2013,281,49
2008,594,1
2009,193,62
2013,2870,1
2016,371,14
2012,1686,1
2009,451,6
2013,609,3
2008,453,3
2009,598,1
2013,34,12306
2014,178,178
2012,102,952
2011,85,1350
2014,196,119
2010,163,145
2016,259,55
2013,976,1
2012,926,1
2011,486,3
2010,571,6
2010,407,4
2012,405,9
2011,457,9
2014,728,3
2010,782,1
2014,64,3340
2008,89,493
2008,285,9
2015,451,7
2014,570,4
2011,392,11
2010,409,8
2014,647,4
2014,358,18
2014,405,12
2009,560,5
2015,733,1
2013,520,4
2010,1073,1
2009,1102,1
2012,657,1
2008,12,52017
2013,108,776
2009,106,560
2009,85,1084
2009,122,316
2014,306,30
2008,377,5
2014,331,21
2009,668,1
2013,679,2
2014,677,3
2014,851,2
2008,753,1
2016,932,1
2014,597,2
2011,790,1
2015,1516,1
2016,160,230
2016,53,5020
2014,43,7653
2011,368,13
2008,147,80
2011,684,1
2011,322,11
2008,686,1
2009,512,1
2016,95,1143
2013,39,9366
2012,22,26348
2012,52,4987
2012,110,703
2011,221,70
2015,141,355
2013,240,57
2012,447,10
2015,269,43
2015,558,7
2009,259,11
2013,742,3
2011,604,3
2016,972,1
2014,69,2793
2008,79,774
2011,223,54
2015,219,86
2010,400,7
2010,411,4
2010,262,19
2013,436,11
2014,455,10
2016,456,6
2011,624,1
2016,626,2
2010,783,2
2016,46,6883
2014,231,64
2013,166,191
2013,278,39
2009,187,76
2010,239,30
2012,439,7
2012,279,32
2016,385,16
2016,680,2
2013,250,57
2008,765,1
2012,369,12
2009,1006,1
2012,703,1
2012,765,1
2009,684,1
2013,97,1079
2008,171,34
2011,460,7
2015,298,31
2010,424,4
2016,563,4
2010,517,4
2014,709,3
2016,869,1
2010,741,1
2014,736,2
2015,48,6341
2015,234,77
2014,113,706
2010,228,54
2012,310,27
2014,402,11
2014,274,46
2013,855,2
2011,524,2
2014,517,1
2011,817,1
2013,490,4
2011,778,1
2016,766,1
2008,783,1
2015,34,12371
2010,25,18546
2009,45,5135
2013,78,2040
2013,135,378
2008,512,3
2012,1435,1
2010,734,2
2012,482,4
2014,557,7
2016,8,51136
2015,67,2834
2014,75,2264
2009,331,17
2012,300,28
2016,452,9
2009,378,4
2011,290,40
2009,497,3
2012,882,2
2016,576,3
2008,321,8
2008,971,1
2015,1224,1
2015,1525,1
2008,717,1
2013,7,45682
2008,24,14461
2013,201,103
2013,287,33
2008,189,24
2011,153,196
2016,408,11
2015,332,26
2014,636,2
2010,218,45
2008,499,2
2010,339,14
2015,578,4
2012,477,4
2012,904,1
2014,516,4
2013,1009,1
2016,61,3592
2013,87,1498
2011,137,304
2015,221,87
2012,270,47
2012,244,61
2011,144,266
2011,395,7
2008,323,10
2014,458,9
2014,551,3
2015,375,11
2014,594,3
2014,433,9
2011,1022,1
2014,692,2
2012,1053,1
2011,253,32
2011,172,136
2009,167,101
2013,187,134
2008,149,64
2016,302,24
2015,203,99
2015,310,33
2015,279,67
2009,292,18
2016,426,12
2013,413,10
2012,297,21
2013,645,5
2013,415,10
2016,726,4
2008,604,1
2014,793,2
2012,756,2
2010,452,2
2014,1296,1
2008,315,4
2012,51,5196
2011,50,4825
2012,133,363
2009,161,124
2014,208,111
2010,278,25
2012,265,45
2015,519,5
2014,302,28
2016,483,2
2014,614,1
2010,297,13
2010,388,7
2008,460,2
2015,655,3
2011,726,1
2013,610,3
2008,312,6
2015,715,1
2012,1280,1
2014,786,1
2014,1057,1
2014,767,1
2015,835,2
2013,103,875
2011,148,226
2015,128,503
2009,266,17
2009,398,2
2012,189,130
2013,713,2
2014,363,19
2013,835,1
2009,793,1
2008,595,1
2016,2179,1
2008,62,1549
2016,113,689
2014,209,100
2016,301,35
2012,268,38
2009,176,90
2014,229,60
2012,864,1
2011,432,3
2008,273,9
2014,535,2
2013,582,2
2010,522,1
2013,539,2
2008,540,1
2015,743,1
2013,10,64419
2013,28,18211
2014,70,2583
2012,230,73
2012,139,317
2011,116,517
2009,90,941
2016,141,310
2012,77,1917
2014,149,302
2010,162,155
2015,254,54
2014,388,14
2014,477,5
2010,488,3
2014,980,1
2016,756,2
2008,427,3
2012,1402,1
2011,439,1
2010,74,1775
2011,163,171
2014,384,16
2009,226,38
2015,503,7
2016,219,112
2013,336,16
2013,365,22
2013,303,20
2011,506,4
2016,390,13
2015,1436,2
2014,615,4
2013,112,658
2013,91,1325
2015,195,133
2015,124,562
2016,152,289
2016,249,66
2010,221,58
2014,375,21
2014,266,51
2010,200,82
2011,303,29
2014,414,14
2009,1647,1
2012,534,7
2010,841,1
2012,469,6
2011,448,8
2016,714,1
2010,451,7
2012,767,2
2010,634,3
2009,372,4
2013,574,3
2011,788,1
2012,601,1
2014,1774,1
2008,634,2
2013,18,39323
2014,82,1735
2010,203,63
2012,202,98
2010,219,50
2013,304,21
2011,265,28
2016,256,54
2012,533,4
2013,724,1
2012,394,9
2011,813,1
2016,757,2
2014,906,1
2014,41,8293
2014,239,62
2014,197,126
2010,254,30
2012,558,5
2016,558,4
2010,402,9
2009,711,2
2016,794,1
2014,771,1
2013,980,1
2009,573,1
2015,1076,1
2008,38,5130
2011,376,17
2015,193,124
2012,271,36
2014,295,36
2010,342,8
2014,572,2
2013,549,7
2014,571,9
2015,539,6
2011,798,1
2015,603,1
2011,508,1
2015,205,112
2008,1,58379
2015,107,824
2011,188,101
2011,132,352
2009,132,246
2012,337,22
2016,379,20
2016,326,24
2008,198,25
2015,405,19
2010,453,2
2015,945,2
2013,510,8
2016,625,2
2012,737,2
2008,481,3
2012,946,1
2016,16,51065
2016,429,17
2011,218,53
2008,217,14
2013,536,5
2013,417,11
2009,341,8
2010,627,2
2016,659,2
2012,954,1
2016,139,354
2015,244,68
2016,354,16
2011,227,57
2015,294,35
2012,432,13
2008,262,10
2014,658,3
2015,576,5
2013,688,2
2013,2293,1
2010,596,3
2016,24,25678
2013,47,6127
2008,68,1220
2013,221,64
2015,277,42
2013,362,23
2016,591,7
2016,351,15
2008,316,5
2010,523,3
2015,3660,1
2014,609,4
2015,482,2
2012,1015,1
2016,101,945
2014,191,131
2011,208,99
2016,195,127
2014,168,185
2008,186,31
2014,616,1
2012,822,3
2008,320,4
2014,626,1
2012,576,1
2010,57,3421
2012,193,108
2012,123,496
2014,280,39
2015,678,4
2010,213,51
2010,357,8
2013,543,3
2014,479,4
2014,681,3
2015,399,10
2014,588,3
2015,365,18
2009,339,5
2011,1076,1
2015,597,2
2011,632,1
2015,830,2
2010,722,1
2016,730,1
2016,40,9146
2011,61,3121
2009,216,34
2016,556,2
2010,468,4
2010,752,1
2013,892,1
2016,460,6
2015,409,12
2010,469,3
2011,679,1
2015,1628,1
2016,631,1
2009,41,6112
2013,95,1126
2016,150,285
2012,252,47
2014,547,5
2016,444,10
2009,404,2
2009,293,18
2016,514,2
2009,298,11
2008,281,6
2012,779,1
2009,483,5
2008,412,3
2011,294,18
2013,433,5
2008,471,1
2014,710,2
2016,667,2
2016,1241,1
2016,628,2
2016,110,761
2009,84,1134
2011,151,213
2010,249,31
2010,236,34
2014,273,39
2012,491,5
2013,568,7
2009,386,8
2009,394,7
2008,300,6
2014,506,7
2011,918,1
2015,843,2
2014,714,1
2015,1410,1
2010,415,3
2009,510,2
2015,18,40007
2009,152,138
2013,127,450
2008,131,118
2009,159,118
2008,163,43
2010,242,36
2014,473,8
2012,306,23
2012,441,5
2013,557,6
2016,1039,1
2014,27,19792
2015,15,55493
2014,160,219
2012,136,374
2009,169,95
2016,1734,2
2009,391,8
2008,104,272
2011,694,1
2016,410,12
2011,367,12
2014,487,4
2012,363,19
2010,1294,1
2016,477,6
2016,733,3
2014,943,1
2016,445,8
2012,1057,1
2015,901,2
2013,1163,2
2013,759,2
2011,35,10053
2015,161,222
2014,120,580
2013,324,18
2008,724,1
2014,371,15
2010,570,3
2015,461,5
2011,560,3
2008,393,3
2011,512,7
2011,44,6334
2014,79,2014
2008,135,126
2016,178,173
2016,363,26
2011,293,17
2015,366,20
2015,340,23
2010,2382,1
2008,226,17
2009,365,4
2013,597,2
2014,822,1
2013,619,1
2012,578,5
2008,464,1
2016,770,1
2009,61,2592
2015,81,1848
2012,95,1158
2009,124,310
2014,180,169
2015,389,11
2012,507,8
2013,449,6
2016,411,8
2011,357,11
2012,460,4
2013,434,7
2015,517,9
2010,736,1
2012,448,8
2016,572,2
2014,673,2
2013,675,1
2011,725,1
2012,669,2
2012,744,1
2016,138,361
2012,43,7118
2010,125,393
2015,660,4
2014,312,39
2009,582,1
2014,2195,1
2013,380,10
2010,359,9
2016,515,6
2008,736,1
2013,404,6
2012,950,1
2011,728,1
2011,154,238
2011,118,493
2012,135,384
2014,135,379
2016,291,39
2008,160,51
2013,241,65
2013,242,43
2009,356,10
2013,719,2
2011,708,1
2014,891,2
2010,511,3
2014,643,1
2009,524,1
2010,481,4
2014,858,1
2016,754,2
2013,224,75
2010,240,47
2012,462,6
2015,512,5
2013,812,2
2008,440,3
2012,783,1
2016,105,861
2009,80,1228
2014,94,1196
2009,102,571
2008,96,380
2011,233,45
2009,194,59
2016,244,58
2010,207,58
2013,218,74
2010,303,16
2015,418,9
2009,334,6
2015,1657,1
2016,561,5
2012,493,4
2015,1225,1
2013,650,1
2009,528,2
2010,653,1
2013,863,1
2012,23,24191
2008,18,24566
2012,116,601
2015,180,168
2013,207,95
2011,263,30
2014,359,17
2015,353,20
2016,299,32
2013,522,9
2012,665,1
2015,1113,1
2015,780,1
2015,255,55
2009,57,3054
2015,316,30
2010,84,1258
2009,178,71
2013,171,161
2013,151,240
2012,344,18
2013,332,20
2016,780,1
2011,434,8
2009,313,16
2014,563,4
2014,432,9
2013,607,3
2015,650,1
2015,926,1
2013,684,2
2016,1085,1
2011,671,1
2012,1971,1
2016,122,527
2008,33,7269
2014,93,1302
2015,105,909
2010,150,180
2012,554,5
2012,361,8
2008,1243,1
2013,786,1
2009,1560,1
2008,454,1
2014,1025,1
2016,885,1
2015,390,18
2013,62,3425
2010,23,21347
2008,58,1909
2012,201,94
2012,272,40
2016,1778,1
2010,306,13
2015,1141,2
2009,346,11
2016,481,7
2015,498,1
2013,913,1
2015,560,2
2016,1018,1
2009,829,1
2008,9,59607
2016,132,438
2014,111,758
2012,100,936
2009,69,1984
2014,472,6
2016,471,7
2016,327,21
2013,394,14
2011,2767,1
2015,495,3
2013,504,5
2016,643,1
2013,704,1
2009,827,2
2012,549,1
2011,705,1
2010,182,90
2014,298,37
2009,542,4
2011,270,28
2016,4417,1
2014,604,3
2016,584,2
2011,306,12
2015,3333,1
2014,38,9740
2014,700,3
2008,49,2880
2012,168,163
2015,230,74
2010,234,40
2015,475,3
2012,329,15
2010,285,12
2013,544,5
2013,1187,1
2016,305,39
2014,760,1
2012,368,8
2010,496,3
2012,641,1
2016,378,13
2011,892,3
2015,737,2
2013,933,1
2011,421,6
2009,47,4578
2010,100,735
2009,93,864
2016,261,46
2012,227,70
2013,363,14
2009,416,6
2011,415,10
2012,318,24
2010,674,1
2010,538,3
2014,577,5
2016,664,3
2013,614,3
2015,1559,1
2014,44,7270
2012,17,41470
2009,34,9164
2015,127,471
2014,449,8
2015,174,187
2011,430,8
2009,421,4
2016,211,100
2014,350,24
2014,214,87
2013,521,4
2011,384,12
2011,616,1
2014,440,13
2012,584,3
2008,246,14
2011,571,1
2014,895,2
2009,550,1
2015,580,2
2015,225,86
2013,36,11195
2015,100,1026
2012,311,27
2016,197,135
2016,201,113
2013,114,645
2013,553,4
2009,375,13
2010,389,6
2013,612,4
2015,488,5
2008,508,2
2014,901,2
2009,853,1
2015,1119,1
2010,871,1
2015,211,102
2015,64,3339
2010,33,10964
2013,297,34
2012,150,283
2012,157,237
2011,81,1590
2010,363,12
2010,176,115
2015,432,13
2015,250,52
2014,521,6
2014,357,21
2011,335,11
2010,530,2
2009,2745,1
2010,591,1
2016,86,1536
2014,35,11404
2011,46,5805
2012,184,138
2008,94,407
2016,233,60
2012,192,135
2009,557,3
2008,243,12
2009,179,89
2011,304,18
2009,240,18
2011,770,1
2014,435,7
2011,327,17
2012,590,2
2012,760,2
2016,809,2
2014,1099,1
2015,1432,1
2015,2380,1
2012,973,1
2016,74,2164
2014,16,50234
2012,18,38675
2012,289,27
2008,505,3
2011,496,3
2013,245,61
2011,722,2
2013,248,44
2008,472,1
2014,898,1
2016,544,7
2012,537,5
2011,497,4
2014,540,6
2015,554,2
2010,862,1
2016,924,1
2013,947,1
2010,38,7831
2009,38,7364
2010,75,1785
2015,699,3
2014,256,74
2009,428,5
2010,651,3
2008,249,14
2014,445,11
2010,435,5
2015,553,6
2009,456,2
2013,628,4
2013,655,1
2010,521,5
2008,588,1
2012,128,435
2010,205,59
2013,524,5
2015,677,7
2011,331,15
2010,280,23
2012,542,6
2011,470,2
2012,911,2
2008,531,1
2014,2099,1
2010,681,1
2016,23,25980
2014,47,6333
2009,12,63375
2008,44,3866
2012,160,201
2009,245,26
2015,266,60
2010,282,11
2016,722,1
2012,420,12
2014,602,2
2009,336,3
2015,823,1
2008,26,12190
2014,95,1209
2012,73,2202
2015,231,74
2012,250,55
2015,268,58
2015,430,6
2014,1056,2
2014,378,11
2008,368,6
2016,701,1
2014,601,1
2012,620,1
2009,727,1
2016,119,581
2014,29,16924
2013,52,5020
2013,5,42000
2012,46,6271
2008,34,6826
2015,133,453
2012,74,2030
2013,518,6
2014,590,5
2009,310,7
2015,494,4
2008,533,2
2012,603,4
2009,580,2
2013,615,2
2009,814,1
2008,429,1
2013,620,1
2011,874,1
2015,21,30481
2016,133,369
2012,283,33
2012,149,263
2009,150,142
2014,222,81
2010,383,8
2016,348,13
2011,389,4
2008,238,6
2014,674,2
2012,616,1
2015,640,3
2013,996,1
2016,525,2
2010,552,2
2012,2899,1
2012,723,1
2016,62,3614
2012,16,48050
2012,1421,1
2016,419,12
2013,403,11
2015,649,3
2009,569,2
2008,272,5
2009,1051,1
2011,732,2
2008,4,55685
2014,90,1426
2008,242,16
2014,611,3
2010,535,7
2016,547,9
2011,471,7
2009,1173,1
2014,496,2
2009,764,1
2010,583,1
2008,522,1
2013,1213,1
2014,24,25122
2009,128,253
2009,123,314
2015,705,1
2009,229,38
2011,204,84
2014,260,44
2011,279,32
2014,488,6
2013,1656,1
2014,514,4
2008,365,2
2010,508,2
2015,849,1
2015,915,1
2016,84,1660
2011,21,27312
2013,126,461
2012,79,1771
2015,593,3
2013,212,86
2011,537,6
2016,376,7
2011,992,1
2014,457,6
2011,502,5
2011,551,3
2013,400,13
2015,776,3
2009,781,1
2016,2110,1
2012,837,1
2013,53,4729
2012,4,45421
2009,236,25
2014,145,323
2014,311,26
2016,181,139
2010,433,4
2009,443,2
2016,333,33
2011,464,6
2012,402,16
2012,489,5
2011,574,2
2016,630,1
2016,35,11919
2014,6,50148
2015,281,29
2013,392,7
2015,41,8505
2008,91,458
2013,162,211
2012,370,14
2011,211,64
2009,364,9
2008,370,4
2015,297,34
2009,383,2
2009,233,31
2012,392,10
2012,449,5
2011,493,5
2012,811,1
2011,657,2
2016,734,1
2009,433,1
2013,1022,1
2013,424,18
2012,72,2343
2016,226,90
2013,233,77
2011,82,1542
2011,109,643
2014,204,105
2013,428,12
2010,329,20
2012,287,35
2008,201,25
2016,384,13
2011,544,4
2016,1106,1
2014,776,1
2008,586,1
2010,49,4561
2011,516,6
2013,326,27
2016,220,73
2013,425,11
2009,273,18
2015,335,20
2008,278,12
2009,285,16
2012,812,1
2015,1305,1
2014,927,1
2014,5706,1
2016,47,6354
2014,51,5518
2012,48,5953
2011,155,215
2015,333,29
2015,355,18
2012,254,52
2010,563,4
2013,473,4
2016,622,6
2013,640,2
2012,642,1
2012,860,1
2014,53,4940
2009,83,1147
2009,86,1030
2014,140,344
2014,154,253
2008,206,18
2015,615,3
2013,270,27
2012,280,30
2016,597,2
2009,452,1
2016,527,6
2015,468,5
2013,973,1
2014,782,1
2016,80,1887
2011,140,259
2008,112,206
2016,255,65
2012,257,59
2013,852,2
2013,528,6
2014,276,33
2008,352,2
2013,685,2
2009,555,1
2013,1167,1
2013,195,137
2012,251,46
2013,357,13
2009,317,15
2014,412,10
2013,293,32
2014,1938,1
2014,348,27
2014,787,1
2016,753,1
2011,999,1
2013,457,4
2010,942,1
2012,522,5
2016,81,1800
2013,90,1303
2015,440,17
2012,401,14
2014,869,1
2008,229,13
2015,449,11
2015,1529,1
2010,497,6
2015,661,2
2014,548,2
2016,581,3
2010,670,1
2013,483,2
2009,571,2
2010,791,1
2014,606,1
2015,209,108
2011,19,32036
2010,87,1115
2014,172,175
2014,181,149
2011,277,29
2008,129,99
2010,251,25
2010,247,38
2015,646,3
2009,459,4
2010,255,30
2011,530,4
2008,553,3
2009,445,2
2008,628,1
2014,613,1
2012,50,5175
2010,39,7680
2015,138,407
2008,115,189
2014,718,2
2016,190,132
2008,424,1
2013,269,25
2013,780,3
2016,698,2
2011,514,3
2016,922,1
2011,986,1
2011,924,1
2016,577,2
2011,863,1
2008,417,1
2013,117,571
2011,150,243
2012,207,74
2013,261,46
2008,519,3
2011,745,1
2011,291,17
2015,814,2
2013,668,1
2014,764,2
2010,106,673
2010,194,78
2013,397,7
2016,296,28
2015,289,37
2015,721,2
2014,418,12
2016,1021,1
2008,822,1
2013,813,1
2011,1316,1
2015,942,1
2009,59,2788
2009,136,207
2015,112,756
2010,148,193
2016,185,123
2014,338,28
2016,520,1
2014,285,38
2015,306,29
2013,339,16
2010,551,4
2015,437,7
2012,459,9
2009,551,1
2014,893,2
2010,154,168
2014,401,15
2012,164,197
2014,314,37
2011,248,42
2015,610,6
2012,626,4
2011,600,2
2013,1046,2
2012,1003,1
2011,995,1
2012,1612,1
2012,853,1
2013,1561,1
2009,586,1
2012,59,3762
2010,120,441
2010,17,36913
2009,25,16948
2009,49,4327
2012,98,1038
2010,142,229
2013,177,164
2012,109,725
2013,814,1
2011,397,9
2009,349,5
2016,482,10
2015,700,1
2012,562,5
2010,618,2
2011,719,1
2009,768,1
2013,842,2
2013,41,8064
2013,86,1522
2010,72,1923
2008,106,232
2009,377,8
2011,633,1
2010,642,1
2010,948,1
2010,5,43149
2014,345,17
2013,315,19
2009,189,81
2015,583,5
2014,366,19
2014,385,13
2009,457,5
2011,606,2
2015,483,2
2009,415,2
2012,81,1735
2009,143,183
2014,116,624
2008,164,54
2016,325,27
2012,200,95
2012,267,38
2016,416,10
2010,317,15
2016,454,7
2011,267,34
2011,382,10
2008,399,5
2011,1590,1
2008,444,5
2011,1068,1
2012,571,5
2015,957,1
2016,539,4
2013,356,14
2012,968,1
2012,614,1
2016,19,35914
2010,246,37
2011,411,11
2010,448,5
2008,258,7
2010,353,9
2013,286,32
2015,647,1
2016,854,2
2011,621,1
2011,400,4
2016,3812,1
2015,168,197
2009,170,91
2013,203,114
2010,196,58
2016,629,4
2010,384,10
2012,307,29
2015,738,2
2013,1365,1
2012,644,3
2015,821,1
2016,397,5
2009,986,1
2014,843,2
2015,1014,2
2015,582,1
2016,250,63
2016,2,8425
2012,195,113
2015,213,96
2008,179,34
2015,377,17
2012,683,4
2012,395,18
2016,600,4
2012,409,10
2012,381,19
2009,525,1
2009,278,12
2013,535,3
2010,440,2
2009,1643,1
2015,547,4
2016,803,1
2008,168,54
2014,205,101
2011,278,25
2014,545,2
2011,377,15
2008,319,3
2009,328,9
2010,320,17
2011,651,2
2012,592,4
2014,725,3
2008,621,1
2010,1011,1
2013,554,1
2013,649,1
2016,39,9808
2014,119,604
2015,356,25
2008,156,51
2009,373,5
2009,440,5
2010,657,1
2016,635,1
2015,1839,1
2012,701,1
2010,3,67701
2008,132,116
2016,463,10
2009,96,744
2011,324,18
2010,178,114
2015,368,18
2008,211,18
2011,438,8
2016,705,1
2011,764,1
2015,967,1
2014,721,3
2008,267,9
2011,532,3
2010,652,1
2014,1034,1
2016,147,276
2008,425,5
2013,189,116
2012,112,649
2009,151,117
2011,380,14
2014,305,22
2016,158,225
2016,383,12
2011,1063,1
2008,716,2
2011,577,2
2015,99,1115
2011,96,1049
2014,123,509
2011,309,24
2012,185,136
2016,279,51
2010,264,29
2010,386,12
2013,497,7
2011,691,1
2016,787,1
2016,719,2
2013,755,1
2009,513,1
2010,725,1
2009,669,1
2012,990,1
2016,890,1
2013,916,1
2009,10,65420
2008,56,2093
2015,92,1329
2012,255,33
2011,191,104
2016,1050,1
2013,345,17
2015,1031,1
2016,364,18
2009,411,3
2012,378,7
2011,567,1
2012,878,1
2011,607,2
2008,574,1
2016,638,1
2014,1631,1
2015,827,1
2014,36,11834
2015,66,3139
2009,97,691
2014,211,103
2015,206,104
2014,212,97
2013,323,26
2014,463,7
2013,692,3
2016,389,15
2015,510,5
2012,697,1
2015,1364,1
2015,1200,1
2012,708,1
2015,5,39921
2011,25,19824
2010,66,2413
2014,66,3149
2012,234,65
2013,333,25
2010,199,84
2013,1559,1
2016,182,155
2012,155,219
2016,253,51
2011,341,16
2010,364,13
2016,510,9
2012,433,12
2010,707,2
2015,525,6
2008,501,1
2015,947,1
2011,1224,1
2010,690,1
2015,110,784
2008,155,58
2013,143,303
2010,248,29
2008,656,1
2008,282,8
2014,803,3
2013,526,6
2015,682,2
2009,1849,1
2014,678,1
2015,71,2603
2008,88,538
2010,153,170
2015,401,12
2014,326,24
2013,642,2
2012,970,1
2010,560,1
2009,458,3
2010,531,2
2012,629,1
2013,571,1
2014,808,1
2009,789,1
2016,85,1578
2016,99,1024
2009,28,14037
2010,131,344
2010,509,3
2009,181,81
2009,256,21
2014,216,90
2011,271,31
2013,534,11
2013,533,3
2014,650,4
2015,652,2
2013,1434,1
2011,605,2
2011,903,1
2010,41,6611
2015,132,436
2011,74,1969
2008,215,25
2016,118,575
2014,223,71
2013,237,56
2013,222,92
2010,797,1
2009,291,24
2014,967,2
2008,394,2
2008,218,11
2008,280,10
2013,446,10
2016,507,4
2015,951,1
2009,559,4
2008,909,1
2011,1228,1
2013,29,16338
2011,11,68611
2014,142,319
2015,185,159
2013,246,64
2010,263,24
2015,218,102
2013,350,22
2011,1080,1
2014,519,4
2010,472,4
2008,292,2
2010,620,3
2015,980,1
2016,747,1
2015,657,2
2009,540,1
2009,882,1
2011,774,1
2013,19,34715
2012,33,12647
2011,176,147
2016,173,177
2011,686,3
2016,287,35
2012,364,14
2010,494,3
2008,457,5
2015,420,13
2013,971,1
2016,953,1
2015,755,1
2014,7,44436
2010,188,81
2015,272,39
2015,599,2
2012,1232,1
2015,457,6
2016,593,1
2008,513,2
2013,1110,1
2008,404,2
2014,676,1
2010,649,1
2012,690,2
2012,515,1
2009,1001,1
2008,20,20137
2014,92,1301
2013,74,2231
2013,1103,1
2016,151,277
2013,453,9
2015,596,4
2008,145,75
2013,236,62
2012,544,3
2010,439,4
2011,610,2
2013,743,1
2012,436,6
2016,619,2
2014,762,5
2011,1192,1
2013,915,1
2015,759,1
2015,645,1
2014,881,1
2013,136,362
2012,309,37
2011,484,7
2014,138,349
2015,441,13
2014,403,14
2015,247,65
2014,309,25
2016,602,3
2012,595,2
2012,721,1
2012,790,1
2015,1465,1
2009,64,2404
2012,170,159
2011,413,5
2013,499,4
2013,344,29
2015,303,29
2013,318,25
2012,427,13
2008,290,6
2008,677,2
2009,591,3
2013,492,7
2016,536,7
2015,771,2
2015,859,1
2014,769,1
2015,1675,1
2015,60,3838
2008,15,34025
2015,220,90
2014,144,328
2014,146,326
2012,343,28
2013,164,200
2013,157,219
2008,826,2
2011,308,18
2014,369,17
2015,537,2
2010,315,20
2011,477,2
2015,382,13
2010,665,1
2015,838,1
2015,644,3
2012,1014,1
2010,666,1
2011,62,3102
2014,114,713
2009,463,5
2012,245,61
2015,227,74
2013,319,24
2010,327,10
2010,639,1
2016,567,2
2016,518,1
2011,709,1
2016,1028,1
2009,751,1
2016,25,22433
2011,31,13095
2015,88,1560
2015,163,229
2010,436,4
2011,463,7
2010,395,7
2012,513,4
2012,505,2
2016,960,1
2016,942,1
2014,461,8
2016,268,50
2009,270,18
2008,232,13
2008,411,1
2010,495,5
2008,1723,1
2008,268,4
2008,555,1
2012,13,64017
2010,4,41981
2011,242,46
2010,273,16
2008,392,4
2008,174,39
2014,593,6
2015,402,12
2011,587,2
2014,373,11
2014,485,3
2010,687,4
2013,588,3
2011,1170,1
2008,665,1
2010,491,1
2015,921,1
2008,809,1
2014,143,341
2013,562,7
2011,196,104
2011,273,25
2015,1022,1
2013,481,3
2016,711,1
2010,696,1
2014,579,4
2009,396,4
2016,64,3224
2011,90,1175
2011,131,355
2010,101,682
2010,83,1357
2015,157,267
2011,450,8
2010,463,6
2015,458,8
2016,365,20
2011,286,32
2009,258,15
2015,317,23
2010,572,3
2010,820,1
2014,998,1
2010,801,1
2014,715,1
2015,1132,1
2010,963,1
2008,102,284
2010,192,90
2015,346,21
2014,934,3
2010,426,5
2015,565,3
2013,861,1
2013,873,1
2016,632,1
2012,479,3
2012,945,1
2012,1553,1
2012,41,7788
2014,139,340
2013,92,1217
2012,76,1974
2016,229,70
2010,818,2
2012,211,92
2016,509,5
2016,533,4
2012,511,3
2010,675,3
2016,743,1
2015,1563,1
2014,552,1
2012,2107,1
2016,315,29
2015,118,637
2014,32,14334
2015,159,269
2009,104,535
2013,778,1
2012,524,5
2013,197,102
2009,238,22
2011,307,24
2011,255,29
2014,945,3
2014,665,4
2016,375,16
2008,459,2
2014,578,4
2012,824,2
2014,599,2
2009,656,1
2016,837,2
2015,658,1
2010,565,1
2009,1542,1
2014,84,1633
2013,85,1540
2013,385,17
2013,150,290
2013,388,15
2011,628,4
2013,1080,1
2013,3669,1
2008,1337,1
2008,573,1
2010,98,794
2009,507,2
2011,639,2
2014,267,53
2010,692,1
2015,1088,1
2013,652,3
2016,735,1
2011,615,2
2010,360,6
2016,746,2
2016,948,1
2016,485,4
2008,335,1
2012,1319,1
2009,70,1930
2008,85,598
2013,266,32
2010,184,96
2014,1441,1
2014,234,66
2016,428,9
2011,186,110
2011,251,47
2014,351,15
2011,562,8
2009,234,29
2010,235,39
2014,595,2
2009,370,3
2015,887,1
2013,674,4
2011,584,4
2016,739,1
2016,769,1
2008,54,2385
2013,66,3020
2009,98,700
2013,298,30
2010,158,142
2011,426,7
2015,521,6
2010,337,11
2011,422,10
2015,1852,1
2010,28,15228
2011,159,187
2010,133,311
2011,207,79
2012,142,304
2015,3142,1
2008,194,28
2012,472,5
2009,474,3
2014,478,3
2008,388,2
2008,405,1
2016,31,15255
2010,155,175
2009,303,12
2013,210,102
2016,688,2
2010,611,3
2010,296,19
2008,498,1
2008,358,5
2013,59,3772
2013,1,3466
2009,224,28
2013,284,45
2012,183,128
2010,412,6
2012,1017,2
2013,641,2
2009,850,1
2010,878,1
2016,208,110
2015,572,3
2009,154,148
2012,1104,1
2012,574,3
2013,732,1
2009,405,1
2013,940,1
2008,583,1
2009,1047,1
2009,5,48261
2011,5,43348
2011,174,141
2012,374,11
2012,602,3
2013,572,1
2016,1001,1
2009,1155,1
2012,53,4675
2016,367,16
2012,241,55
2015,136,382
2011,179,145
2008,322,10
2013,515,9
2010,376,5
2014,381,7
2016,578,5
2013,735,2
2012,107,778
2013,175,189
2013,342,22
2015,197,125
2015,324,38
2008,152,55
2016,713,2
2016,639,2
2016,406,14
2012,763,1
2008,422,4
2011,482,5
2016,702,2
2015,767,1
2016,43,7594
2009,54,3419
2010,208,52
2012,173,178
2009,109,474
2011,305,31
2016,532,4
2016,548,8
2012,354,11
2015,487,5
2015,1064,2
2011,1887,1
2015,829,1
2014,34,12152
2008,67,1244
2012,118,615
2011,79,1646
2016,124,453
2016,164,221
2012,393,16
2015,305,33
2012,552,1
2010,344,14
2016,566,4
2016,478,8
2008,311,4
2012,668,1
2010,685,1
2016,704,1
2014,608,1
2010,13,58589
2009,42,5893
2013,193,129
2008,169,50
2011,330,14
2014,543,6
2010,217,53
2015,798,1
2015,987,1
2015,1001,1
2008,263,10
2012,752,2
2015,754,1
2012,47,5841
2010,8,56220
2015,143,357
2014,59,3782
2013,65,3005
2010,112,536
2015,295,41
2009,208,47
2008,144,79
2010,300,14
2009,196,46
2009,390,10
2013,252,56
2015,427,16
2012,229,60
2008,465,4
2012,717,1
2016,409,8
2009,469,1
2012,895,4
2010,421,8
2015,1134,2
2014,443,7
2009,350,3
2012,1191,1
2015,1077,1
2015,490,5
2011,609,1
2015,662,1
2013,205,85
2008,355,5
2013,141,341
2011,282,33
2014,262,44
2016,213,119
2013,231,49
2008,367,4
2015,584,5
2015,654,3
2009,700,1
2012,745,2
2014,603,1
2013,638,1
2016,56,4350
2014,58,4058
2011,134,361
2014,349,23
2013,292,29
2013,337,18
2013,470,8
2015,338,28
2011,328,16
2009,420,5
2016,654,2
2012,998,1
2016,1390,1
2016,1058,1
2011,166,166
2010,104,657
2009,191,57
2014,459,12
2015,395,14
2016,414,6
2014,960,1
2010,717,2
2012,276,23
2008,684,1
2009,694,1
2015,607,2
2016,69,2662
2010,68,2299
2010,56,3523
2012,85,1455
2015,108,865
2010,444,6
2015,543,5
2012,345,19
2015,848,1
2014,792,2
2014,460,5
2016,977,1
2013,531,1
2011,1421,1
2011,985,1
2016,320,30
2016,310,30
2014,12,72297
2012,111,745
2011,101,807
2010,111,520
2011,115,503
2016,499,5
2008,178,38
2015,656,3
2014,353,23
2015,410,11
2011,2042,1
2016,975,1
2010,1154,1
2015,680,4
2016,679,1
2009,500,3
2008,511,3
2011,730,1
2008,48,3200
2014,105,837
2008,489,2
2008,142,74
2010,191,74
2015,312,38
2009,211,49
2013,331,21
2013,734,1
2012,564,4
2009,468,5
2013,874,1
2009,472,4
2016,594,6
2015,51,5541
2013,13,63963
2014,89,1378
2015,252,63
2014,346,30
2010,510,4
2008,283,5
2010,939,2
2010,561,2
2012,1037,1
2014,534,3
2012,823,1
2013,767,2
2014,421,11
2010,720,1
2016,59,3977
2016,4,42392
2014,159,245
2013,159,224
2012,115,689
2015,345,22
2016,373,27
2008,309,3
2008,231,18
2011,669,1
2014,694,2
2016,789,1
2009,865,1
2015,674,2
2012,34,11681
2009,39,6733
2013,147,278
2011,89,1237
2013,647,6
2010,459,4
2011,456,4
2016,633,2
2012,902,1
2010,774,2
2011,529,3
2016,311,31
2015,55,4690
2015,20,33632
2009,2,21356
2012,186,116
2012,712,3
2011,246,37
2016,415,11
2016,877,1
2015,292,35
2009,268,10
2013,1068,1
2011,667,3
2016,661,2
2013,523,2
2013,583,2
2013,962,1
2008,769,1
2013,8,55656
2009,44,5338
2012,330,23
2009,206,52
2008,138,78
2013,1377,1
2011,582,3
2012,435,6
2012,643,2
2010,527,1
2009,805,1
2010,843,1
2014,1166,1
2012,599,1
2013,123,522
2011,216,63
2010,175,115
2009,329,8
2015,339,19
2010,423,9
2009,308,10
2013,435,10
2011,1432,1
2015,586,4
2014,697,1
2010,442,2
2013,561,1
2015,135,457
2013,81,1856
2011,119,457
2014,88,1442
2014,219,77
2013,663,1
2014,236,69
2016,319,24
2008,224,15
2008,395,5
2008,450,2
2015,630,2
2008,376,3
2015,696,2
2012,736,1
2012,506,2
2015,636,1
2012,696,1
2011,64,2817
2011,237,61
2012,498,5
2008,157,61
2012,550,2
2015,941,1
2012,426,8
2008,437,2
2012,828,1
2014,529,3
2012,862,2
2012,1060,1
2013,469,9
2014,286,47
2012,454,5
2009,213,43
2014,299,27
2009,344,12
2008,333,5
2011,847,1
2013,1921,1
2009,359,5
2016,887,1
2011,704,2
2013,472,3
2015,917,2
2016,670,2
2014,129,492
2011,107,702
2016,402,18
2012,151,246
2010,340,8
2016,592,5
2013,459,7
2009,400,6
2015,404,16
2016,571,5
2011,323,24
2009,479,2
2012,995,1
2012,488,1
2014,768,1
2014,1177,1
2012,609,1
2012,939,1
2012,536,1
2014,99,1088
2013,80,1699
2009,280,18
2016,455,8
2012,366,14
2009,791,1
2011,440,4
2012,724,1
2011,936,1
2016,345,26
2011,6,55419
2008,31,8165
2008,55,2149
2014,131,469
2012,165,190
2009,133,208
2008,90,504
2013,464,9
2015,291,41
2016,472,6
2013,321,28
2016,596,4
2010,1203,1
2013,560,2
2012,501,3
2013,830,2
2014,860,2
2014,738,1
2015,40,8988
2014,21,30336
2013,202,106
2013,100,997
2012,70,2401
2010,86,1230
2009,184,77
2009,168,104
2009,107,509
2016,583,7
2008,364,5
2012,356,14
2012,424,7
2014,666,2
2015,388,20
2010,835,3
2011,473,7
2012,654,1
2012,1196,1
2014,627,1
2010,592,1
2016,91,1208
2015,216,110
2011,402,15
2014,515,7
2008,233,13
2016,346,17
2012,730,2
2011,608,2
2013,1482,1
2014,735,1
2014,1610,1
2011,1664,1
2012,24,23924
2008,235,16
2011,236,42
2014,383,13
2013,225,79
2012,191,99
2016,353,14
2016,582,4
2014,743,2
2015,524,7
2016,760,2
2009,448,2
2015,679,1
2012,610,2
2009,655,1
2012,32,13289
2012,119,543
2014,133,455
2012,359,12
2012,205,88
2012,194,118
2013,393,16
2014,303,31
2013,294,25
2012,335,25
2012,327,17
2014,448,6
2012,623,4
2013,564,3
2010,595,2
2009,397,4
2016,672,1
2013,1713,1
2014,1083,1
2015,123,501
2011,212,66
2012,247,49
2008,84,620
2011,356,17
2011,195,94
2008,340,3
2011,549,3
2014,918,1
2010,471,4
2010,393,4
2009,520,1
2015,825,1
2011,629,1
2015,1188,1
2011,1055,1
2008,53,2385
2010,139,213
2015,352,20
2008,148,65
2015,413,19
2016,424,16
2015,518,7
2014,503,11
2008,344,7
2012,473,4
2012,660,2
2012,906,2
2015,962,1
2013,602,2
2008,939,1
2016,48,6265
2013,15,54450
2015,160,211
2015,117,645
2015,155,263
2015,152,307
2016,146,288
2012,131,421
2011,274,38
2008,139,73
2015,448,10
2013,542,4
2011,1083,1
2010,1009,1
2012,577,5
2011,575,1
2016,716,2
2013,897,1
2016,776,1
2009,531,1
2009,634,2
2015,970,1
2013,508,4
2011,943,1
2016,76,2074
2011,4,43770
2009,40,6567
2012,235,72
2012,199,99
2014,137,379
2016,431,13
2008,294,7
2011,501,6
2012,351,11
2010,807,1
2013,226,64
2011,126,417
2008,297,5
2011,239,50
2013,1349,1
2008,754,2
2009,806,1
2010,587,2
2011,760,1
2014,15,55275
2015,104,903
2012,208,87
2015,569,2
2012,567,1
2010,534,3
2014,574,6
2009,382,4
2008,458,3
2009,419,5
2008,529,2
2012,2366,1
2014,499,5
2008,398,3
2015,604,3
2008,2481,1
2011,523,1
2016,644,2
2016,30,16670
2011,1,5207
2010,124,375
2016,264,50
2014,327,25
2012,596,2
2015,480,12
2012,659,2
2010,541,2
2014,954,2
2011,557,8
2010,566,3
2016,618,1
2016,601,1
2009,1730,1
2012,55,4270
2008,21,17993
2012,167,187
2010,177,109
2011,169,129
2014,307,32
2013,174,174
2010,335,8
2012,349,25
2015,422,8
2010,338,13
2013,488,3
2011,313,25
2009,302,13
2015,385,17
2010,403,10
2011,546,6
2015,761,1
2016,1125,1
2011,842,1
2010,936,1
2014,28,18817
2009,24,19102
2012,269,44
2012,94,1160
2009,231,40
2009,388,10
2011,229,48
2012,301,37
2014,476,6
2008,633,3
2015,511,6
2012,617,1
2009,671,1
2008,734,1
2015,3,71175
2015,19,35397
2013,79,1909
2016,191,109
2010,195,78
2012,225,49
2008,166,43
2009,147,150
2010,291,20
2013,525,2
2013,353,16
2015,664,2
2009,354,3
2012,438,3
2009,55,3209
2012,88,1436
2014,951,1
2012,520,6
2013,1012,2
2011,396,9
2013,540,2
2008,462,1
2011,444,3
2012,2387,1
2009,870,1
2015,709,1
2009,1044,2
2014,1234,1
2012,1910,1
2013,1943,1
2015,817,1
2014,2115,1
2013,632,1
2015,54,4922
2013,77,1978
2012,152,226
2008,161,63
2010,119,438
2016,668,3
2012,305,20
2015,673,3
2013,1529,1
2010,555,4
2013,416,6
2011,474,3
2016,1006,1
2009,748,1
2015,183,155
2014,56,4373
2013,186,153
2016,266,56
2009,135,239
2009,174,86
2009,401,10
2016,750,1
2013,340,12
2009,257,25
2009,358,7
2008,403,4
2013,547,5
2009,564,3
2010,839,1
2012,499,3
2016,824,1
2016,697,1
2015,27,20142
2014,37,10438
2011,87,1323
2010,55,3610
2013,99,1052
2010,69,2215
2009,100,665
2008,75,886
2008,98,351
2014,188,136
2011,231,58
2011,418,5
2013,565,1
2014,864,1
2010,485,4
2014,560,9
2015,1123,2
2016,683,1
2015,634,4
2013,898,1
2012,63,3255
2009,17,34692
2015,343,25
2016,422,11
2009,327,11
2015,439,11
2016,298,34
2014,367,15
2014,940,1
2008,366,5
2011,996,1
2011,458,3
2010,3750,1
2011,808,1
2008,504,1
2010,40,7112
2008,110,228
2015,358,27
2009,379,3
2009,275,21
2013,1075,2
2012,519,4
2013,409,7
2011,598,2
2011,939,1
2015,675,1
2016,1356,1
2016,421,10
2009,171,91
2009,1494,1
2010,425,9
2014,49,5672
2013,46,6293
2011,112,630
2012,64,3112
2016,108,787
2015,175,199
2010,77,1558
2011,123,425
2013,665,1
2015,264,51
2011,342,18
2015,260,59
2010,171,104
2009,556,3
2015,370,17
2009,376,5
2008,202,24
2014,747,1
2009,367,4
2010,1025,1
2010,894,1
2009,1073,1
2015,176,179
2014,104,885
2015,769,3
2014,150,287
2014,753,1
2014,465,6
2015,342,17
2011,526,3
2016,850,1
2011,660,2
2016,609,1
2014,542,1
2013,798,1
2010,129,356
2015,330,24
2015,114,679
2010,109,571
2013,480,6
2010,324,13
2014,774,1
2009,941,1
2012,925,2
2009,698,3
2015,1367,1
2008,636,1
2010,981,1
2016,1201,1
2015,86,1597
2014,102,977
2013,107,805
2009,75,1532
2010,107,621
2009,89,962
2015,337,24
2011,205,92
2016,589,5
2016,1443,1
2011,775,2
2016,382,16
2015,566,10
2008,526,4
2008,434,3
2014,121,559
2012,101,937
2011,127,387
2011,1441,1
2015,727,3
2010,294,24
2014,300,28
2010,299,13
2015,363,23
2012,631,1
2012,416,9
2012,613,4
2010,1907,1
2009,931,1
2013,1855,1
2015,1058,1
2009,521,1
2016,155,231
2010,19,29864
2014,136,392
2010,172,133
2008,111,183
2011,334,22
2015,359,11
2008,360,2
2009,371,8
2014,763,1
2008,515,1
2016,114,603
2009,11,65560
2012,132,433
2011,197,97
2009,67,2004
2011,214,68
2010,168,129
2012,386,12
2016,1981,2
2010,244,32
2012,1594,1
2010,461,4
2012,625,1
2011,534,1
2009,565,1
2012,612,1
2011,599,1
2016,786,1
2014,878,1
2011,103,796
2010,355,13
2012,159,215
2012,1358,1
2008,234,12
2009,269,22
2008,401,3
2012,585,2
2012,508,6
2011,391,5
2015,2182,2
2013,468,2
2009,636,1
2008,815,1
2015,56,4507
2013,63,3189
2013,54,4650
2008,63,1514
2011,138,308
2011,113,592
2015,308,36
2013,593,4
2016,258,64
2010,476,3
2014,684,3
2013,437,19
2012,686,7
2015,694,1
2013,1026,1
2012,611,2
2012,539,2
2016,736,1
2013,24,24147
2010,20,28405
2011,17,39312
2014,134,389
2014,158,207
2011,297,23
2016,303,23
2010,230,42
2012,397,12
2011,554,4
2016,338,20
2010,923,1
2011,925,1
2016,121,525
2016,103,894
2012,162,205
2013,180,142
2013,420,13
2010,214,63
2016,459,9
2012,377,11
2012,341,16
2015,536,5
2012,467,10
2009,495,5
2009,593,2
2008,341,3
2012,855,1
2008,611,1
2011,75,1971
2009,263,18
2008,150,64
2013,351,17
2014,524,2
2012,1887,1
2010,589,2
2010,1280,1
2010,10,65567
2014,132,415
2015,215,93
2012,178,176
2014,283,38
2010,288,22
2014,315,28
2008,236,9
2010,743,2
2008,483,1
2009,360,8
2012,764,1
2012,6,54273
2014,107,886
2013,154,240
2014,409,14
2011,317,25
2008,326,6
2011,542,5
2013,314,20
2012,237,58
2013,386,8
2015,396,15
2009,590,2
2009,658,1
2016,689,2
2015,1035,1
2013,23,24903
2013,49,5627
2011,20,30188
2009,73,1585
2010,143,243
2011,200,83
2012,1371,1
2014,518,5
2010,381,8
2010,274,18
2014,399,14
2009,322,6
2011,975,1
2012,914,1
2008,767,1
2009,924,2
2011,1005,1
2012,30,15558
2010,61,2847
2008,32,7750
2010,97,808
2008,119,186
2015,196,145
2009,441,5
2012,342,21
2012,347,20
2010,310,13
2012,586,2
2008,487,1
2009,290,12
0,12,1
2010,475,5
2013,768,2
2011,536,2
2014,675,2
2016,675,3
2014,81,1756
2012,209,81
2016,277,71
2015,300,49
2012,376,18
2012,487,3
2013,327,24
2015,1671,1
2015,606,3
2009,1003,1
2014,1087,1
2009,891,1
2015,1433,1
2014,67,2938
2012,180,153
2008,143,75
2010,222,48
2014,501,6
2012,468,1
2015,287,41
2014,670,2
2013,604,3
2009,1068,1
2010,394,10
2014,640,2
2014,832,2
2011,962,1
2015,877,3
2014,3,72682
2013,158,216
2016,508,6
2012,373,9
2013,443,9
2013,381,14
2012,746,1
2014,5498,1
2008,342,5
2014,2194,1
2014,624,3
2016,995,1
2011,555,4
2013,646,1
2011,829,1
2016,1083,1
2012,778,1
2011,24,22693
2009,74,1556
2010,147,198
2014,297,32
2013,173,167
2013,301,23
2012,478,4
2016,336,32
2014,411,11
2015,530,7
2010,267,15
2011,637,2
2012,766,4
2010,430,1
2008,1029,1
2013,551,1
2011,677,1
2012,624,1
2013,905,1
2010,711,1
2016,144,340
2013,22,27339
2008,61,1606
2008,66,1290
2010,93,940
2010,114,520
2015,228,79
2016,606,1
2011,419,5
2011,403,10
2008,195,20
2011,715,1
2011,1093,1
2008,265,7
2014,466,5
2011,851,1
2008,448,1
2011,71,2163
2008,23,15086
2014,54,4954
2014,227,77
2016,135,365
2015,150,297
2009,201,59
2011,287,17
2015,267,51
2012,214,71
2016,448,7
2014,730,1
2012,691,2
2012,538,5
2012,1264,1
2015,874,1
2014,30,16645
2014,39,9472
2011,7,47112
2014,173,186
2009,118,366
2012,451,10
2009,297,17
2016,494,5
2015,419,12
2013,460,8
2009,244,18
2014,1679,1
2014,537,4
2016,528,1
2015,463,4
2010,830,1
2015,889,1
2013,282,46
2015,747,3
2016,505,7
2016,446,7
2011,299,23
2013,631,3
2016,673,6
2014,416,7
2016,1154,1
2013,753,1
2012,40,8449
2010,116,454
2014,296,43
2013,501,8
2016,519,6
2013,723,3
2011,586,1
2010,512,1
2013,958,1
2016,435,8
2014,649,1
2011,1234,1
2015,1037,1
2015,514,6
2012,920,1
2016,73,2277
2013,124,493
2011,69,2406
2010,173,118
2015,415,15
2013,216,82
2015,257,50
2011,365,10
2012,450,6
2016,1394,1
2013,1867,1
2011,1177,2
2010,59,3115
2009,114,400
2011,110,632
2015,242,65
2011,226,52
2011,375,12
2010,245,34
2010,636,1
2012,371,11
2011,220,63
2008,172,43
2008,1092,1
2016,462,10
2013,1165,1
2016,748,1
2013,9,60596
2012,61,3412
2012,154,253
2015,357,24
2011,160,171
2015,188,143
2016,307,29
2014,788,2
2015,322,18
2013,1208,1
2016,919,1
2011,834,1
2015,1107,1
2011,619,2
2016,677,1
2009,837,1
2015,1230,1
2011,26,18813
2009,27,14914
2016,199,104
2014,221,90
2011,219,80
2014,258,44
2008,191,29
2009,246,28
2013,296,30
2010,1342,1
2013,964,2
2015,1154,1
2011,688,2
2010,7,47942
2013,165,205
2010,313,21
2010,397,10
2015,186,132
2013,466,7
2010,659,1
2011,489,7
2009,384,7
2014,1776,1
2010,536,2
2011,1044,1
2012,60,3646
2010,63,2699
2008,5,44580
2008,2,67570
2008,45,3547
2012,153,259
2011,157,192
2012,221,75
2014,294,34
2012,350,15
2014,341,23
2016,396,7
2013,367,14
2016,1610,1
2010,575,1
2013,664,1
2012,771,1
2013,37,10085
2012,166,211
2014,201,125
2015,232,79
2014,619,2
2014,249,61
2009,381,5
2009,247,24
2008,289,9
2010,316,8
2013,445,9
0,2,1
2013,1201,1
2016,1370,1
2015,684,1
2011,781,1
2013,43,7494
2010,1,29791
2009,82,1164
2015,321,21
2013,235,69
2015,478,6
2011,569,3
2010,729,1
2014,910,2
2008,51,2673
2014,339,19
2016,564,5
2015,172,179
2016,322,26
2012,415,9
2013,579,2
2014,452,6
2014,818,1
2008,510,3
2013,762,1
2008,676,1
2015,713,2
2016,37,10452
2016,270,60
2014,18,39862
2010,99,800
2011,73,2019
2009,116,395
2016,763,4
2016,282,54
2012,521,7
2013,881,1
2009,476,4
2010,844,1
2011,703,2
2011,998,1
2014,206,102
2012,57,4019
2011,390,11
2010,332,14
2014,424,15
2008,351,5
2013,671,3
2011,739,2
2014,639,3
2014,559,2
2008,8,59093
2014,103,995
2009,141,199
2016,836,1
2010,295,25
2013,352,12
2011,217,68
2011,333,11
2014,755,3
2015,362,10
2012,633,2
2009,465,1
2008,441,1
2016,655,1
2015,665,2
2014,633,2
2010,858,1
2016,97,1013
2011,32,12532
2011,247,43
2014,151,275
2016,269,49
2011,417,7
2009,300,15
2014,364,17
2011,476,5
2012,486,3
2011,602,2
2013,643,3
2014,1068,1
2013,715,1
2012,35,10724
2016,420,18
2010,161,148
2011,311,17
2009,318,13
2011,753,1
2009,306,13
2010,266,24
2012,403,8
2010,312,13
2012,698,1
2015,701,1
2012,751,1
2014,644,1
2013,779,2
2009,856,1
2010,710,1
2014,581,3
2009,418,2
2015,1223,1
2010,597,3
2012,129,412
2009,115,350
2014,255,63
2011,238,47
2011,461,3
2014,282,34
2009,450,6
2008,248,9
2012,425,10
2011,379,11
2013,496,5
2011,479,4
2011,614,2
2012,607,3
2016,663,2
2016,1478,1
2010,613,1
2012,42,7684
2014,167,226
2016,136,363
2012,497,5
2014,199,107
2010,898,1
2012,419,11
2016,433,12
2009,343,10
2012,315,17
2015,758,1
2008,535,1
2011,865,1
2013,31,14563
2016,360,16
2011,548,3
2013,194,108
2016,502,6
2015,516,9
2013,793,1
2014,820,3
2010,283,14
2014,693,1
2012,934,1
2014,1218,1
2012,1202,1
2015,574,3
2013,40,8631
2011,393,9
2014,109,764
2013,155,208
2016,228,75
2010,169,129
2013,502,5
2015,331,29
2011,481,3
2012,680,1
2016,504,3
2013,447,13
2015,805,1
2013,651,1
2015,862,2
2014,770,3
2015,76,2176
2013,67,2800
2012,99,1071
2009,137,214
2014,272,38
2016,328,23
2015,651,3
2016,616,3
2013,1108,2
2009,514,2
2008,478,1
2014,1268,1
2008,494,4
2009,430,1
2010,524,1
2015,3572,1
2016,123,514
2011,39,8294
2010,144,229
2012,176,130
2015,276,45
2014,462,7
2014,716,1
2016,1166,1
2014,1145,1
2013,1048,1
2009,447,2
2010,821,1
2010,877,1
2008,40,4536
2011,133,338
2012,284,29
2011,665,2
2012,406,3
2010,767,1
2015,594,2
2014,1254,1
2016,71,2617
2011,184,129
2016,443,5
2011,321,21
2010,354,13
2011,416,9
2010,875,1
2013,601,4
2012,1063,1
2016,686,2
2011,408,2
2008,711,1
2015,557,2
2012,581,2
2009,9,62164
2012,82,1616
2010,206,51
2014,190,124
2014,147,270
2013,258,38
2013,219,77
2009,207,55
2014,439,12
2015,350,23
2008,162,54
2012,563,3
2009,389,4
2011,498,7
2014,711,2
2008,439,2
2013,569,2
2016,1324,1
2011,15,50287
2013,44,7135
2009,160,124
2013,272,46
2010,292,25
2016,405,14
2013,267,44
2012,598,3
2011,520,3
2011,355,5
2012,899,1
2009,309,10
2010,346,13
2010,873,1
2015,1982,1
2012,597,3
2015,730,2
2015,479,4
2012,523,2
2010,578,1
2015,800,1
2009,6,51141
2013,142,317
2012,238,62
2016,247,60
2014,157,222
2012,847,3
2012,627,2
2008,1175,1
2013,714,1
2012,707,1
2013,699,2
2014,108,840
2014,175,187
2016,205,125
2014,186,154
2014,153,285
2016,166,198
2012,434,8
2010,434,9
2010,211,41
2015,502,3
2012,693,1
2010,698,1
2009,716,1
2015,676,2
2014,40,8920
2014,91,1334
2013,211,82
2009,103,601
2014,246,54
2014,225,80
2012,303,31
2013,364,12
2009,380,9
2010,368,16
2012,535,7
2012,338,23
2011,618,2
2016,613,5
2016,400,12
2012,825,1
2016,723,2
2009,588,1
2010,81,1379
2011,289,26
2015,504,4
2013,254,61
2009,262,24
2010,333,19
2009,305,9
2015,454,9
2014,1320,1
2011,735,2
2014,913,1
2010,759,2
2009,515,1
2016,368,18
2014,189,130
2015,236,77
2011,424,7
2013,440,10
2010,390,8
2010,513,3
2010,827,2
2011,505,5
2014,748,2
2008,467,1
2008,328,3
2016,399,7
2013,948,1
2015,714,2
2008,804,1
2015,820,1
2016,207,115
2011,55,3871
2009,8,57849
2010,91,998
2015,200,113
2009,406,8
2013,491,7
2015,712,1
2012,628,2
2010,446,7
2011,478,3
2014,931,1
2010,1677,1
2012,694,2
2008,419,1
2015,73,2438
2008,177,31
2014,194,115
2011,332,19
2011,871,1
2013,494,12
2012,443,4
2011,710,1
2014,511,7
2008,313,2
2010,633,1
2013,941,1
2013,217,85
2009,494,5
2014,269,48
2014,332,15
2011,436,6
2008,409,5
2011,466,2
2012,496,6
2012,805,2
2010,1911,1
2011,685,1
2012,28,17966
2016,174,154
2014,141,311
2013,613,2
2015,201,138
2013,220,80
2009,267,17
2014,263,41
2015,380,11
2014,441,9
2009,435,2
2016,1033,1
2012,731,2
2015,2697,1
2014,2084,1
2011,756,1
2011,630,3
2015,6,48703
2010,132,290
2008,78,777
2015,146,314
2016,224,86
2015,323,28
2008,324,5
2010,226,39
2014,398,9
2011,465,5
2015,529,6
2014,804,1
2013,516,6
2016,694,2
2013,621,2
2014,500,7
2010,704,2
2012,634,3
2016,777,2
2010,1007,1
2016,335,30
2015,62,3539
2008,109,241
2012,328,26
2009,747,1
2013,783,2
2008,228,12
2008,601,1
2016,1594,1
2010,14,52357
2013,328,24
2012,568,3
2008,222,9
2016,900,2
2009,186,68
2012,411,11
2015,467,8
2016,542,14
2012,700,1
2014,773,1
2010,826,1
2014,1038,1
2009,657,2
2014,52,5105
2012,197,109
2014,243,45
2014,156,252
2011,399,12
2014,423,8
2011,597,2
2008,414,3
2010,2333,1
2016,17,44114
2014,9,60029
2009,131,246
2012,113,690
2012,253,36
2016,254,55
2016,465,4
2010,401,9
2010,428,3
2012,509,5
2009,252,26
2012,470,8
2008,386,4
2015,631,2
2016,605,2
2010,483,5
2008,303,6
2016,598,2
2014,1762,1
2016,1350,1
2013,1217,1
2014,664,1
2013,317,26
2012,314,27
2016,111,722
2012,240,46
2010,499,5
2010,328,13
2010,697,1
2015,567,3
2015,2557,1
2016,832,1
2016,487,5
2012,1056,1
2008,1554,1
2012,887,1
2016,1452,1
2010,64,2704
2011,522,4
2012,258,50
2014,587,1
2016,506,9
2013,1519,1
2010,608,1
2012,759,1
2015,22,28071
2015,32,14648
2013,42,8095
2009,56,3179
2012,80,1756
2015,223,83
2015,325,26
2014,355,18
2015,299,32
2013,384,15
2011,360,10
2013,341,14
2010,422,8
2008,381,3
2014,467,6
2009,779,1
2009,407,2
2008,593,1
2011,16,45169
2011,29,14888
2013,111,713
2010,135,272
2011,167,153
2010,237,37
2011,337,22
2016,366,13
2011,433,9
2013,455,6
2013,505,5
2011,1043,1
2015,1538,1
2014,868,2
2013,622,2
2008,421,1
2015,126,532
2014,55,4394
2016,212,95
2010,160,175
2016,531,5
2011,262,33
2013,256,43
2008,470,2
2012,640,4
2010,482,3
2013,749,1
2016,516,8
2009,342,6
0,15,1
2011,594,1
2014,203,101
2016,246,74
2008,136,106
2013,1870,1
2012,545,5
2008,329,2
2009,622,2
2015,528,11
2013,680,2
2015,685,2
2016,580,3
2008,452,1
2016,140,342
2012,39,9180
2012,93,1156
2012,71,2313
2011,84,1392
2008,71,1070
2014,318,21
2016,648,1
2012,1059,1
2009,427,2
2013,229,67
2011,147,242
2010,201,83
2014,162,227
2011,499,3
2014,184,143
2011,245,49
2011,146,247
2009,688,2
2015,406,17
2015,500,3
2015,1005,1
2008,375,4
2010,1021,1
2009,489,4
2015,953,1
2009,755,1
2011,642,1
2009,29,12614
2014,130,454
2008,183,43
2012,138,335
2011,130,392
2012,494,5
2009,212,37
2009,286,13
2008,240,10
2015,315,33
2011,446,7
2010,377,11
2015,286,41
2009,798,1
2010,456,9
2016,425,9
2013,426,9
2009,446,4
2009,304,9
2012,1670,1
2009,661,1
2016,892,1
0,5,1
2011,8,57040
2014,57,4271
2014,73,2307
2008,99,333
2009,182,69
2015,428,10
2015,140,374
2009,352,13
2009,218,34
2010,369,13
2013,251,50
2016,423,14
2008,227,25
2016,535,5
2014,508,7
2013,707,1
2011,916,2
2015,181,156
2009,32,10765
2012,161,205
2009,105,545
2009,197,57
2015,302,36
2016,223,78
2014,641,2
2013,279,37
2008,301,10
2014,652,1
2009,643,1
2009,287,8
2013,421,7
2013,450,11
2015,1221,1
2015,621,1
2013,821,1
2015,85,1684
2013,140,325
2013,227,63
2015,320,35
2010,462,1
2012,388,13
2008,184,26
2010,432,5
2011,387,12
2012,572,1
2012,365,17
2016,453,11
2012,965,2
2015,429,9
2011,541,4
2016,1163,1
2012,141,318
2011,164,172
2013,370,14
2016,522,6
2012,579,3
2013,371,12
2016,473,7
2012,1132,1
2012,1220,1
2008,304,6
2010,532,2
2011,771,1
2009,37,7519
2014,310,28
2013,555,4
2009,271,19
2013,401,15
2008,579,3
2016,543,4
2015,455,7
2015,663,1
2015,7,43563
2010,32,11407
2014,247,63
2013,260,67
2013,348,22
2016,271,36
2015,667,1
2014,493,7
2008,350,4
2011,612,1
2009,583,1
2008,70,1109
2008,74,933
2016,189,147
2013,133,399
2016,163,183
2013,419,12
2014,392,9
2011,320,25
2011,315,20
2010,533,3
2015,575,5
2014,475,4
2013,653,1
2008,612,1
2016,94,1212
2012,242,48
2015,204,109
2013,677,3
2016,475,7
2008,461,3
2012,888,1
2015,447,10
2011,949,2
2012,418,9
2016,491,7
2014,853,1
2014,23,25484
2010,140,259
2008,141,79
2010,293,24
2016,297,35
2016,395,14
2009,311,15
2009,296,13
2013,716,3
2012,332,14
2014,3955,1
2011,1800,1
2011,973,1
2011,142,282
2015,102,1023
2013,192,114
2012,196,111
2012,243,65
2015,314,38
2008,270,8
2015,515,3
2015,476,7
2011,563,2
2014,576,1
2016,1314,1
2010,925,2
2012,476,3
2012,575,1
2013,4894,1
2011,467,5
2016,192,123
2008,27,10878
2011,170,151
2010,94,919
2014,235,82
2014,655,3
2012,464,6
2011,455,8
2011,509,5
2016,923,1
2015,1,3162
2013,2,10748
2015,95,1225
2011,210,66
2013,307,32
2016,238,79
2009,307,14
2008,213,16
2014,2190,1
2011,626,1
2015,880,1
2013,1224,1
2008,438,1
2015,30,16737
2013,14,59478
2013,509,3
2009,173,76
2008,158,59
2011,503,5
2008,317,4
2016,755,1
2016,1107,1
2016,68,2819
2013,60,3738
2008,35,6379
2015,122,568
2014,85,1614
2013,121,508
2010,50,4498
2016,650,3
2010,115,466
2012,134,384
2016,331,27
2016,432,14
2014,304,26
2012,390,6
2014,554,5
2013,467,4
2011,518,3
2014,1143,1
2015,659,1
2016,142,323
2012,19,33697
2012,89,1286
2011,100,856
2009,92,842
2013,153,251
2016,939,1
2016,286,38
2014,450,10
2008,241,13
2012,569,4
2008,534,5
2014,621,2
2013,624,1
2013,1142,1
2012,87,1439
2010,123,352
2009,237,35
2008,225,13
2014,377,18
2011,638,1
2010,726,3
2015,783,2
2016,1187,1
2010,416,4
2011,1116,1
2012,798,1
2013,656,1
2012,21,28961
2011,104,788
2009,78,1422
2016,347,20
2015,1045,1
2009,490,3
2015,522,5
2015,224,75
2010,447,6
2009,562,3
2015,589,3
2009,340,6
2009,509,7
2010,742,1
2013,33,13249
2011,180,115
2016,442,13
2010,261,28
2012,845,2
2013,1143,1
2015,704,3
2009,666,1
2010,567,1
2009,548,2
2012,777,1
2016,75,2228
2014,370,25
2013,55,4391
2012,108,757
2016,355,22
2012,672,1
2013,160,211
2010,489,3
2015,555,6
2015,469,6
2009,667,1
2015,698,1
2014,482,4
2013,765,1
2016,1641,1
2014,623,3
2016,496,2
2016,888,2
2013,775,1
2010,22,23250
2008,22,17034
2014,127,461
2009,99,694
2009,111,481
2012,148,254
2014,228,77
2014,406,11
2016,257,41
2013,482,6
2009,282,14
2014,429,9
2009,1834,1
2016,464,6
2012,452,5
2009,487,3
2010,484,3
2015,873,1
2014,690,1
2011,1187,1
2009,907,1
2015,1050,1
2009,145,163
2015,241,53
2010,271,31
2015,612,7
2014,1209,2
2009,522,1
2009,460,2
2014,1508,1
2011,592,2
2014,630,3
2012,408,6
2016,553,3
2009,546,1
2016,34,12655
2012,206,107
2010,78,1650
2009,66,2147
2011,178,144
2010,257,27
2012,481,9
2011,346,18
2016,545,5
2012,818,1
2014,420,9
2008,387,3
2014,1006,1
2012,776,1
2012,667,1
2014,8,54815
2012,25,21319
2013,16,49538
2015,89,1451
2013,75,2187
2012,126,479
2013,179,149
2013,168,181
2009,209,49
2009,410,3
2013,801,1
2014,1623,1
2010,540,3
2011,673,2
2011,839,1
2014,1877,1
2016,740,1
2014,33,13596
2010,96,841
2013,134,390
2013,144,322
2015,618,5
2008,221,14
2010,719,2
2009,702,1
2013,1599,1
2014,819,1
2015,13,66141
2010,45,5781
2008,39,4959
2011,111,666
2009,88,959
2014,281,43
2015,129,459
2016,145,306
2012,440,11
2008,251,11
2013,402,12
2015,668,3
2009,570,2
2010,526,5
2014,702,3
2014,592,1
2012,455,8
2014,1007,1
2014,568,1
2008,480,1
2008,433,1
2016,130,424
2014,62,3397
2015,178,183
2010,16,42194
2015,77,2089
2012,212,100
2012,296,27
2012,492,8
2009,330,6
2013,271,35
2008,378,2
2015,592,2
2014,527,4
2013,563,2
2008,755,1
2014,1,3301
2011,3,72756
2008,17,26427
2008,19,21450
2008,130,124
2012,321,27
2011,275,35
2014,539,8
2008,197,20
2014,731,1
2016,440,10
2011,354,13
2011,398,7
2012,710,1
2009,534,4
2009,516,1
2013,1356,1
2016,873,1
2013,25,21835
2015,177,175
2014,397,8
2013,300,29
2011,372,15
2010,232,44
2011,345,16
2010,351,13
2014,495,4
2014,759,1
2008,577,2
2010,967,1
2008,592,1
2016,180,151
2013,389,15
2008,122,137
2011,301,31
2014,1073,2
2008,455,5
2014,794,2
2015,1371,1
2015,863,2
2014,987,1
2014,1392,1
2009,539,3
2015,1168,1
2008,527,4
2014,744,3
2011,1866,1
2010,1206,1
2016,157,233
2012,106,823
2011,43,6615
2012,68,2614
2011,57,3705
2012,172,168
2014,118,585
2015,194,125
2008,679,2
2008,428,1
2012,453,10
2010,486,2
2011,539,2
2012,1374,1
2011,964,1
2009,321,3
2011,3154,1
2015,836,1
2015,58,4102
2015,238,80
2008,105,268
2013,109,712
2016,217,89
2012,263,48
2012,1773,1
2014,905,1
2009,1237,1
2012,580,2
2009,742,1
2013,580,3
2014,1372,1
2014,1520,1
2011,68,2436
2010,70,2086
2011,18,36043
2012,62,3305
2011,128,358
2011,66,2659
2010,110,564
2009,95,768
2012,121,548
2015,226,96
2009,461,5
2016,599,2
2009,646,3
2016,700,1
2014,372,9
2012,96,1095
2016,169,230
2012,169,151
2016,112,642
2010,612,2
2008,330,3
2010,405,9
2012,429,9
2008,208,18
2014,707,4
2013,992,1
2013,682,4
2016,438,6
2009,596,1
2016,523,3
2011,447,2
2012,804,1
2015,1196,1
2009,611,3
2012,699,1
2016,106,880
2011,36,10252
2009,4,43690
2015,106,849
2015,98,1115
2016,323,28
2011,405,15
2012,320,21
2015,274,45
2009,387,5
2008,371,4
2013,625,3
2011,491,6
2008,1536,1
2010,688,1
2008,327,2
2015,991,1
2011,48,5408
2009,53,3618
2008,82,664
2014,126,475
2015,214,93
2013,125,447
2016,361,31
2009,501,2
2016,575,4
2008,389,2
2015,801,1
2016,634,1
2009,639,1
2014,717,3
2010,1069,1
2016,14,61440
2015,120,609
2013,355,21
2015,394,6
2014,1017,1
2016,221,101
2008,514,3
2008,484,2
2016,492,9
2013,354,15
2013,943,1
2015,545,3
2012,649,2
2016,1092,1
2008,400,2
2012,9,62273
2009,120,327
2013,264,45
2014,284,34
2011,570,3
2015,732,1
2010,284,18
2016,637,2
2013,507,5
2009,772,1
2014,696,3
2013,738,1
2016,1078,1
2013,789,1
2014,846,2
2013,129,458
2010,170,132
2011,254,35
2008,188,29
2010,223,45
2008,274,9
2014,413,11
2016,262,31
2010,413,5
2015,386,13
2009,345,6
2013,2817,2
2015,635,1
2010,605,1
2008,11,56501
2013,190,124
2010,156,157
2008,81,647
2014,580,3
2010,220,49
2016,304,39
2010,250,46
2016,276,46
2010,301,21
2013,361,19
2011,742,2
2013,295,19
2015,681,1
2012,504,1
2016,172,163
2016,33,13677
2015,212,103
2013,277,30
2011,559,3
2010,269,19
2014,1066,1
2015,407,13
2014,663,1
2015,982,1
2015,587,1
2012,12,70694
2009,7,49438
2013,101,953
2013,191,116
2010,281,21
2010,568,2
2014,638,5
2010,1006,2
2015,485,6
2009,272,14
2014,739,1
2008,244,8
2011,645,2
2016,530,3
2010,903,1
2008,550,1
2010,1071,1
2013,263,37
2011,145,269
2008,154,85
2009,601,3
2015,285,37
2014,845,1
2014,344,16
2010,689,1
2013,577,1
2014,629,1
2010,756,1
2014,1075,1
2015,1172,1
2016,4772,1
2010,842,1
2012,204,111
2011,76,1831
2012,103,899
2009,166,96
2014,407,14
2015,546,4
2009,369,7
2013,1252,1
2016,9,57866
2012,65,3027
2008,47,3259
2014,224,88
2015,148,310
2016,641,4
2016,248,50
2014,553,5
2014,1494,1
2010,352,11
2008,293,7
2011,579,5
2010,373,9
2011,585,3
2014,469,8
2015,484,7
2016,2283,1
2016,1076,1
2016,479,10
2009,485,3
2013,752,1
2010,36,9380
2012,404,11
2013,188,124
2008,127,129
2009,242,30
2016,187,134
2010,396,11
2008,261,9
2015,2442,1
2014,1148,1
2009,486,4
2010,528,2
2014,854,1
2011,1430,1
2013,185,137
2012,114,619
2011,114,565
2014,177,184
2014,313,30
2009,261,20
2011,401,13
2011,784,1
2013,430,10
2009,826,1
2012,605,4
2014,1507,1
2009,619,1
2011,603,2
2016,926,1
2016,67,2984
2015,149,305
2016,129,442
2013,3,72686
2015,142,329
2016,232,85
2009,355,6
2010,137,227
2010,197,73
2014,646,4
2012,362,19
2010,334,15
2015,1978,1
2013,747,1
2016,818,1
2012,606,1
2012,2196,1
2010,959,1
2014,815,1
2012,663,1
2014,720,1
2015,26,21413
2015,63,3447
2013,20,33018
2013,11,68434
2009,79,1325
2008,92,407
2009,146,142
2015,164,225
2012,217,84
2010,308,14
2010,362,10
2012,299,30
2009,223,33
2008,735,2
2014,651,4
2011,361,12
2013,489,2
2014,938,1
2011,800,1
2012,559,4
2014,977,1
2008,436,2
2010,747,1
2016,587,2
2014,682,1
2011,779,2
2014,1636,1
2009,824,1
2013,805,1
2015,74,2323
2012,223,59
2012,220,80
2016,267,39
2016,127,503
2015,246,74
2015,426,11
2015,283,33
2016,358,17
2012,591,4
2014,323,26
2013,408,13
2012,742,2
2015,533,5
2011,1588,1
2011,4302,1
2014,637,1
2012,952,1
2016,847,1
2013,1295,1
2012,988,2
2014,688,3
2011,1049,1
2010,979,1
2016,692,1
2016,318,20
2016,3,69872
2008,36,6086
2015,166,224
2011,65,2647
2010,399,14
2011,141,260
2013,359,16
2013,276,49
2013,396,16
2010,314,18
2009,1489,1
2015,471,7
2009,320,6
2015,1845,1
2011,1235,1
2008,1209,1
2009,871,1
2015,548,1
2011,622,1
2015,61,3663
2013,308,23
2009,13,56307
2013,209,84
2011,198,97
2010,305,14
2009,68,1939
2015,184,152
2012,125,481
2012,648,2
2009,239,26
2016,313,33
2008,456,4
2011,373,15
2016,941,1
2014,268,41
2009,392,10
2013,567,1
2008,1283,1
2016,620,2
2012,31,13966
2008,43,3974
2013,122,534
2011,88,1247
2011,95,978
2009,199,52
2010,331,14
2012,239,55
2008,713,1
2011,994,1
2012,720,1
2013,493,2
2010,731,1
2008,619,1
2010,34,9772
2013,64,3118
2010,82,1318
2010,76,1669
2013,152,219
2010,539,2
2016,344,17
2009,417,9
2010,375,7
2013,1210,1
2015,585,2
2013,94,1150
2012,145,300
2010,193,70
2016,216,66
2013,238,55
2011,420,6
2015,443,8
2010,417,7
2011,296,29
2013,498,5
2009,467,5
2016,495,2
2014,902,1
2008,548,2
2011,495,2
2016,225,82
2015,57,4461
2015,8,53610
2013,12,71429
2010,62,2706
2009,108,527
2010,102,746
2011,129,378
2013,285,25
2010,548,5
2016,362,29
2015,579,3
2013,637,3
2015,351,28
2013,527,8
2015,436,10
2013,659,2
2010,1264,1
2013,870,2
2014,1072,1
2016,26,21670
2008,87,510
2010,252,34
2012,333,24
2013,599,2
2012,400,9
2013,465,4
2008,284,6
2016,981,1
2010,1533,1
2014,719,1
2015,748,1
2013,1387,1
2013,32,14174
2011,30,14527
2012,163,202
2015,670,1
2015,861,2
2016,380,22
2013,545,4
2013,1602,1
2012,1042,1
2010,490,3
2012,774,1
2012,1215,1
2015,891,2
2016,651,5
2009,503,3
2010,562,2
2009,733,2
2016,611,2
2011,10,66380
2011,59,3249
2015,153,289
2015,311,30
2016,170,211
2010,183,76
2012,396,14
2010,258,25
2008,223,23
2014,336,28
2012,422,14
2011,1260,1
2015,741,1
2014,76,2146
2012,105,840
2010,138,233
2008,95,387
2010,614,2
2014,215,102
2013,376,18
2015,444,10
2011,369,6
2009,214,46
2015,371,13
2008,1704,1
2011,766,1
2015,1698,1
2016,685,1
2016,234,69
2015,44,7349
2014,31,14849
2014,20,33478
2016,349,16
2008,346,5
2011,550,5
2011,409,5
2016,652,2
2015,928,2
2015,720,1
2012,566,1
2009,1406,1
2009,20,26780
2012,295,29
2011,105,720
2016,117,610
2014,213,109
2014,288,36
2013,167,177
2012,339,17
2010,311,14
2015,243,77
2016,341,18
2013,537,5
2009,581,2
2013,1478,1
2008,469,2
2013,556,5
2014,538,4
2016,693,3
2012,548,1
2011,1575,1
2015,1130,1
2016,120,553
2014,271,39
2014,242,54
2016,292,22
2014,712,1
2009,110,466
2014,275,47
2014,319,35
2011,292,31
2011,281,28
2015,210,110
2014,484,10
2012,383,11
2014,546,5
2008,532,1
2013,878,1
2010,454,7
2016,604,3
2016,991,1
2014,683,4
2011,538,4
2012,892,1
2009,1548,1
2012,353,20
2011,284,37
2016,202,102
2011,288,27
2012,446,6
2010,473,4
2013,639,2
2010,1600,1
2015,717,1
2008,1383,1
2011,807,1
2012,827,1
2009,1,50710
2008,59,1818
2012,124,474
2016,156,254
2015,309,39
2012,445,11
2014,250,55
2015,336,21
2009,455,1
2012,518,4
2012,461,9
2012,298,25
2016,1063,1
2008,373,5
2008,287,7
2015,746,1
2014,1569,1
2013,834,1
2008,1911,1
2014,582,1
2016,82,1675
2014,207,94
2010,233,39
2015,1272,2
2009,183,91
2013,377,20
2014,379,11
2015,421,6
2015,616,2
2009,439,4
2011,339,13
2016,314,19
2014,544,3
2012,684,1
2015,1776,1
2009,654,1
2014,128,469
2011,91,1158
2011,344,17
2016,911,1
2010,547,3
2009,506,1
2008,445,4
2010,1456,1
2016,849,1
2013,967,1
2016,87,1452
2012,1,3523
2009,33,9479
2009,228,30
2016,176,155
2014,1678,1
2010,238,34
2010,243,33
2015,391,14
2016,764,1
2010,443,2
2015,570,3
2014,618,4
2013,592,2
2013,1013,1
2015,202,106
2012,222,95
2014,200,103
2008,114,192
2012,915,1
2012,379,15
2009,672,1
2013,441,12
2008,1079,1
2016,79,1850
2011,67,2464
2012,264,52
2016,230,77
2010,174,140
2012,288,21
2011,240,59
2013,243,50
2010,358,11
2011,318,13
2008,332,5
2008,587,1
2016,44,7405
2011,23,22870
2011,51,4730
2012,7,46769
2016,98,998
2011,285,36
2009,608,2
2015,374,21
2013,477,13
2015,354,26
2014,442,17
2012,286,37
2012,1445,1
2015,549,3
2015,573,7
2008,314,3
2010,414,5
2013,550,5
2010,715,1
2012,1521,1
2016,1593,1
2013,849,1
2016,1059,1
2014,679,1
2014,163,224
2012,140,364
2008,93,401
2015,240,65
2016,214,97
2011,650,5
2013,414,9
2009,385,7
2013,617,2
2015,1353,2
2014,556,3
2016,476,10
2013,439,4
2012,604,2
2012,615,7
2011,1245,1
2016,822,1
2016,57,4183
2016,109,719
2014,171,179
2016,210,110
2012,127,451
2010,103,668
2014,389,13
2009,314,13
2015,348,23
2016,330,33
2016,332,28
2014,585,2
2014,497,8
2015,509,3
2011,2821,1
2009,363,8
2014,347,16
2013,1418,1
2013,1309,1
2008,537,1
2016,116,562
2015,121,617
2013,116,611
2009,198,43
2015,179,190
2008,185,31
2012,716,3
2012,389,6
2014,781,1
2013,700,1
2012,500,5
2011,1825,1
2013,750,1
2016,12,73321
2015,50,5752
2014,45,7054
2008,50,2782
2014,155,287
2013,184,148
2012,210,96
2014,404,14
2012,322,17
2010,225,49
2011,566,3
2010,378,9
2016,718,2
2016,391,13
2014,19,35430
2012,187,131
2010,90,1056
2015,526,7
2011,1564,1
2014,277,54
2015,496,10
2013,358,16
2010,577,2
2011,591,1
2012,810,1
2009,444,1
2016,52,5178
2008,25,12596
2013,199,116
2014,374,15
2012,228,65
2009,200,54
2014,558,6
2011,374,9
2014,908,1
2016,401,13
2012,618,1
2014,612,2
2008,390,2
2011,63,3003
2015,68,2842
2015,113,753
2011,143,246
2009,165,79
2014,417,13
2013,228,74
2013,214,98
2011,202,78
2016,206,115
2013,329,22
2014,329,22
2016,263,59
2016,240,58
2011,280,24
2014,502,3
2014,628,1
2014,451,9
2016,725,1
2009,475,2
2015,625,3
2011,56,3717
2010,29,13679
2014,86,1557
2010,117,460
2011,135,343
2008,151,59
2013,369,18
2014,422,9
2014,1156,1
2013,375,15
2016,554,6
2015,373,12
2015,520,4
2009,319,7
2015,411,6
2008,418,1
2011,1240,1
2009,631,2
2016,795,2
2009,36,8105
2014,74,2295
2008,108,223
2012,316,19
2013,476,7
2011,634,4
2013,1318,1
2011,675,1
2012,1978,1
2015,239,76
2011,53,4305
2010,46,5319
2015,222,76
2008,159,64
2013,181,156
2009,164,96
2013,305,26
2012,236,64
2015,328,25
2012,367,15
2012,941,2
2012,231,54
2008,308,6
2016,293,35
2014,550,5
2016,1463,1
2008,296,4
2008,397,3
2009,585,2
2011,435,4
2011,528,5
2016,50,5637
2013,17,43057
2013,88,1400
2014,238,74
2015,165,197
2014,316,23
2009,217,39
2012,358,14
2010,268,27
2009,235,29
2016,441,6
2015,806,2
2009,652,1
2015,973,2
2014,829,2
2011,1301,2
2009,478,4
2012,593,3
2016,876,1
2013,687,1
2009,1193,1
2009,547,1
2016,1029,1
2014,14,60058
2010,35,9408
2015,72,2531
2009,76,1535
2016,153,231
2015,288,43
2008,354,3
2008,254,6
2012,475,9
2016,590,3
2015,757,1
2016,1254,1
2013,928,1
2009,15,44300
2008,13,44049
2014,161,223
2012,285,24
2012,302,29
2013,316,27
2012,292,32
2015,293,42
2009,289,12
2008,432,6
2013,981,1
2014,512,10
2012,540,5
2016,549,4
2011,647,2
2013,840,1
2016,2125,1
2013,1828,1
2009,22,21914
2010,12,67134
2015,101,1006
2016,168,226
2015,190,132
2011,364,12
2010,787,1
2012,3744,1
2015,601,1
2010,420,6
2010,470,2
2012,676,1
2013,720,1
2008,380,4
2011,504,4
2014,648,2
2014,737,2
2010,606,3
2011,772,1
2015,11,70192
2013,105,811
2012,147,278
2010,92,977
2016,372,25
2012,308,29
2013,761,3
2011,225,50
2013,247,42
2009,434,6
2008,744,1
2011,711,1
2011,573,1
2016,29,17248
2016,183,129
2015,10,65274
2010,43,6052
2010,54,3806
2010,165,137
2014,245,68
2015,327,21
2012,182,158
2016,642,4
2014,600,1
2016,690,1
2012,348,12
2015,736,1
2016,816,1
2012,2136,1
2016,889,1
2011,27,17417
2008,16,30182
2016,308,31
2015,256,46
2013,306,24
2010,372,15
2008,356,4
2012,512,7
2015,470,8
2011,472,6
2008,624,2
2012,1880,1
2011,425,6
2015,620,2
2013,914,1
2014,80,1854
2016,329,22
2014,174,177
2016,237,68
2012,203,108
2015,360,12
2011,302,34
2014,376,13
2011,561,3
2015,424,6
2013,608,1
2013,618,1
2011,655,1
2016,49,5911
2016,60,3735
2008,65,1364
2012,104,911
2015,334,34
2011,325,17
2013,950,2
2009,337,10
2014,1243,1
2008,374,2
2010,732,1
2015,341,19
2010,37,8192
2014,83,1677
2011,386,9
2015,191,126
2012,188,124
2009,149,149
2016,236,83
2009,195,46
2016,524,7
2016,721,2
2014,356,19
2010,762,1
2015,1474,1
2016,66,3035
2009,65,2188
2013,128,422
2009,94,811
2014,328,23
2013,313,29
2016,931,2
2009,541,1
2016,96,1144
2014,22,27705
2012,3,73964
2013,106,808
2015,145,341
2009,188,65
2008,205,25
2016,784,1
2009,288,26
2012,277,25
2009,616,1
2014,653,2
2012,600,1
2012,1106,1
2011,388,6
2008,413,2
2011,846,2
2008,468,1
2011,547,1
2011,1528,1
2011,1000,1
2013,1264,1
2011,912,1
2010,60,3118
2016,45,7266
2013,83,1639
2013,378,17
2013,382,17
2009,158,116
2011,783,2
2013,299,34
2012,430,7
2011,352,10
2014,791,4
2010,365,10
2012,875,1
2011,3926,1
2013,1081,1
2010,574,1
2013,605,2
2015,900,1
2012,794,1
2009,896,1
2009,62,2520
2008,30,9224
2016,474,6
2013,244,61
2010,558,5
2010,379,9
2012,529,6
2013,495,7
2013,444,9
2015,452,10
2012,1026,1
2015,958,1
2013,906,2
2016,42,8564
2016,154,240
2013,51,5273
2009,14,49647
2015,84,1730
2010,79,1558
2015,144,339
2011,316,21
2008,117,170
2016,186,147
2014,522,9
2008,230,8
2009,332,9
2015,251,74
2014,166,180
2016,175,151
2016,387,16
2011,385,13
2013,427,10
2008,336,4
2015,501,4
2013,558,5
2014,2096,1
2011,347,16
2015,497,8
2012,517,7
2009,715,2
2012,930,1
2013,458,6
2016,603,2
2009,633,3
2013,586,1
2010,600,3
2015,1010,1
2012,741,1
2013,756,1
2011,796,1
2015,561,2
2013,546,3
2014,756,2
2013,538,2
2016,624,2
2011,723,1
2016,1093,1
2016,100,979
2015,9,59897
2011,2,10506
2009,30,11906
2012,92,1243
2012,175,133
2010,215,52
2008,868,1
2011,404,5
2016,467,8
2010,387,8
2008,426,2
2013,1332,1
2010,53,3990
2014,2,10157
2010,152,170
2010,108,580
2016,434,17
2008,153,50
2009,250,22
2010,286,26
2014,801,1
2009,553,3
2008,357,5
2012,372,12
2012,770,1
2008,503,1
2016,1013,1
2010,27,16407
2011,139,286
2011,789,2
2016,392,20
2011,264,28
2014,415,7
2014,352,20
2014,586,7
2012,1490,1
2014,865,2
2011,718,1
2015,28,19016
2015,90,1494
2015,237,88
2008,196,25
2016,585,6
2008,207,23
2012,843,1
2016,894,1
2010,323,8
2011,358,18
2011,656,5
2008,307,5
2010,714,1
2010,849,2
2008,1688,1
2015,1117,1
2015,888,1
2012,889,1
2016,209,99
2008,10,61637
2010,322,17
2009,140,206
2012,156,233
2010,164,138
2014,365,12
2010,318,10
2011,452,8
2011,727,2
2016,1070,1
2015,648,1
2016,555,3
2014,562,5
2008,382,3
2009,481,3
2014,1330,1
2008,64,1492
2014,165,212
2016,381,21
2009,248,22
2011,209,73
2012,198,115
2009,249,35
2011,295,15
2009,225,26
2010,224,51
2016,560,5
2011,898,1
2016,370,15
2014,569,4
2014,494,5
2011,500,6
2015,878,2
2009,1199,1
2008,680,1
2008,490,1
2011,1434,1
2010,601,1
2016,77,2050
2015,42,8555
2012,56,4207
2009,241,22
2016,356,17
2013,432,9
2010,708,2
2008,353,5
2010,559,6
2015,1007,1
2013,711,2
2016,978,1
2016,5,38362
2015,17,43587
2013,104,837
2016,115,628
2014,605,5
2015,304,36
2014,536,3
2010,755,1
2013,412,9
2016,534,2
2015,542,3
2014,100,947
2010,180,77
2014,264,47
2011,192,96
2011,370,10
2011,269,38
2008,113,203
2016,517,3
2013,661,1
2011,568,3
2009,362,7
2009,1176,2
2015,1282,1
2015,1013,1
2013,596,2
2008,396,2
2016,20,34045
2010,126,396
2008,77,805
2011,268,31
2014,210,102
2013,283,32
2016,843,2
2010,519,2
2012,2259,1
2010,1135,1
2013,816,1
2012,713,2
2011,731,1
2015,116,621
2013,330,25
2012,317,20
2013,366,22
2011,483,4
2016,394,14
2011,515,2
2012,677,2
2011,636,3
2008,133,104
2011,235,51
2009,442,7
2014,362,15
2014,1360,2
2012,754,1
2016,676,1
2014,447,7
2011,349,13
2015,278,40
2014,396,20
2008,237,12
2016,437,16
2008,449,8
2015,450,6
2016,724,1
2010,1468,1
2015,723,2
2016,621,2
2012,932,1
2012,852,1
2015,275,49
2013,149,271
2010,190,76
2009,227,39
2009,295,15
2010,914,1
2014,907,1
2012,871,2
2014,1267,1
2010,823,1
2012,1403,1
2013,461,11
2009,222,48
2016,636,4
2013,669,2
2010,349,12
2013,802,4
2016,761,2
2013,335,16
2014,622,4
2013,810,1
2014,950,1
2013,731,1
2013,1178,1
2010,544,1
2015,45,7268
2013,257,65
2009,190,54
2009,220,34
2015,481,7
2012,444,9
2014,261,54
2015,416,13
2012,942,1
2016,488,6
2015,718,7
2010,616,1
2010,371,11
2015,703,3
2012,412,5
2013,630,4
2015,627,3
2013,864,1
2016,92,1207
2012,10,66774
2015,393,11
2012,143,301
2011,199,100
2016,480,9
2011,1696,1
2011,690,1
2013,1872,1
2014,510,9
2015,624,2
2009,536,1
2015,686,1
2014,814,1
2013,1886,1
2014,148,306
2016,289,39
2015,258,53
2009,251,27
2015,1059,1
2015,600,3
2016,369,8
2016,412,10
2013,1292,1
2012,639,2
2012,551,1
2012,456,7
2012,726,2
2012,1142,1
2016,720,1
2015,562,2
2014,317,34
2009,52,3801
2012,91,1234
2010,128,317
2010,1131,1
2015,376,19
2013,806,2
2011,695,1
2008,485,1
2016,708,1
2009,901,1
2016,102,935
2008,101,309
2012,213,79
2015,400,13
2014,1093,1
2011,350,21
2009,264,12
2010,302,10
2016,588,1
2015,31,15235
2013,290,33
2012,526,6
2013,230,61
2016,386,16
2010,298,18
2013,1312,1
2013,633,3
2010,543,3
2013,1285,1
2015,550,4
2015,1071,1
2016,937,1
2014,237,71
2009,51,3874
2015,169,214
2009,125,284
2013,176,144
2012,248,47
2016,306,21
2014,490,5
2010,382,5
2009,492,4
2013,1340,1
2015,489,8
2008,576,2
2012,924,1
2011,565,2
2013,794,1
2012,714,1
2015,466,8
2011,47,5547
2013,161,232
2012,177,164
2014,564,4
2016,295,38
2015,629,2
2009,353,10
2013,701,2
2016,559,3
2013,770,1
2014,252,59
2008,167,39
2012,781,1
2012,179,159
2008,120,138
2013,422,8
2011,243,51
2014,561,3
2010,506,3
2015,378,17
2008,349,2
2014,689,2
2014,2031,1
2011,1798,1
2015,591,2
2009,71,1737
2016,148,298
2015,248,66
2016,203,114
2008,193,34
2011,230,44
2016,707,5
2012,1201,1
2009,425,3
2014,425,9
2013,880,2
2011,507,3
2010,546,2
2012,1257,1
2014,939,1
2009,172,100
2009,219,41
2008,72,1031
2008,173,44
2008,748,1
2011,276,35
2012,587,3
2008,247,10
2012,312,19
2015,613,3
2015,907,2
2016,377,23
2008,291,9
2016,552,7
2014,489,7
2013,532,5
2016,1172,1
2009,819,1
2014,999,1
2010,935,1
2009,23,20185
2009,26,16070
2012,340,26
2013,204,96
2015,731,2
2012,249,48
2009,911,1
2013,858,1
2008,571,2
2011,794,1
2013,530,1
2014,1357,1
2015,815,2
2011,627,3
2011,801,1
2014,46,6684
2011,203,77
2016,280,44
2014,434,13
2014,333,29
2013,406,6
2014,656,5
2015,462,7
2009,351,13
2015,1426,1
2008,770,1
2013,654,5
2013,2136,1
2011,680,2
2009,473,2
2015,774,1
2013,902,1
2014,661,2
2012,854,1
2015,38,10020
2012,58,3796
2012,15,53053
2014,71,2470
2013,137,340
2011,125,413
2011,136,315
2010,95,906
2009,157,129
2014,513,3
2011,266,31
2014,634,5
2015,690,3
2008,369,4
2015,722,2
2016,1065,1
2014,13,65521
2014,187,136
2013,72,2354
2012,146,293
2009,502,2
2016,283,44
2012,313,26
2011,698,1
2016,846,1
2016,1911,1
2008,269,15
2013,475,6
2014,301,30
2015,577,4
2009,462,1
2013,484,10
2015,541,3
2010,419,3
2013,670,2
2015,35,11852
2013,73,2210
2009,126,280
2012,137,359
2015,271,38
2016,529,6
2012,380,13
2012,273,40
2013,517,8
2015,465,5
2008,729,1
2014,956,1
2015,760,1
2010,58,3226
2015,397,14
2008,134,113
2012,334,23
2016,466,6
2013,346,19
2015,568,3
2016,806,1
2013,1220,1
2015,729,2
2009,579,1
2013,809,1
2009,678,1
2010,15,46765
2015,182,145
2015,91,1361
2014,87,1430
2012,49,5516
2009,91,858
2015,372,23
2016,468,11
2012,1595,1
2009,454,6
2009,835,1
2011,531,3
2014,1568,1
2014,1176,1
2011,42,7111
2009,63,2399
2012,78,1984
2011,121,516
2014,241,67
2011,260,34
2013,635,2
2008,140,83
2014,486,9
2009,265,21
2014,395,17
2009,414,6
2011,494,5
2009,477,8
2014,807,2
2015,669,1
2013,383,27
2016,245,65
2016,274,53
2012,465,8
2015,564,3
2009,618,1
2008,567,2
2010,668,2
2015,923,1
2012,54,4531
2009,144,195
2008,298,9
2015,367,28
2013,407,9
2016,461,12
2013,587,3
2010,418,7
2013,777,2
2012,556,2
2014,218,94
2013,1598,1
2008,402,5
2015,319,25
2014,279,38
2010,341,10
2012,407,9
2012,555,4
2015,641,2
2010,775,2
2010,516,2
2013,667,2
2016,83,1684
2013,45,6869
2011,60,3291
2010,47,5016
2015,130,458
2014,101,1026
2008,118,153
2014,193,127
2012,357,12
2016,398,18
2016,251,61
2010,647,1
2015,1284,2
2015,507,6
2015,1041,1
2011,362,9
2011,578,2
2014,1570,1
2014,849,1
2011,4597,1
2011,707,1
2015,4,44109
2015,134,475
2013,255,61
2009,215,52
2011,431,6
2015,434,16
2016,649,2
2009,255,20
2009,480,6
2009,529,1
2016,752,1
2010,900,1
2015,632,2
2009,58,2861
2013,198,97
2012,346,10
2008,420,3
2014,464,7
2016,557,4
2016,1184,1
2011,640,2
2015,940,1
2016,36,11954
2012,5,42581
2009,232,43
2016,128,439
2014,195,114
2015,229,91
2008,897,1
2008,277,9
2012,423,5
2015,381,13
2009,504,2
2010,916,2
2015,3035,1
2010,594,2
2016,143,297
2011,28,16607
2010,42,6537
2013,302,29
2016,521,5
2016,511,4
2014,337,18
2008,361,2
2012,757,2
2011,533,3
2013,454,4
2015,734,1
2011,620,1
2011,1553,1
2014,42,8280
2009,127,274
2015,379,11
2009,325,11
2015,173,184
2009,210,44
2016,551,6
2012,278,37
2009,366,6
2011,371,13
2012,428,9
2015,711,1
2014,427,8
2008,919,1
2008,830,1
0,22,1
2015,890,1
2015,595,1
2012,1294,1
2015,53,4949
2010,52,4230
2011,329,20
2009,587,2
2014,904,3
2010,449,6
2009,424,8
2011,540,8
2014,1789,1
2012,474,9
2011,754,1
2011,1007,1
2008,581,1
2013,691,2
2015,493,10
2013,58,3917
2009,60,2738
2015,2,9610
2014,112,674
2016,162,219
2012,490,6
2009,221,39
2014,325,27
2015,392,17
2015,296,36
2013,373,19
2009,368,12
2010,406,6
2015,425,8
2016,72,2426
2015,47,6469
2015,80,1879
2014,152,266
2010,145,214
2011,348,16
2011,459,10
2011,394,11
2015,313,20
2015,438,9
2012,583,5
2011,601,1
2016,568,3
2011,701,2
2015,964,1
2014,230,80
2015,37,10355
2014,169,187
2010,204,64
2014,182,173
2012,323,16
2011,336,12
2012,531,6
2012,682,1
2009,284,14
2013,429,9
2012,1066,1
2008,348,4
2011,716,1
2009,1382,1
2010,667,1
2016,32,14769
2016,18,41003
2013,146,278
2016,198,123
2012,218,68
2013,487,8
2014,391,12
2014,393,13
2014,944,1
2008,252,15
2011,475,4
2012,832,2
2013,500,5
2010,779,1
2009,523,1
2015,1365,1
2008,28,10351
2008,46,3441
2014,68,2854
2010,209,74
2014,456,8
2010,290,18
2016,281,37
2010,259,24
2015,445,8
2010,392,8
2014,322,22
2010,455,3
2010,622,1
2010,1670,1
2016,967,1
2008,870,1
2013,1978,1
2015,109,769
2012,246,52
2011,173,119
2009,121,315
2010,141,237
2014,481,8
2014,727,2
2015,643,1
2014,695,2
2016,1220,1
2011,443,2
2011,13,61700
2009,35,8752
2010,2,11848
2011,987,1
2013,411,17
2008,435,1
2011,644,1
2008,518,2
2010,1005,1
2014,654,3
2013,548,7
2008,568,4
2010,26,17395
2010,18,33755
2013,82,1708
2011,92,1108
2011,94,1077
2011,149,240
2012,266,42
2013,347,17
2013,790,1
2009,607,1
2014,394,14
2013,927,2
2015,1351,1
2010,556,5
2012,821,2
2016,540,3
2011,2274,1
2012,588,2
2013,862,1
2016,7,41364
2013,61,3426
2016,275,46
2011,261,35
2015,280,39
2013,288,39
2016,687,5
2009,561,2
2008,506,1
2016,104,903
2011,22,24997
2013,156,228
2009,134,250
2008,125,124
2012,387,13
2009,204,55
2015,361,25
2013,234,70
2013,349,21
2011,682,2
2014,985,2
2010,465,6
2015,963,1
2013,739,3
2012,532,3
2010,860,2
2008,746,1
2014,426,7
2015,33,13526
2013,6,52170
2011,106,754
2011,83,1458
2009,117,362
2014,259,43
2013,249,48
2010,287,16
2013,1753,1
2012,336,15
2012,442,9
2016,339,32
2008,525,3
2011,729,1
2011,1103,1
2014,1400,1
2015,922,1
2015,1414,1
2016,1103,1
2016,125,545
2013,50,5332
2009,48,4542
2013,182,153
2009,315,12
2015,233,81
2009,294,18
2012,471,7
2010,480,2
2013,512,2
2014,876,1
2009,432,4
2012,732,1
2011,805,1
2012,865,1
2013,960,1
2016,2020,1
2011,175,155
2009,119,344
2008,73,966
2014,254,50
2013,265,49
2014,257,53
2014,386,16
2013,514,4
2015,1033,2
2014,387,11
2015,692,1
2008,431,3
2015,540,5
2010,700,1
2008,279,6
2011,527,5
2010,602,1
2015,1099,1
2011,40,7684
2013,89,1365
2011,224,72
2015,259,60
2008,271,16
2009,333,10
2015,423,14
2009,230,23
2013,462,4
2010,370,7
2010,638,2
2015,499,9
2015,532,7
2011,488,4
2013,506,7
2016,451,5
2012,1586,1
2011,37,8822
2015,131,433
2014,96,1221
2014,270,40
2012,219,76
2009,316,12
2015,414,12
2012,636,1
2013,575,3
2009,892,1
2016,646,2
2016,775,1
2008,600,1
2016,235,69
2016,196,134
2009,347,11
2012,510,3
2012,734,1
2016,294,29
2009,726,1
2013,1025,1
2012,813,1
2014,847,2
2013,1146,1
2013,717,1
2015,16,50332
2016,359,14
2015,235,50
2013,139,354
2009,277,19
2014,390,12
2013,519,3
2010,863,1
2008,306,9
2013,644,1
2016,28,19283
2014,400,13
2015,59,3904
2008,42,4350
2009,148,176
2008,175,41
2014,886,2
2016,1335,1
2014,584,2
2016,710,1
2014,124,522
2010,122,363
2013,118,573
2016,615,4
2008,673,1
2013,253,43
2008,288,7
2013,438,8
2014,607,3
2013,890,1
2010,487,2
2009,708,1
2015,1245,1
2008,752,1
2013,208,93
2014,106,860
2011,108,665
2008,86,532
2014,240,61
2010,167,144
2011,442,7
2013,206,80
2008,219,18
2016,490,6
2010,661,2
2012,788,2
2008,3,39384
2011,259,47
2012,174,161
2011,283,33
2014,244,66
2010,367,9
2011,485,6
2014,778,2
2015,1042,2
2013,559,3
2010,466,5
2014,549,4
2011,1171,1
2013,904,1
2010,501,2
2014,6796,1
2011,9,62944
2015,139,350
2014,183,161
2013,594,2
2011,300,15
2008,295,5
2016,242,57
2012,849,1
2012,382,8
2010,330,7
2013,529,6
2011,338,14
2016,393,15
2015,944,1
2011,462,9
2011,2166,1
2015,527,6
2014,471,5
2016,2778,1
2012,530,1
2009,679,2
2009,817,1
2015,1634,1
2010,607,1
2010,48,5017
2008,57,1890
2015,273,44
2015,403,12
2008,170,45
2015,282,51
2010,309,13
2012,655,3
2015,387,13
2013,1202,1
2013,657,5
2010,884,2
2009,904,1
2012,1434,1
2015,787,2
2011,855,2
2008,639,1
2010,464,3
2009,874,1
2014,115,674
2011,117,505
2015,151,263
2008,210,19
2014,625,3
2011,407,10
2009,423,5
2013,697,2
2009,575,4
2010,632,2
2008,423,1
2010,272,25
2013,223,79
2016,177,188
2016,316,33
2011,249,43
2011,326,16
2012,282,34
2010,504,3
2016,350,20
2011,428,9
2014,430,11
2012,360,16
2015,1072,1
2016,58,4008
2013,27,19127
2011,49,5125
2012,27,18648
2009,155,139
2011,319,20
2011,181,113
2010,186,75
2014,408,14
2014,334,25
2014,444,5
2014,410,16
2016,569,5
2010,623,2
2010,1259,1
2013,600,1
2012,976,1
2010,553,1
2014,1134,1
2008,872,1
2015,14,60663
2015,39,9828
2013,1505,1
2010,159,153
2012,260,47
2013,274,36
2009,162,108
2010,391,10
2009,254,30
2010,227,45
2009,299,13
2010,1066,2
2014,474,8
2012,457,4
2008,334,3
2016,70,2623
2012,84,1551
2013,178,156
2015,383,20
2015,208,91
2016,1057,1
2015,581,4
2013,390,11
2008,339,2
2010,549,2
2012,900,1
2008,256,9
2016,340,18
2010,458,3
2011,427,10
2016,374,15
2015,739,1
2008,363,1
2015,2240,1
2015,2367,1
2011,45,6241
2011,206,76
2012,261,47
2011,631,3
2016,324,26
2010,189,77
2014,330,18
2014,289,35
2008,565,1
2009,757,1
2008,589,1
2014,631,2
2016,1117,1
2016,88,1421
2015,49,5823
2009,130,238
2011,363,11
2011,412,9
2016,288,37
2008,216,19
2016,334,27
2016,738,4
0,4,1
2011,383,4
2010,408,6
2010,785,1
2009,900,1
2011,1609,1
2014,751,1
2011,1052,1
2016,204,90
2012,38,9126
2010,44,5954
2012,399,13
2012,692,1
2010,121,405
2016,200,122
2011,441,4
2015,609,3
2013,606,4
2010,474,3
2011,792,1
2009,558,2
2012,695,1
2016,317,35
2009,3,62967
2015,65,3114
2013,110,717
2010,113,520
2016,134,421
2012,725,1
2008,362,4
2012,458,9
2016,484,11
2015,781,2
2008,410,1
2014,596,1
2014,525,1
2015,43,7776
2010,67,2283
2013,71,2472
2009,81,1198
2014,233,71
2013,169,175
2010,157,162
2012,375,15
2014,438,9
2008,200,28
2014,446,11
2016,403,12
2010,735,1
2008,220,18
2014,591,2
2010,503,1
2015,1953,1
2016,38,9950
2010,6,53975
2014,122,555
2016,469,3
2015,531,8
2015,384,23
2014,509,2
2010,525,2
2014,532,3
2009,50,4099
2015,96,1165
2012,190,130
2012,117,577
2009,101,632
2015,207,124
2010,185,91
2010,260,23
2016,1359,1
2012,1078,1
2016,772,1
2009,518,3
2013,1059,2
2013,442,9
2008,14,39246
2015,97,1136
2011,124,446
2013,309,22
2012,181,133
2008,492,2
2009,482,3
2009,393,8
2014,468,7
2009,276,11
2010,380,7
2010,256,30
2008,580,1
2014,419,14
2013,1047,1
2016,647,3
2013,3607,1
2014,1019,1
2011,767,1
2011,931,1
2015,689,1
2011,41,7265
2010,51,4360
2013,115,633
2011,193,91
2011,241,37
2012,398,12
2009,403,6
2013,343,15
2016,565,4
2014,308,29
2010,241,28
2010,515,4
2015,369,16
2013,399,9
2015,535,4
2011,429,8
2016,449,8
2010,450,3
2013,1615,1
2015,1167,1
2016,193,144
2011,34,10810
2012,290,26
2012,97,1047
2011,122,437
2010,71,1987
2016,149,268
2011,453,10
2014,428,10
2008,443,2
2008,253,14
2011,1371,1
2008,302,8
2016,1435,1
2014,953,1
2016,11,69889
2010,88,1111
2011,54,4327
2016,179,153
2016,215,107
2015,262,55
2010,777,1
2012,275,30
2014,368,24
2013,2923,1
2016,858,1
2012,417,9
2012,391,5
2010,441,3
2015,1289,1
2008,500,1
2009,21,23685
2011,70,2265
2011,177,139
2010,493,7
2012,216,92
2008,310,6
2012,410,6
2013,395,9
2010,598,1
2013,513,6
2012,431,10
2009,283,17
2011,720,1
2011,648,2
2011,928,1
2013,503,5
2016,810,3
2015,765,1
2012,483,5
2015,966,1
2011,572,1
2014,1253,1
2016,1072,1
2015,36,11704
2013,30,16201
2010,350,12
2010,85,1281
2010,198,81
2013,374,12
2012,421,9
2009,395,5
2014,492,5
2010,319,8
2015,2402,1
2014,671,2
2014,795,1
2013,748,1
2008,463,1
2013,26,20769
2013,96,1109
2012,325,16
2008,447,4
2016,407,13
2010,679,1
2012,809,1
2009,526,3
2012,1148,1
2013,907,2
2008,606,1
2015,1046,1
2010,1120,1
2008,557,1
2012,45,6647
2013,84,1607
2012,120,570
2009,77,1459
2015,103,975
2016,573,6
2016,260,50
2008,345,5
2010,404,7
2012,570,5
2015,619,3
2009,338,10
2016,2205,1
2008,60,1822
2015,137,399
2013,113,684
2013,138,334
2008,212,28
2016,357,20
2010,276,21
2014,321,22
2011,250,50
2013,360,22
2015,740,2
2008,475,5
2013,886,1
2015,523,4
2011,1134,1
2010,554,1
2014,98,1125
2012,233,59
2011,340,17
2012,414,21
2010,537,8
2012,413,13
2014,526,4
2014,360,20
2008,250,7
2008,391,4
2015,473,5
2008,482,1
2012,1029,1
2014,802,1
2015,83,1724
2015,111,741
2010,146,210
2008,69,1157
2008,103,291
2013,232,59
2014,251,50
2015,672,2
2010,1132,2
2016,830,1
2016,607,1
2016,22,28700
2015,189,143
2012,86,1520
2011,98,908
2014,253,64
2016,404,11
2013,854,2
2014,528,4
2009,1100,1
2010,467,6
2016,645,3
2010,879,2
2013,627,1
2016,681,1
2011,929,1
2008,29,9445
2011,97,928
2014,248,64
2014,505,7
2016,550,2
2008,596,1
2015,626,1
2012,1303,1
2010,21,25638
2008,6,51029
2013,68,2780
2008,76,858
2009,138,189
2011,359,15
2015,551,4
2011,423,11
2014,531,7
2014,617,3
2013,578,5
2016,706,1
2011,545,4
2015,883,1
2009,532,3
2015,840,1
2016,497,6
2012,331,18
2014,523,4
2015,301,36
2010,1246,1
2010,304,19
2012,281,41
2008,477,3
2013,843,1
2011,934,1
2016,1387,1
2016,51,5495
2009,31,11161
2013,163,214
2014,202,119
2011,152,233
2015,290,36
2008,318,7
2015,329,24
2014,1043,1
2009,243,29
2013,418,12
2014,533,8
2010,427,6
2011,535,2
2009,412,3
2013,706,1
2013,1585,1
2016,671,2
2014,828,1
2010,660,1
2014,220,85
2013,120,574
2013,196,111
2014,292,32
2009,409,6
2012,1558,1
2014,565,5
2010,445,7
2008,415,2
2012,711,2
2015,505,4
2011,1545,1
2016,732,3
2015,868,1
2012,2325,1
2014,1076,1
2015,23,25731
2015,29,17246
2014,50,5600
2011,78,1791
2009,323,12
2016,243,58
2013,172,157
2011,232,46
2012,324,20
2015,408,13
2012,256,49
2009,499,2
2009,537,4
2014,583,4
2014,575,6
2015,937,1
2013,788,1
2010,880,1
2014,26,21108
2009,18,31241
2015,154,238
2013,131,451
2016,227,61
2010,307,12
2016,562,3
2012,527,4
2014,480,6
2013,611,1
2015,802,1
2015,263,48
2009,281,20
2016,342,13
2013,289,41
2016,184,127
2011,312,20
2009,203,47
2016,666,2
2013,423,10
2013,410,10
2014,882,1
2011,525,1
2016,614,2
2011,768,2
2014,870,1
2015,1009,1
2012,1070,1
2013,868,1
2012,69,2560
2013,268,54
2008,146,78
2011,190,116
2013,338,15
2010,478,4
2010,599,5
2015,506,7
2016,546,3
2016,804,1
2010,584,1
2012,495,4
2013,456,4
2009,648,1
2010,520,1
2016,855,1
2012,1299,1
2016,137,381
2015,25,22450
2013,35,11309
2010,202,67
2009,139,183
2016,278,54
2012,664,3
2010,438,5
2015,605,2
2008,245,4
2012,801,1
2008,466,1
2010,1022,1
2016,15,56748
2016,131,438
2013,262,38
2012,215,79
2012,262,53
2011,258,40
2016,430,10
2016,500,4
2011,654,1
2015,1116,1
2015,94,1237
2014,170,206
2014,324,23
2010,253,30
2014,164,204
2010,270,25
2015,508,6
2015,683,1
2016,893,1
2016,662,1
2015,905,2
2016,538,1
2011,887,1
2009,985,1
2009,1884,1
2010,325,9
2014,541,3
2008,257,11
2008,491,2
2014,454,6
2010,542,6
2011,381,11
2008,383,7
2015,588,5
2011,652,2
2009,568,2
2009,691,1
2012,1032,1
2015,794,1
2016,493,5
2012,44,6823
2014,65,3093
2011,244,50
2008,83,615
2011,378,12
2016,337,34
2012,485,6
2015,3774,1
2013,471,9
2013,368,15
2010,609,1
2014,354,17
2009,374,10
2015,751,2
2013,846,2
2009,431,4
2012,622,2
2014,752,1
2015,556,3
2014,659,1
2013,566,3
2013,570,1
2015,115,625
2011,161,156
2011,162,195
2010,279,27
2015,460,13
2016,742,3
2013,372,13
2008,337,6
2015,1750,1
2011,590,1
2016,610,1
2012,484,4
2014,48,6367
2015,69,2815
2014,61,3610
2014,293,23
2015,453,12
2013,832,1
2015,446,11
2015,864,2
2015,464,10
2010,1311,1
2014,1199,1
2016,653,2
2014,4,44117
2014,5,40815
2012,259,35
2010,105,661
2010,127,334
2008,276,11
2016,321,32
2008,338,7
2016,983,1
2016,486,10
2010,545,5
2014,713,1
2009,597,2
2012,1024,1
2012,815,1
2013,1554,1
2015,716,1
2016,90,1433
2016,10,63619
2010,65,2426
2014,63,3312
2013,310,27
2012,561,3
2016,352,23
2016,985,1
2012,514,3
2016,439,7
2012,791,1
2016,785,1
2010,11,66999
2010,30,13336
2012,90,1269
2011,80,1622
2016,194,117
2015,199,116
2014,340,20
2008,204,33
2009,493,1
2014,217,96
2009,732,1
2008,671,1
2009,545,4
2013,1148,1
2011,556,3
2016,999,1
2015,1827,1
2015,617,1
2013,275,43
2009,129,279
2010,151,203
2011,189,101
2009,402,9
2009,312,8
2008,667,1
2013,784,1
2016,574,6
2009,453,3
2009,470,5
2010,773,1
2014,703,1
2013,4,44804
2013,38,9669
2013,552,6
2012,2,10483
2010,9,62013
2011,86,1249
2011,72,2126
2014,176,177
2015,474,7
2010,336,14
2010,326,12
2015,364,17
2012,304,21
2008,1184,1
2016,765,1
2011,659,3
2016,89,1370
2015,834,1
2009,326,15
2008,123,158
2008,182,30
2013,844,1
2012,503,5
2009,335,4
2011,625,1
2016,943,2
2016,513,2
2014,963,1
2010,569,2
2015,559,2
2015,82,1800
2011,168,140
2016,239,60
2015,974,2
2011,596,3
2012,553,5
2014,507,4
2008,347,7
2012,784,2
2016,767,2
2014,1269,1
2016,312,43
2015,598,3
2011,353,20
2015,538,5
2011,786,1
2010,492,2
2013,853,1
2012,573,2
2009,1573,1
2013,923,1
2016,993,1
2014,97,1093
2012,144,307
2008,286,7
2012,480,3
2013,312,23
2009,1150,1
2016,309,28
2012,463,2
2014,453,9
2008,259,11
2010,593,1
2008,408,1
2016,1020,1
2011,717,1
2015,993,1
2011,58,3470
2009,43,5614
2008,255,13
2016,126,429
2015,265,61
2014,947,1
2012,355,13
2015,563,4
2015,349,15
2013,3136,1
2012,1021,1
2009,46,4826
2010,134,291
2014,226,73
2009,511,1
2016,2116,1
2014,915,1
2013,398,10
2011,897,1
2013,576,5
2011,510,3
2010,845,1
2008,709,1
2014,1101,1
2016,159,234
2015,147,314
2011,102,822
2015,156,249
2011,469,9
2016,252,40
2015,284,33
2015,398,15
2016,447,8
2008,203,22
2016,290,38
2014,382,14
2011,406,6
2008,266,4
2016,828,1
2008,558,1
2008,331,4
2013,959,1
2011,678,1
2012,675,2
2013,132,392
2010,181,90
2013,215,90
2014,380,22
2016,570,8
2008,416,2
2013,623,4
2012,738,3
2010,680,2
2009,766,1
2016,691,2
2016,1062,1
2014,856,1
2016,63,3357
2012,75,2171
2011,93,1052
2008,124,154
2011,183,124
2009,202,57
2013,379,20
2008,199,24
2013,860,2
2012,525,9
2016,457,9
2015,691,1
2010,410,5
2011,646,1
2011,437,6
2016,973,1
2015,2310,1
2016,759,1
2015,52,5303
2014,483,4
2013,431,16
2010,366,15
2014,290,42
2016,343,29
2016,458,5
2011,752,2
2014,491,5
2010,926,1
2013,1221,1
2013,1892,1
2012,36,10976
2014,78,2057
2013,391,13
2011,256,36
2012,541,4
2011,272,33
2010,343,7
2009,348,7
2013,660,2
2009,436,7
2009,535,3
2016,498,3
2010,374,4
2015,1401,1
2011,843,1
2015,1471,1
2008,476,1
2013,900,1
2012,29,15957
2015,158,264
2010,187,101
2010,80,1372
2015,192,140
2015,170,198
2011,449,9
2010,348,12
2012,326,23
2008,264,5
2009,620,2
2016,436,8
2013,320,36
2010,347,11
2010,437,4
2015,12,73309
2015,24,25511
2010,179,93
2015,171,212
2013,130,426
2009,205,52
2014,335,26
2011,366,17
2012,319,18
2013,259,38
2015,590,2
2012,385,12
2010,385,12
2010,644,1
2009,438,6
2009,399,6
2013,1567,1
2013,1260,2
2016,996,1
2014,1543,1
2011,672,2
2012,37,9869
2008,190,29
2009,637,2
2011,883,1
2010,709,2
2015,687,2
2014,530,4
2013,705,3
2008,379,3
2014,724,3
2012,1174,1
2012,2788,1
2009,488,1
2008,630,1
2016,774,1
2014,610,1
2012,130,417
2012,158,217
2015,198,116
2008,137,70
2015,270,47
2009,426,7
2014,291,48
2012,3075,1
2013,479,1
2012,929,2
2013,710,3
2012,662,1
2012,516,4
2015,793,2
2016,801,2
2011,811,1
2014,25,22110
2012,26,20058
2013,70,2615
2013,93,1206
2009,72,1724
2011,228,62
2013,213,96
2008,165,41
2015,261,44
2010,210,62
2013,452,10
2009,260,25
2015,571,6
2015,417,8
2011,1078,1
2011,513,2
2014,657,3
2009,615,4
2014,361,26
2012,8,56870
2008,37,5529
2011,156,177
2010,275,25
2015,253,57
2013,311,26
2008,385,2
2014,498,8
2012,565,1
2008,944,1
2015,860,1
2012,958,1
2016,1027,1
2013,871,1
2013,119,538
2015,245,58
2013,387,14
2010,529,2
2008,1032,1
2012,621,1
2013,702,1
2010,677,1
2016,1244,1
2009,653,2
2011,1033,1
2016,41,8526
2010,89,1116
2014,185,151
2009,185,67
2009,175,79
2010,231,45
2013,474,11
2015,778,3
2012,560,2
2011,298,15
2014,800,1
2014,437,8
2011,643,2
2009,466,3
2016,771,1
2014,1564,1
2011,343,16
2010,429,3
2009,491,4
2010,500,3
2011,595,3
2015,611,1
2015,637,1
2016,55,4580
2008,7,52118
2011,120,499
2008,128,115
2012,291,27
2016,823,2
2014,436,9
2015,735,2
