year,Nb_sejoursSSR_ind,count
2014,11,21
2014,72,1
2016,6,127
2011,38,1
2012,20,9
2016,1,33855
2010,24,3
2017,33,1
2017,44,1
2017,53,1
2014,10,27
2011,33,1
2017,21,14
2016,13,13
2009,19,4
2015,70,1
2012,83,1
2010,31,1
2013,21,8
2012,14,7
2011,14,7
2014,17,8
2015,78,1
2012,11,18
2016,27,1
2011,12,6
2009,16,6
2016,21,12
2018,72,1
2013,34,1
2018,26,3
2014,43,2
2016,53,2
2013,39,2
2017,10,29
2017,35,1
2012,22,6
2018,32,2
2009,45,2
2010,25,1
2015,34,2
2016,8,53
2013,7,62
2012,51,1
2017,16,10
2013,10,15
2013,28,2
2018,25,6
2013,18,7
2014,41,3
2016,16,11
2016,24,2
2016,40,1
2015,18,9
2015,15,15
2014,27,3
2017,8,56
2011,44,3
2012,95,1
2017,46,1
2012,23,2
2017,15,13
2010,23,2
2014,38,1
2012,17,6
2009,34,1
2018,39,1
2018,16,9
2014,35,1
2014,16,11
2012,18,7
2009,38,1
2009,12,16
2014,47,1
2016,23,3
2013,5,222
2014,29,2
2015,21,5
2012,16,6
2014,24,6
2017,9,32
2011,21,7
2012,79,1
2012,4,548
2014,6,95
2016,35,1
2018,56,1
2014,51,1
2018,11,19
2011,19,2
2010,39,1
2017,25,2
2010,17,6
2009,25,1
2013,41,1
2018,58,1
2017,6,126
2010,5,165
2016,19,8
2018,17,9
2016,2,6969
2010,3,1482
2018,10,16
2017,20,18
2017,34,2
2009,10,22
2015,66,1
2015,5,221
2011,25,3
2017,30,1
2015,71,1
2016,99,1
2009,28,3
2010,41,2
2013,29,3
2011,11,7
2013,19,5
2014,7,62
2017,3,1801
2016,25,1
2011,31,1
2010,4,496
2012,13,11
2018,41,1
2018,13,10
2014,32,1
2018,27,1
2010,28,1
2016,31,1
2013,1,32618
2011,5,219
2009,5,209
2014,34,1
2009,42,1
2010,13,5
2010,8,32
2018,34,1
2017,19,9
2014,12,18
2013,13,13
2016,4,636
2012,34,1
2009,2,5904
2015,20,20
2015,55,1
2013,8,41
2009,44,1
2011,64,1
2017,11,12
2011,6,106
2018,21,9
2014,21,12
2012,24,3
2018,6,120
2012,32,1
2017,14,8
2013,15,8
2011,4,570
2018,5,264
2009,40,2
2014,15,12
2011,1,31209
2016,30,2
2009,24,3
2014,28,1
2015,3,1865
2015,19,25
2018,18,13
2015,27,6
2014,37,1
2009,17,1
2010,19,4
2009,11,18
2017,45,2
2018,35,2
2013,24,3
2010,20,8
2017,12,14
2011,17,7
2010,10,17
2018,9,31
2012,6,105
2011,20,8
2013,23,7
2012,30,1
2017,43,1
2014,3,1721
2011,24,2
2013,22,8
2018,8,38
2011,7,52
2014,30,3
2014,39,2
2013,9,30
2018,20,21
2011,26,2
2010,7,50
2013,37,2
2010,1,30011
2018,44,1
2011,73,1
2014,18,12
2016,37,1
2017,7,81
2012,35,1
2015,76,1
2009,9,32
2011,15,9
2009,6,119
2018,30,2
2009,8,37
2017,22,4
2017,37,2
2015,6,111
2015,62,1
2010,14,8
2017,4,642
2016,17,5
2014,9,29
2015,22,5
2015,32,3
2013,42,1
2011,16,4
2011,29,1
2018,4,654
2012,39,1
2011,8,50
2009,32,1
2015,7,54
2010,32,1
2018,3,1971
2014,23,6
2015,1,33716
2013,2,6606
2013,14,11
2015,30,1
2013,60,1
2012,19,8
2017,39,2
2012,21,5
2017,24,4
2010,22,3
2018,7,58
2018,23,2
2016,34,1
2013,16,7
2014,8,46
2017,36,3
2012,25,3
2015,89,1
2014,33,1
2015,13,11
2010,16,9
2014,1,32827
2011,3,1569
2013,25,6
2017,23,3
2011,18,11
2009,4,530
2011,36,1
2018,14,15
2016,14,10
2012,9,26
2018,24,2
2016,33,4
2009,7,61
2012,12,13
2016,9,31
2010,36,1
2013,3,1642
2013,20,13
2013,11,28
2015,26,1
2016,3,1937
2018,82,1
2009,13,6
2012,31,3
2013,12,16
2015,8,47
2015,57,1
2016,26,4
2011,30,2
2013,32,1
2011,10,20
2014,20,13
2009,20,3
2009,1,28627
2018,15,19
2012,1,31915
2017,1,34864
2016,44,2
2012,7,57
2011,23,2
2016,12,22
2015,50,1
2014,45,1
2014,19,14
2016,52,1
2013,17,3
2014,14,9
2009,15,5
2010,12,9
2009,22,3
2015,11,28
2015,10,23
2016,29,2
2010,54,1
2011,27,2
2017,41,2
2012,3,1556
2014,22,4
2016,45,1
2016,42,2
2009,14,3
2013,51,1
2017,76,1
2011,2,6417
2015,9,33
2009,30,1
2014,2,6757
2010,27,3
2018,36,1
2017,27,1
2015,28,4
2015,42,1
2016,5,270
2015,17,12
2018,29,3
2016,20,13
2018,1,34651
2018,43,3
2015,45,1
2012,10,20
2018,2,7213
2015,31,2
2018,33,2
2017,18,13
2009,23,3
2009,26,3
2012,15,5
2015,38,3
2014,13,14
2017,32,2
2015,35,1
2010,15,4
2012,49,1
2013,45,1
2015,4,576
2012,5,206
2016,36,1
2011,28,2
2010,42,1
2015,2,7148
2017,2,7363
2015,37,2
2016,32,1
2016,18,8
2014,68,1
2010,2,6058
2011,13,13
2010,26,2
2010,18,7
2016,7,55
2011,22,3
2013,6,107
2015,33,2
2009,48,1
2011,40,1
2015,16,10
2016,28,2
2017,26,3
2011,9,25
2018,31,4
2018,12,20
2017,50,1
2012,27,2
2013,27,1
2015,14,16
2016,70,2
2011,45,3
2009,3,1500
2015,43,1
2010,6,100
2011,34,1
2010,71,1
2016,11,20
2009,21,1
2015,36,2
2013,30,3
2013,26,1
2018,19,7
2016,22,4
2017,5,249
2009,31,3
2015,23,5
2015,29,4
2014,50,1
2014,26,6
2009,18,2
2018,22,6
2017,13,16
2015,25,2
2016,15,16
2012,44,2
2014,4,539
2014,5,222
2016,10,24
2018,28,3
2010,11,11
2012,2,6331
2013,4,562
2010,9,23
2013,38,1
2009,43,1
2017,17,5
2018,37,1
2018,38,1
2015,12,23
2015,24,1
2012,37,3
2014,25,3
2012,26,2
2012,8,45
