year,PFS_PRA_SPE,count
2007,0,9
2007,1,67030
2007,2,3565
2007,3,4620
2007,4,2186
2007,5,3415
2007,6,12523
2007,7,3824
2007,8,2291
2007,9,442
2007,10,171
2007,11,2493
2007,12,2839
2007,13,1221
2007,14,1976
2007,15,5008
2007,16,818
2007,17,332
2007,18,974
2007,19,37130
2007,21,2953
2007,24,60503
2007,26,53624
2007,27,11778
2007,28,15305
2007,29,2240
2007,30,3943
2007,31,545
2007,32,857
2007,33,6246
2007,35,387
2007,36,2018
2007,37,755
2007,38,957
2007,39,336
2007,40,11
2007,41,2131
2007,42,833
2007,43,58
2007,44,46
2007,45,170
2007,46,623
2007,47,161
2007,48,277
2007,49,293
2007,50,23466
2007,51,80
2007,55,5792
2007,56,22422
2007,60,3568
2007,61,233
2007,62,63
2007,63,1871
2007,64,10496
2007,65,2069
2007,66,55
2007,67,411
2007,68,141
2007,70,1887
2007,71,16
2007,72,321
2007,73,182
2007,74,229
2007,75,70
2007,76,259
2007,77,37
2007,78,6
2008,0,6
2008,1,67356
2008,2,3611
2008,3,4712
2008,4,2074
2008,5,3405
2008,6,13885
2008,7,3857
2008,8,2313
2008,9,436
2008,10,172
2008,11,2471
2008,12,2856
2008,13,1223
2008,14,1982
2008,15,5031
2008,16,869
2008,17,309
2008,18,942
2008,19,36855
2008,20,2
2008,21,3214
2008,24,63271
2008,26,54878
2008,27,11694
2008,28,15862
2008,29,2310
2008,30,3952
2008,31,541
2008,32,862
2008,33,6270
2008,34,7
2008,35,409
2008,36,2040
2008,37,761
2008,38,978
2008,39,331
2008,40,11
2008,41,2222
2008,42,845
2008,43,61
2008,44,52
2008,45,189
2008,46,668
2008,47,176
2008,48,301
2008,49,316
2008,50,23425
2008,51,80
2008,55,5782
2008,56,21867
2008,57,42
2008,60,3712
2008,61,273
2008,62,62
2008,63,1964
2008,64,11088
2008,65,2263
2008,66,54
2008,67,438
2008,68,156
2008,70,1853
2008,71,18
2008,72,333
2008,73,188
2008,74,245
2008,75,76
2008,76,265
2008,77,35
2008,78,7
2008,79,2
2009,0,7
2009,1,67310
2009,2,3630
2009,3,4818
2009,4,1976
2009,5,3394
2009,6,14435
2009,7,3767
2009,8,2335
2009,9,407
2009,10,182
2009,11,2475
2009,12,2835
2009,13,1223
2009,14,1983
2009,15,5087
2009,16,918
2009,17,280
2009,18,899
2009,19,36592
2009,20,6
2009,21,3495
2009,24,66333
2009,26,56490
2009,27,11940
2009,28,16489
2009,29,2391
2009,30,3961
2009,31,529
2009,32,863
2009,33,6279
2009,34,36
2009,35,431
2009,36,2066
2009,37,741
2009,38,995
2009,39,328
2009,40,9
2009,41,2312
2009,42,845
2009,43,69
2009,44,49
2009,45,211
2009,46,715
2009,47,198
2009,48,344
2009,49,338
2009,50,23353
2009,51,79
2009,55,5846
2009,56,22269
2009,57,352
2009,60,3732
2009,61,303
2009,62,60
2009,63,2134
2009,64,11735
2009,65,2506
2009,66,59
2009,67,464
2009,68,161
2009,70,1795
2009,71,20
2009,72,349
2009,73,191
2009,74,261
2009,75,81
2009,76,262
2009,77,33
2009,78,7
2009,79,177
2009,80,1
2010,0,5
2010,1,67022
2010,2,3714
2010,3,4941
2010,4,1903
2010,5,3385
2010,6,15137
2010,7,3805
2010,8,2369
2010,9,396
2010,10,184
2010,11,2466
2010,12,2831
2010,13,1235
2010,14,2003
2010,15,5168
2010,16,999
2010,17,257
2010,18,874
2010,19,36479
2010,20,10
2010,21,3715
2010,24,69588
2010,26,58226
2010,27,12199
2010,28,17266
2010,29,2487
2010,30,3965
2010,31,521
2010,32,873
2010,33,6311
2010,34,39
2010,35,450
2010,36,2092
2010,37,738
2010,38,1006
2010,39,324
2010,40,8
2010,41,2399
2010,42,863
2010,43,78
2010,44,57
2010,45,222
2010,46,753
2010,47,213
2010,48,388
2010,49,391
2010,50,23219
2010,51,79
2010,55,5857
2010,56,23937
2010,57,372
2010,60,3890
2010,61,364
2010,62,68
2010,63,2208
2010,64,12362
2010,65,2703
2010,66,60
2010,67,505
2010,68,177
2010,70,1737
2010,71,22
2010,72,386
2010,73,206
2010,74,278
2010,75,81
2010,76,250
2010,77,29
2010,78,8
2010,79,222
2010,80,1
2011,1,65962
2011,2,4167
2011,3,5548
2011,4,1991
2011,5,3412
2011,6,16408
2011,7,4011
2011,8,2811
2011,9,394
2011,10,218
2011,11,2642
2011,12,2909
2011,13,1436
2011,14,2053
2011,15,5614
2011,16,1187
2011,17,225
2011,18,904
2011,19,36601
2011,20,16
2011,21,3974
2011,22,23
2011,23,139
2011,24,73135
2011,26,60119
2011,27,12678
2011,28,17911
2011,29,2589
2011,30,4086
2011,31,528
2011,32,907
2011,33,6406
2011,34,49
2011,35,516
2011,36,2104
2011,37,751
2011,38,996
2011,39,336
2011,40,8
2011,41,2823
2011,42,893
2011,43,101
2011,44,67
2011,45,273
2011,46,875
2011,47,266
2011,48,468
2011,49,437
2011,50,23120
2011,51,76
2011,55,5901
2011,56,24727
2011,57,387
2011,60,4084
2011,61,431
2011,62,70
2011,63,2337
2011,64,13032
2011,65,2988
2011,66,64
2011,67,472
2011,68,190
2011,70,1683
2011,71,27
2011,72,422
2011,73,233
2011,74,320
2011,75,81
2011,76,235
2011,77,28
2011,78,7
2011,79,308
2011,80,1
2012,0,2
2012,1,66292
2012,2,4555
2012,3,6125
2012,4,2120
2012,5,3536
2012,6,17662
2012,7,4250
2012,8,3218
2012,9,379
2012,10,252
2012,11,2849
2012,12,2959
2012,13,1542
2012,14,2113
2012,15,6124
2012,16,1483
2012,17,211
2012,18,938
2012,19,36891
2012,20,19
2012,21,4371
2012,22,17
2012,23,12
2012,24,76715
2012,26,62349
2012,27,12980
2012,28,18369
2012,29,2708
2012,30,4199
2012,31,522
2012,32,970
2012,33,6488
2012,34,61
2012,35,622
2012,36,2118
2012,37,834
2012,38,1020
2012,39,356
2012,40,10
2012,41,3207
2012,42,928
2012,43,110
2012,44,85
2012,45,325
2012,46,1080
2012,47,309
2012,48,560
2012,49,556
2012,50,22974
2012,51,75
2012,55,5853
2012,56,25822
2012,57,363
2012,60,4324
2012,61,513
2012,62,74
2012,63,2379
2012,64,13632
2012,65,3309
2012,66,69
2012,67,494
2012,68,203
2012,70,1605
2012,71,30
2012,72,510
2012,73,305
2012,74,447
2012,75,82
2012,76,308
2012,77,26
2012,78,7
2012,79,326
2012,80,2
2013,0,1
2013,1,66869
2013,2,4822
2013,3,6445
2013,4,2057
2013,5,3498
2013,6,18199
2013,7,4348
2013,8,3291
2013,9,382
2013,10,276
2013,11,2943
2013,12,3004
2013,13,1569
2013,14,2074
2013,15,6355
2013,16,1600
2013,17,198
2013,18,905
2013,19,37103
2013,20,25
2013,21,4825
2013,22,10
2013,23,9
2013,24,80031
2013,26,64483
2013,27,13372
2013,28,18902
2013,29,2781
2013,30,4265
2013,31,513
2013,32,978
2013,33,6490
2013,34,66
2013,35,660
2013,36,2159
2013,37,939
2013,38,1022
2013,39,343
2013,40,9
2013,41,3536
2013,42,945
2013,43,123
2013,44,96
2013,45,372
2013,46,1186
2013,47,330
2013,48,607
2013,49,616
2013,50,22816
2013,51,70
2013,55,5827
2013,56,26696
2013,57,361
2013,60,4522
2013,61,594
2013,62,69
2013,63,2298
2013,64,14164
2013,65,3563
2013,66,68
2013,67,510
2013,68,219
2013,70,1548
2013,71,37
2013,72,541
2013,73,338
2013,74,518
2013,75,86
2013,76,332
2013,77,25
2013,78,7
2013,79,337
2013,80,4
2014,0,3
2014,1,67132
2014,2,4900
2014,3,6847
2014,4,2054
2014,5,3487
2014,6,18999
2014,7,4420
2014,8,3417
2014,9,376
2014,10,286
2014,11,2978
2014,12,3029
2014,13,1604
2014,14,2064
2014,15,6526
2014,16,1719
2014,17,184
2014,18,877
2014,19,37200
2014,20,27
2014,21,5318
2014,22,10
2014,23,9
2014,24,83701
2014,26,66908
2014,27,13845
2014,28,19517
2014,29,2866
2014,30,4100
2014,31,497
2014,32,991
2014,33,6537
2014,34,67
2014,35,692
2014,36,2192
2014,37,995
2014,38,1027
2014,39,318
2014,40,9
2014,41,3717
2014,42,967
2014,43,143
2014,44,99
2014,45,416
2014,46,1262
2014,47,340
2014,48,637
2014,49,681
2014,50,22708
2014,51,64
2014,53,41
2014,54,5
2014,55,5787
2014,56,24741
2014,57,336
2014,60,4623
2014,61,642
2014,62,69
2014,63,2657
2014,64,14657
2014,65,3809
2014,66,61
2014,67,618
2014,68,241
2014,70,1477
2014,71,37
2014,72,585
2014,73,385
2014,74,598
2014,75,86
2014,76,351
2014,77,23
2014,78,8
2014,79,331
2014,80,5
2015,1,66867
2015,2,5035
2015,3,7157
2015,4,2042
2015,5,3461
2015,6,19400
2015,7,4525
2015,8,3462
2015,9,368
2015,10,300
2015,11,3035
2015,12,3021
2015,13,1669
2015,14,2062
2015,15,6729
2015,16,1790
2015,17,164
2015,18,838
2015,19,37274
2015,20,30
2015,21,5835
2015,22,13
2015,23,9
2015,24,87447
2015,26,68975
2015,27,14263
2015,28,20267
2015,29,2962
2015,30,4090
2015,31,481
2015,32,1005
2015,33,6542
2015,34,76
2015,35,748
2015,36,2205
2015,37,1042
2015,38,1014
2015,39,312
2015,40,8
2015,41,3917
2015,42,970
2015,43,150
2015,44,104
2015,45,446
2015,46,1348
2015,47,346
2015,48,664
2015,49,728
2015,50,22609
2015,51,62
2015,53,69
2015,54,6
2015,55,5766
2015,56,26018
2015,57,319
2015,60,4844
2015,61,718
2015,62,68
2015,63,2444
2015,64,15071
2015,65,4039
2015,66,63
2015,67,578
2015,68,263
2015,70,1382
2015,71,43
2015,72,603
2015,73,408
2015,74,627
2015,75,93
2015,76,333
2015,77,21
2015,78,10
2015,79,321
2015,80,3
2016,1,66599
2016,2,5220
2016,3,7310
2016,4,2002
2016,5,3411
2016,6,20286
2016,7,4602
2016,8,3541
2016,9,368
2016,10,323
2016,11,3031
2016,12,3019
2016,13,1725
2016,14,2003
2016,15,6895
2016,16,1901
2016,17,145
2016,18,801
2016,19,37473
2016,20,37
2016,21,6302
2016,22,13
2016,23,7
2016,24,90726
2016,26,72541
2016,27,14732
2016,28,20933
2016,29,3043
2016,30,3945
2016,31,479
2016,32,1019
2016,33,6540
2016,34,88
2016,35,781
2016,36,2211
2016,37,1140
2016,38,1023
2016,39,296
2016,40,7
2016,41,4094
2016,42,969
2016,43,154
2016,44,109
2016,45,498
2016,46,1421
2016,47,380
2016,48,700
2016,49,783
2016,50,22334
2016,51,58
2016,53,85
2016,54,7
2016,55,5685
2016,56,26746
2016,57,295
2016,60,5004
2016,61,772
2016,62,72
2016,63,2367
2016,64,15512
2016,65,4307
2016,66,62
2016,67,662
2016,68,273
2016,70,1310
2016,71,57
2016,72,634
2016,73,438
2016,74,699
2016,75,94
2016,76,323
2016,77,20
2016,78,11
2016,79,323
2016,80,3
2017,0,1
2017,1,66774
2017,2,5392
2017,3,7603
2017,4,1985
2017,5,3335
2017,6,20881
2017,7,4735
2017,8,3598
2017,9,357
2017,10,343
2017,11,3043
2017,12,2999
2017,13,1744
2017,14,1953
2017,15,7221
2017,16,2085
2017,17,129
2017,18,769
2017,19,37656
2017,20,40
2017,21,6747
2017,22,24
2017,23,3
2017,24,94083
2017,26,78457
2017,27,15015
2017,28,21088
2017,29,3113
2017,30,3891
2017,31,480
2017,32,1053
2017,33,6494
2017,34,95
2017,35,833
2017,36,2226
2017,37,1275
2017,38,1055
2017,39,295
2017,40,6
2017,41,4329
2017,42,976
2017,43,152
2017,44,115
2017,45,529
2017,46,1486
2017,47,402
2017,48,724
2017,49,832
2017,50,22113
2017,51,58
2017,53,97
2017,54,9
2017,55,5657
2017,56,26953
2017,57,282
2017,60,5126
2017,61,812
2017,62,72
2017,63,2342
2017,64,15945
2017,65,4551
2017,66,61
2017,67,606
2017,68,287
2017,69,1
2017,70,1207
2017,71,70
2017,72,692
2017,73,468
2017,74,778
2017,75,99
2017,76,287
2017,77,17
2017,78,10
2017,79,319
2017,80,3
2018,0,1
2018,1,66892
2018,2,5565
2018,3,7864
2018,4,1982
2018,5,3248
2018,6,21460
2018,7,4815
2018,8,3681
2018,9,361
2018,10,389
2018,11,3059
2018,12,3038
2018,13,1786
2018,14,1932
2018,15,7425
2018,16,2250
2018,17,113
2018,18,741
2018,19,37709
2018,20,46
2018,21,7122
2018,22,50
2018,23,1
2018,24,97166
2018,26,82745
2018,27,15155
2018,28,21338
2018,29,3682
2018,30,3906
2018,31,463
2018,32,1091
2018,33,6494
2018,34,104
2018,35,880
2018,36,2237
2018,37,1600
2018,38,1068
2018,39,304
2018,40,6
2018,41,4663
2018,42,996
2018,43,162
2018,44,117
2018,45,593
2018,46,1574
2018,47,422
2018,48,761
2018,49,857
2018,50,21896
2018,51,56
2018,53,99
2018,54,8
2018,55,5587
2018,56,27166
2018,57,270
2018,60,5210
2018,61,872
2018,62,70
2018,63,2347
2018,64,16285
2018,65,4784
2018,66,66
2018,67,616
2018,68,300
2018,69,4
2018,70,1105
2018,71,74
2018,72,713
2018,73,519
2018,74,844
2018,75,102
2018,76,275
2018,77,15
2018,78,10
2018,79,317
2018,80,3
2018,81,1
2018,83,1
2018,84,21
2018,85,64
