year,NB_Benef
2003,12
0,498766
1997,1
1999,3
2002,3
1990,1
2015,589846
2014,582060
2001,6
1993,1
2007,51
2018,583277
2012,565759
2016,604006
1992,1
2005,26
1984,1
2010,538315
2011,556174
2017,609436
2006,54
2013,572985
2009,524887
2008,5325
2004,30
