year,Nb_sejoursMCO_ind,count
2015,87,4
2014,11,1038
2014,72,18
2010,289,1
2016,6,5961
2011,38,129
2016,93,4
2012,20,398
2012,67,17
2011,215,1
2012,171,1
2016,1,407645
2010,24,226
2011,187,1
2016,78,12
2013,325,1
2008,107,1
2009,153,6
2014,192,1
2013,48,37
2008,52,21
2014,117,5
2015,75,6
2015,93,3
2015,167,2
2016,165,5
2011,314,1
2012,66,19
2008,121,2
2016,273,1
2013,56,29
2014,10,1523
2011,33,137
2010,130,4
2016,13,1067
2014,110,6
2016,54,38
2011,165,1
2009,112,1
2009,19,177
2011,52,26
2015,70,14
2015,307,1
2010,31,129
2013,98,3
2013,145,7
2013,102,5
2012,83,5
2010,166,1
2015,125,5
2015,79,10
2013,57,15
2008,116,1
2014,179,1
2010,149,2
2008,80,1
2013,21,278
2010,73,6
2014,198,2
2013,200,1
2012,14,875
2015,119,4
2014,60,15
2016,107,8
2011,14,747
2014,17,558
2014,77,7
2009,163,1
2013,76,12
2011,77,9
2014,125,5
2008,100,3
2008,126,1
2016,171,1
2016,161,6
2015,78,19
2011,158,21
2010,136,3
2016,65,13
2016,284,1
2016,167,4
2016,27,264
2012,11,1039
2012,122,3
2013,69,13
2015,249,2
2012,274,1
2010,118,2
2011,12,1082
2009,156,28
2011,99,1
2015,162,2
2009,16,378
2009,113,1
2016,21,354
2013,148,7
2008,41,38
2015,46,61
2013,34,215
2012,102,3
2011,85,4
2008,89,1
2014,64,21
2008,12,602
2009,85,4
2013,108,1
2009,122,1
2009,106,2
2014,306,1
2014,43,80
2016,53,34
2016,160,25
2012,52,35
2012,22,334
2013,39,103
2015,141,6
2015,269,1
2012,110,4
2016,95,4
2011,221,1
2014,69,15
2008,79,2
2016,46,56
2013,97,7
2015,48,52
2014,113,2
2010,25,160
2013,78,10
2015,34,218
2009,45,25
2013,135,6
2016,8,2943
2015,67,11
2014,75,7
2013,7,2835
2008,24,145
2011,153,9
2013,87,6
2016,61,12
2011,137,1
2011,172,1
2013,187,1
2016,302,1
2009,167,1
2011,50,37
2012,51,20
2012,133,1
2009,161,1
2011,148,7
2013,103,3
2008,62,5
2016,113,4
2014,209,1
2013,10,1399
2013,28,215
2014,70,17
2012,77,8
2011,116,2
2012,139,3
2009,90,2
2010,162,1
2014,149,6
2016,141,4
2010,74,5
2011,163,1
2016,152,15
2015,124,5
2013,91,4
2013,18,523
2014,82,10
2013,304,1
2016,256,1
2014,41,104
2014,197,1
2008,38,69
2012,271,1
2008,1,326464
2011,132,4
2015,107,6
2009,132,1
2016,16,762
2016,139,3
2016,24,332
2013,47,31
2008,68,9
2014,168,1
2016,101,5
2010,57,6
2012,193,1
2012,123,1
2016,40,124
2011,61,9
2016,150,7
2009,41,50
2013,95,3
2009,293,1
2009,84,11
2011,151,8
2016,110,1
2015,18,591
2009,159,3
2009,152,3
2008,131,1
2013,127,1
2015,15,741
2014,27,256
2014,160,8
2008,104,2
2012,136,1
2011,35,160
2015,161,8
2014,120,4
2014,79,13
2011,44,56
2016,178,1
2008,135,1
2015,81,6
2009,124,3
2009,61,3
2012,95,3
2016,411,1
2010,125,2
2012,43,69
2016,138,3
2014,312,1
2011,154,17
2011,118,4
2014,135,2
2008,160,2
2012,135,2
2014,94,5
2008,96,1
2016,105,11
2009,80,8
2010,207,1
2008,18,212
2012,23,244
2012,116,2
2015,180,1
2013,151,5
2009,57,5
2010,84,2
2009,313,1
2008,33,94
2015,105,8
2010,150,3
2014,93,9
2016,122,3
2010,23,161
2013,62,15
2008,58,9
2008,9,776
2009,69,3
2014,111,3
2016,132,4
2012,100,1
2014,38,154
2008,49,11
2009,47,22
2010,100,3
2009,93,2
2012,17,496
2009,34,116
2014,44,70
2015,127,4
2016,211,2
2015,100,8
2013,36,189
2013,114,6
2012,157,36
2010,33,105
2015,64,23
2012,150,5
2011,81,3
2014,35,231
2011,46,43
2008,94,3
2016,86,8
2014,16,705
2012,18,503
2016,74,11
2010,38,114
2009,38,101
2010,75,5
2012,128,3
2012,160,13
2009,12,683
2016,23,262
2008,44,36
2014,47,33
2008,26,127
2012,73,8
2014,95,7
2013,5,6959
2014,29,173
2012,74,13
2008,34,93
2012,46,46
2013,52,39
2015,133,1
2016,119,2
2015,21,307
2016,133,4
2012,149,6
2009,150,4
2012,16,648
2016,62,22
2008,4,10630
2014,90,5
2014,24,286
2009,123,3
2009,128,1
2011,21,247
2012,79,2
2016,84,15
2013,126,5
2013,212,1
2012,4,16979
2013,53,30
2014,145,2
2016,35,241
2014,6,5406
2015,41,111
2013,162,3
2008,91,1
2012,72,10
2011,82,3
2011,109,1
2010,49,26
2016,220,1
2012,48,29
2014,51,34
2016,47,50
2011,155,23
2015,333,1
2014,140,4
2014,53,26
2009,86,3
2014,154,12
2009,83,5
2008,206,1
2016,80,13
2011,140,7
2016,81,7
2013,90,7
2011,19,325
2014,172,1
2015,209,1
2010,87,3
2008,129,1
2010,39,91
2012,50,32
2015,138,3
2008,115,2
2011,150,7
2013,117,2
2010,106,5
2009,59,8
2015,306,1
2010,148,3
2015,112,1
2010,154,9
2012,164,1
2010,17,335
2009,25,121
2012,98,5
2009,49,11
2012,59,6
2012,109,1
2010,72,6
2013,41,86
2008,106,2
2013,86,2
2010,5,5394
2013,315,1
2012,81,3
2011,267,2
2014,116,5
2009,143,4
2008,164,2
2010,317,1
2016,19,439
2015,168,1
2016,2,123530
2014,205,1
2008,156,10
2016,39,157
2010,3,27722
2011,324,1
2008,132,1
2009,96,1
2016,158,48
2009,151,2
2016,147,4
2012,112,3
2013,189,1
2015,99,7
2011,96,1
2014,123,3
2016,279,1
2009,10,872
2008,56,12
2015,92,8
2015,66,15
2014,36,194
2014,212,2
2009,97,2
2015,5,7589
2011,25,201
2012,155,16
2014,66,16
2010,66,8
2016,182,1
2008,155,8
2013,143,6
2015,110,4
2015,71,12
2010,153,9
2008,88,4
2009,28,139
2010,131,2
2016,99,5
2016,85,5
2011,271,1
2016,118,4
2011,74,7
2010,41,65
2015,132,4
2011,11,889
2013,29,192
2014,142,6
2013,19,394
2012,33,133
2016,173,1
2014,7,3050
2010,188,1
2008,20,135
2016,151,8
2013,74,9
2008,145,2
2014,92,3
2012,309,1
2013,136,6
2014,138,3
2009,64,10
2008,15,286
2013,157,31
2013,164,5
2014,144,5
2015,60,23
2014,146,6
2011,62,14
2015,227,1
2012,245,1
2014,114,4
2016,25,213
2011,31,125
2015,163,2
2015,88,6
2010,4,13331
2012,13,947
2008,174,1
2011,196,1
2014,143,5
2015,157,31
2016,64,19
2011,131,6
2010,83,3
2011,90,4
2008,102,4
2012,41,99
2013,92,8
2014,139,4
2012,76,10
2014,32,193
2015,159,14
2015,118,5
2009,104,1
2014,84,2
2013,150,5
2013,85,4
2010,98,4
2008,335,1
2008,85,1
2009,70,5
2010,235,1
2010,158,15
2008,54,12
2013,66,20
2009,98,2
2010,28,182
2011,159,14
2010,133,2
2016,31,136
2010,155,10
2013,1,395032
2013,59,10
2009,154,7
2009,5,4904
2011,5,6361
2012,53,28
2015,136,5
2008,152,6
2012,107,1
2013,175,1
2016,43,77
2009,54,6
2012,173,1
2010,208,1
2014,34,216
2011,79,7
2008,67,2
2016,164,7
2012,118,1
2010,13,660
2009,42,49
2008,169,1
2010,8,1961
2012,47,24
2008,144,4
2014,59,12
2015,143,11
2009,208,1
2013,65,4
2010,112,1
2013,141,6
2016,56,24
2014,58,26
2011,134,2
2010,104,6
2011,166,1
2012,85,6
2010,56,14
2016,69,19
2015,108,3
2010,68,8
2014,12,1207
2012,111,2
2011,101,5
2011,115,1
2014,105,6
2008,48,7
2008,142,2
2013,13,908
2015,51,28
2014,89,5
2016,4,19332
2016,59,17
2014,159,12
2013,159,9
2012,115,1
2008,231,1
2012,34,213
2009,39,74
2013,147,5
2011,89,3
2009,2,93270
2015,20,426
2015,55,19
2013,8,2499
2009,44,33
2008,138,2
2011,119,2
2013,81,11
2014,88,6
2015,135,2
2008,157,15
2011,64,16
2012,151,7
2014,129,3
2011,107,2
2013,80,9
2014,99,5
2011,6,4604
2009,133,5
2008,31,78
2008,90,4
2014,131,3
2008,55,12
2014,21,277
2015,40,134
2012,70,15
2010,86,5
2013,100,4
2009,107,1
2016,91,3
2012,24,291
2012,191,1
2012,32,185
2014,133,3
2013,294,1
2015,123,3
2008,84,3
2008,53,9
2010,139,4
2008,148,2
2013,15,624
2016,48,54
2012,131,2
2015,117,3
2015,152,17
2015,160,12
2015,155,22
2016,146,5
2011,4,15714
2014,137,7
2009,40,48
2016,76,9
2011,126,1
2014,15,740
2015,104,8
2011,1,381018
2016,30,214
2010,124,3
2016,264,1
2008,21,114
2012,55,17
2013,174,1
2012,167,2
2009,24,153
2014,28,219
2012,269,1
2012,94,7
2015,3,35530
2015,19,393
2010,195,1
2009,147,6
2008,166,2
2013,79,4
2016,191,1
2012,88,6
2009,55,5
2015,54,31
2013,77,6
2012,152,6
2008,161,1
2010,119,1
2014,56,19
2015,183,1
2015,27,250
2014,37,126
2008,75,2
2010,55,15
2010,69,7
2013,99,7
2008,98,3
2009,100,3
2011,87,3
2009,17,285
2012,63,9
2010,40,73
2008,110,2
2012,64,15
2014,49,22
2013,46,39
2011,112,3
2016,108,5
2011,123,3
2010,77,5
2014,150,10
2014,104,11
2015,114,4
2010,109,1
2009,75,8
2010,107,5
2014,102,5
2013,107,7
2009,89,1
2015,86,5
2012,101,4
2014,121,4
2011,127,1
2010,19,241
2016,155,19
2014,136,2
2008,111,1
2009,11,576
2016,114,8
2009,67,3
2012,132,2
2012,159,15
2011,103,3
2013,54,24
2015,56,20
2013,63,12
2008,63,8
2011,113,1
2010,20,276
2011,17,440
2013,24,296
2014,158,24
2010,230,1
2014,134,4
2011,297,1
2016,303,1
2016,103,5
2012,162,4
2011,75,8
2008,150,1
2010,10,1032
2014,132,8
2012,6,4967
2011,317,1
2013,154,15
2014,107,3
2013,314,1
2011,20,322
2013,23,207
2013,49,43
2009,73,7
2010,143,2
2011,200,1
2008,32,105
2012,30,176
2010,61,6
2010,97,6
2014,81,7
2016,277,1
2014,67,3
2008,143,1
2014,3,34405
2013,158,22
2011,24,235
2009,74,9
2010,147,4
2013,22,311
2008,66,9
2016,144,8
2008,61,3
2010,93,3
2008,23,96
2014,54,34
2016,135,8
2015,150,11
2011,71,5
2011,7,2546
2014,30,165
2014,39,139
2009,244,1
2012,40,93
2010,116,2
2014,296,2
2011,69,10
2016,73,7
2009,114,2
2010,59,7
2011,110,2
2008,172,1
2013,9,1632
2011,160,8
2012,61,9
2012,154,5
2011,26,259
2009,27,137
2010,7,2052
2008,5,4047
2008,2,84843
2011,157,21
2012,60,24
2012,153,16
2010,63,5
2008,45,11
2013,37,131
2012,166,1
2010,1,366505
2013,43,48
2009,82,5
2015,321,1
2008,51,8
2014,18,574
2016,37,132
2010,99,3
2011,73,5
2009,116,1
2012,57,24
2008,8,1411
2009,141,4
2014,103,3
2011,217,1
2011,32,187
2014,151,12
2016,97,1
2016,269,1
2009,300,1
2012,35,196
2010,161,7
2012,129,1
2012,42,87
2014,167,3
2016,136,2
2014,199,1
2013,31,139
2014,109,2
2013,155,18
2013,40,115
2016,228,1
2010,169,1
2015,76,14
2013,67,5
2012,99,1
2011,39,113
2010,144,3
2016,123,2
2008,40,49
2011,133,2
2016,71,6
2009,9,934
2014,147,8
2012,82,4
2008,162,1
2009,207,1
2011,15,555
2013,44,64
2009,160,6
2009,6,3440
2013,142,8
2014,157,43
2014,108,8
2014,153,11
2016,166,5
2016,205,1
2014,186,1
2014,40,94
2009,103,3
2014,91,2
2013,211,1
2011,289,1
2010,81,1
2009,8,1588
2011,55,15
2010,91,3
2015,73,9
2012,28,230
2014,141,3
2016,174,1
2015,6,5558
2010,132,2
2008,78,7
2015,146,4
2015,62,20
2008,109,2
2010,14,619
2014,52,38
2014,156,44
2014,9,1696
2016,17,611
2012,113,2
2009,131,1
2012,314,1
2016,111,2
2010,64,15
2015,22,347
2015,32,168
2013,42,75
2012,80,11
2009,56,15
2011,16,587
2011,29,157
2013,111,4
2010,135,1
2011,167,1
2014,55,22
2010,160,4
2015,126,4
2012,39,118
2011,84,6
2012,93,4
2012,71,8
2008,71,5
2016,140,7
2014,162,3
2011,147,2
2013,229,1
2011,146,4
2009,29,111
2015,286,1
2012,138,3
2014,57,32
2011,8,2323
2014,73,6
2015,140,3
2012,161,11
2009,32,108
2009,105,1
2015,85,9
2013,140,10
2008,184,1
2012,141,5
2011,164,1
2009,37,83
2015,7,3155
2010,32,130
2016,163,6
2008,74,4
2016,189,1
2008,70,13
2013,133,6
2016,94,3
2014,23,237
2010,140,2
2015,102,5
2011,142,4
2013,192,1
2008,27,108
2010,94,7
2016,192,1
2015,1,401739
2013,2,114299
2015,95,7
2015,30,207
2013,14,947
2008,158,9
2010,50,25
2013,60,19
2008,35,85
2016,68,18
2014,85,8
2015,122,1
2013,121,3
2010,115,1
2012,134,2
2012,19,357
2009,92,2
2013,153,11
2012,89,2
2011,100,4
2016,142,9
2010,123,3
2012,87,4
2012,21,276
2011,104,7
2015,224,1
2009,78,6
2013,33,159
2012,108,5
2013,55,18
2013,160,5
2016,75,13
2010,22,225
2008,22,120
2012,148,7
2009,99,2
2009,111,1
2014,127,1
2016,257,2
2016,34,197
2009,66,5
2010,78,4
2014,8,2672
2012,25,220
2013,16,654
2013,75,9
2015,89,8
2012,126,1
2013,168,1
2014,33,128
2013,144,7
2010,96,2
2013,134,5
2008,39,50
2010,45,25
2015,13,1008
2016,145,6
2009,88,6
2011,111,1
2015,129,1
2010,16,454
2014,62,17
2015,77,7
2016,130,3
2012,212,1
2014,1,399223
2011,3,30869
2008,17,210
2008,19,158
2008,130,1
2013,25,211
2013,300,1
2008,122,2
2016,157,77
2012,68,23
2011,43,62
2014,118,9
2011,57,16
2012,106,3
2012,172,2
2013,109,4
2015,58,10
2011,18,454
2010,70,9
2012,62,22
2011,66,11
2011,68,10
2009,95,2
2012,96,3
2016,169,4
2016,112,4
2009,4,12034
2011,36,165
2015,106,7
2015,98,5
2016,106,5
2009,53,13
2008,82,3
2011,48,43
2014,126,1
2013,125,2
2016,14,996
2015,120,4
2012,9,1510
2013,129,2
2008,11,477
2010,156,22
2008,81,1
2010,220,1
2016,276,1
2016,33,157
2013,277,1
2009,7,1784
2012,12,1174
2013,101,2
2008,154,5
2011,145,3
2011,76,13
2012,204,1
2016,9,1861
2008,47,5
2015,148,4
2012,65,5
2010,36,128
2008,127,1
2011,114,2
2013,3,33210
2015,149,8
2016,129,2
2016,67,11
2015,142,5
2013,11,1035
2015,26,268
2013,20,389
2008,92,6
2015,63,15
2009,79,4
2009,146,1
2012,299,1
2015,164,1
2015,74,16
2016,127,5
2016,3,37557
2008,36,95
2015,166,4
2016,318,1
2011,65,10
2011,141,1
2009,13,525
2015,61,13
2016,313,1
2009,68,8
2013,308,1
2010,305,1
2015,184,1
2013,209,1
2012,125,1
2012,31,149
2008,43,24
2011,88,4
2011,95,1
2013,122,2
2010,34,187
2010,76,10
2010,82,7
2013,64,22
2013,152,5
2013,94,2
2013,238,1
2016,216,1
2012,145,4
2011,296,1
2010,193,1
2015,8,2714
2013,12,1215
2010,62,10
2011,129,4
2015,57,22
2010,102,1
2009,108,3
2016,26,316
2008,87,3
2013,32,194
2011,30,152
2011,10,1327
2015,153,21
2011,59,9
2010,138,1
2014,76,15
2012,105,3
2014,31,182
2014,20,388
2015,44,86
2009,20,212
2015,243,2
2016,117,6
2011,105,2
2016,120,3
2014,271,1
2009,110,2
2009,1,349899
2016,156,30
2008,59,3
2012,124,4
2014,250,1
2016,82,11
2014,207,1
2016,314,1
2011,91,6
2014,128,2
2012,1,393227
2009,33,97
2016,87,3
2010,243,1
2011,67,6
2016,79,6
2016,230,1
2012,7,2743
2011,23,194
2016,44,70
2011,51,27
2016,98,8
2008,314,1
2012,140,3
2008,93,1
2014,163,3
2014,171,1
2016,109,7
2016,57,22
2010,103,2
2016,210,2
2012,127,2
2015,121,2
2016,116,1
2013,116,1
2016,12,1379
2015,50,45
2014,45,34
2008,50,11
2014,155,18
2013,184,1
2014,19,419
2010,90,4
2016,52,42
2008,25,96
2012,228,1
2011,63,14
2015,113,5
2011,143,3
2009,165,2
2015,68,20
2010,29,125
2008,151,4
2011,56,19
2014,86,5
2010,117,1
2009,36,97
2014,74,10
2012,316,1
2011,53,23
2008,159,3
2010,46,31
2008,296,1
2016,293,1
2016,50,55
2013,17,530
2013,88,6
2015,165,3
2009,235,1
2014,14,905
2010,35,148
2009,76,7
2016,153,15
2015,72,14
2009,15,362
2008,13,434
2014,161,8
2012,292,1
2010,12,851
2009,22,161
2016,168,3
2015,101,2
2015,11,1092
2012,147,3
2011,225,1
2013,105,5
2010,92,3
2012,308,1
2010,43,52
2015,10,1642
2016,29,197
2010,54,18
2010,165,1
2008,16,289
2011,27,238
2014,80,12
2014,174,1
2016,49,44
2012,104,7
2016,60,20
2008,65,3
2010,37,92
2014,83,6
2009,149,3
2016,66,21
2013,128,6
2009,94,2
2009,65,1
2012,3,32876
2014,22,324
2015,145,3
2013,106,5
2016,96,2
2016,45,54
2010,60,8
2013,83,3
2009,158,8
2008,30,97
2009,62,4
2009,14,533
2016,42,99
2013,51,22
2016,154,25
2015,144,13
2015,84,10
2016,186,1
2010,79,3
2008,117,2
2014,166,3
2016,175,2
2015,9,1675
2011,2,107661
2009,30,105
2016,100,9
2012,92,7
2014,2,116915
2010,53,20
2008,153,6
2010,108,1
2010,27,183
2011,139,4
2015,28,241
2015,90,2
2008,10,727
2012,156,17
2014,165,1
2008,64,7
2012,56,23
2015,42,98
2016,77,8
2016,5,7804
2015,17,635
2016,115,7
2013,104,9
2014,100,4
2010,180,1
2016,20,458
2008,77,2
2015,116,5
2008,133,2
2013,149,12
2015,45,43
2013,257,1
2012,10,1386
2012,143,2
2016,92,2
2014,148,6
2010,128,1
2012,91,9
2009,52,22
2016,102,5
2015,31,174
2013,230,1
2009,51,12
2015,169,3
2012,248,1
2011,47,23
2013,161,3
2008,120,3
2008,167,1
2016,148,5
2009,71,9
2008,72,8
2009,26,152
2009,23,118
2013,204,1
2014,46,59
2011,203,1
2012,15,645
2013,137,7
2015,38,153
2009,157,8
2012,58,18
2014,71,10
2011,136,1
2011,125,2
2010,95,1
2014,13,970
2012,146,4
2013,72,15
2016,283,1
2014,301,1
2015,35,276
2013,73,7
2009,126,1
2012,137,1
2010,58,15
2010,15,444
2012,49,28
2014,87,5
2015,91,5
2009,91,1
2011,42,78
2012,78,9
2009,63,2
2016,245,1
2012,54,25
2009,144,1
2015,130,2
2010,47,27
2013,45,41
2016,398,1
2014,101,6
2011,60,16
2016,83,10
2015,4,18239
2015,134,3
2009,255,1
2009,58,14
2013,198,1
2012,5,6904
2016,36,207
2016,128,4
2011,28,239
2010,42,52
2016,143,5
2014,42,121
2009,127,4
2015,173,1
2015,53,21
2010,52,29
2015,2,119415
2016,162,12
2009,60,12
2013,58,18
2014,112,6
2015,47,50
2014,152,13
2016,72,12
2010,145,5
2015,80,13
2015,37,137
2014,169,1
2016,32,201
2016,18,628
2013,146,6
2008,28,107
2014,68,16
2008,46,23
2009,121,2
2015,109,4
2010,141,1
2010,2,99196
2011,13,849
2009,35,106
2010,18,328
2010,26,199
2011,149,3
2011,94,3
2011,92,3
2012,266,1
2013,82,6
2016,7,3219
2013,61,12
2011,22,282
2013,156,38
2016,104,4
2013,234,1
2013,6,5071
2015,33,153
2011,83,10
2011,106,3
2009,117,1
2013,50,46
2009,48,23
2016,125,4
2009,294,1
2009,119,1
2008,73,1
2008,279,1
2011,175,1
2011,40,107
2013,89,5
2011,224,1
2011,37,126
2015,131,2
2014,96,6
2016,235,1
2016,294,1
2015,16,735
2013,139,2
2008,42,44
2016,28,288
2015,59,18
2009,148,1
2010,122,2
2013,118,2
2014,124,4
2011,492,1
2014,106,2
2010,167,1
2008,86,3
2011,108,2
2008,3,22885
2011,9,1417
2015,139,3
2008,57,6
2010,48,32
2015,151,11
2014,115,4
2011,117,2
2008,210,1
2011,326,1
2016,177,1
2011,249,1
2013,223,1
2013,27,234
2011,49,30
2012,27,234
2016,58,25
2009,155,6
2015,14,990
2015,39,141
2010,159,12
2009,162,1
2016,70,17
2012,84,10
2011,45,42
2010,189,1
2015,49,42
2009,130,3
2016,88,9
2010,44,48
2012,38,136
2010,121,1
2016,200,1
2009,3,25613
2015,65,8
2013,110,4
2016,134,5
2010,113,1
2015,43,74
2010,157,27
2013,71,8
2010,67,6
2009,81,1
2010,6,3883
2016,38,152
2014,122,1
2009,50,19
2009,101,2
2012,117,3
2015,96,4
2015,207,1
2008,14,417
2011,124,4
2011,41,96
2010,51,21
2013,115,4
2010,71,5
2011,34,187
2016,149,8
2012,97,2
2016,193,1
2011,122,1
2016,11,1135
2011,54,39
2010,88,1
2016,215,1
2009,21,142
2011,70,14
2013,30,153
2015,36,204
2010,85,3
2013,26,259
2013,96,3
2012,45,38
2013,84,8
2015,103,9
2009,77,1
2012,120,1
2013,138,8
2013,113,5
2008,60,9
2015,137,1
2014,98,3
2010,146,2
2015,83,11
2015,111,6
2008,69,3
2016,22,385
2012,86,10
2011,98,2
2008,29,93
2011,97,1
2008,6,2880
2010,21,195
2013,68,16
2008,76,3
2009,31,117
2016,51,37
2013,163,3
2014,202,1
2011,152,9
2013,120,6
2015,23,266
2014,50,41
2015,29,173
2011,78,8
2013,172,1
2011,232,1
2009,18,231
2014,26,290
2015,154,16
2013,131,2
2010,307,1
2011,312,2
2012,69,12
2008,146,2
2016,137,7
2015,25,253
2013,35,231
2008,245,1
2009,139,1
2016,15,763
2016,131,3
2015,94,7
2014,170,2
2014,164,1
2012,44,58
2014,65,9
2008,83,1
2010,279,1
2011,161,1
2011,162,4
2015,69,24
2014,61,14
2014,48,45
2014,4,17654
2014,5,7326
2010,105,4
2010,127,1
2016,10,1638
2014,63,19
2010,65,7
2016,90,11
2010,11,722
2010,30,136
2011,80,9
2012,90,3
2015,199,3
2016,194,1
2010,151,9
2013,275,1
2009,129,1
2012,2,112990
2013,4,16967
2010,9,1148
2013,38,150
2011,72,14
2011,86,2
2014,176,1
2012,304,1
2016,89,6
2008,123,1
2015,82,13
2014,97,6
2012,144,2
2016,126,5
2009,43,35
2011,58,13
2009,46,28
2010,134,1
2015,156,55
2015,147,4
2016,159,35
2015,398,1
2011,102,3
2015,284,1
2013,132,4
2011,93,4
2016,63,12
2012,75,4
2008,124,3
2010,410,1
2015,52,52
2012,36,196
2014,78,13
2012,29,152
2015,158,33
2010,80,7
2015,170,2
2015,24,316
2015,12,1245
2013,259,1
2013,130,3
2015,171,2
2012,37,137
2012,158,29
2008,137,3
2014,291,1
2012,130,1
2012,26,265
2009,72,5
2014,25,233
2013,93,7
2011,228,1
2013,70,12
2010,210,1
2008,165,1
2012,8,2445
2008,37,55
2011,156,23
2013,119,3
2016,41,104
2008,7,1568
2016,55,18
2011,120,2
