year,AGE,count
2008,34.0,35
2008,35.0,40
2011,42.0,5900
2012,72.0,6840
2016,46.0,7140
2014,18.0,4796
2008,19.0,10
0,65.0,4624
2013,87.0,4672
2010,12.0,2526
2013,36.0,6323
2015,59.0,8405
2008,67.0,29
2015,2.0,4244
2013,11.0,2716
2013,82.0,6776
2012,30.0,7611
2004,70.0,1
2005,74.0,1
2012,51.0,7256
2009,42.0,5449
2014,83.0,6748
0,81.0,3601
2009,83.0,3941
2002,35.0,1
2015,46.0,6899
2013,38.0,6140
2016,61.0,9079
0,76.0,4822
2011,75.0,6617
2014,101.0,82
2013,2.0,4325
2008,69.0,35
2013,76.0,7171
2014,99.0,224
2016,99.0,156
2015,31.0,7550
0,50.0,4999
0,12.0,1487
2011,86.0,4308
2016,101.0,118
2008,30.0,35
2010,51.0,6439
2014,33.0,7630
2011,92.0,972
2008,41.0,25
2007,54.0,1
2011,72.0,6454
0,38.0,4821
2008,62.0,33
2009,92.0,446
2006,53.0,1
2013,78.0,7252
2013,95.0,661
0,80.0,4020
2011,64.0,8234
2012,71.0,6106
0,25.0,4558
2012,28.0,6801
2009,15.0,3044
2015,88.0,4619
2010,23.0,5276
2015,90.0,3370
2010,46.0,6029
2012,35.0,6350
0,24.0,4202
2012,107.0,3
2016,45.0,7264
2015,74.0,6689
2016,92.0,2540
2005,61.0,1
2016,64.0,9398
2008,5.0,7
2006,76.0,2
2013,80.0,6816
2006,29.0,1
2016,22.0,5098
2009,79.0,5189
2013,75.0,6962
0,,70180
2008,25.0,30
0,1.0,4041
2016,106.0,2
2010,19.0,3512
2014,12.0,2937
2013,28.0,7163
2010,71.0,5844
2012,90.0,3249
2009,29.0,6290
2012,75.0,7123
2013,63.0,8724
2009,103.0,1
2011,22.0,5219
2015,103.0,36
2011,30.0,7378
2016,65.0,9529
0,6.0,1989
2010,95.0,396
2014,104.0,15
2007,51.0,1
2011,59.0,7640
2011,105.0,4
1998,34.0,1
2009,71.0,5440
0,3.0,3390
0,75.0,4856
2012,106.0,3
2007,40.0,1
2013,9.0,2556
2015,68.0,9979
2001,30.0,1
2007,60.0,1
2011,62.0,8077
2015,32.0,7667
2015,52.0,7727
2016,58.0,8531
1997,37.0,1
2014,76.0,7059
2010,75.0,6088
2011,68.0,6444
2011,84.0,5147
2015,96.0,527
2008,27.0,42
2009,4.0,3506
2008,91.0,14
0,105.0,2
2008,10.0,3
2013,32.0,7376
2012,26.0,6645
2011,16.0,4359
2013,12.0,2930
0,68.0,4677
2008,51.0,31
2008,86.0,46
2008,9.0,3
2013,3.0,4398
2014,81.0,6866
2010,80.0,5755
2011,71.0,6300
2015,21.0,4871
2015,108.0,2
2016,44.0,7042
2010,6.0,2558
2010,67.0,5908
2012,7.0,2578
2014,59.0,8228
2015,41.0,6735
0,92.0,305
2009,75.0,5511
2015,62.0,8778
2006,41.0,2
2011,38.0,6470
2010,49.0,6196
2011,13.0,2926
2008,57.0,42
2011,67.0,6552
2016,87.0,5201
0,64.0,4637
2014,98.0,200
0,2.0,3364
0,79.0,4214
2008,14.0,8
2012,63.0,8682
2016,9.0,2749
2016,21.0,4977
2009,76.0,5549
2005,71.0,2
2010,9.0,2445
2008,26.0,28
2012,97.0,457
2010,15.0,3654
2016,89.0,4183
2016,72.0,8151
2008,76.0,60
2007,48.0,1
2014,32.0,7638
2010,16.0,3601
2010,17.0,3344
0,37.0,4940
2013,56.0,7687
2010,1.0,4727
0,61.0,6000
2013,98.0,331
2007,72.0,1
2014,108.0,2
2010,77.0,6108
2014,20.0,4580
2016,69.0,10747
2014,67.0,9541
2015,29.0,7676
2010,84.0,4392
2011,81.0,6204
2011,12.0,2799
2015,51.0,7913
2015,30.0,7660
2009,10.0,2300
0,18.0,1667
2014,43.0,6754
2011,56.0,7400
2009,100.0,29
2014,45.0,6585
2015,16.0,5155
2009,9.0,2333
2014,7.0,2739
2011,21.0,4978
0,35.0,5245
2006,31.0,1
2009,27.0,6315
2013,44.0,6346
2014,9.0,2692
2003,74.0,1
2015,82.0,6903
2011,15.0,4172
0,89.0,727
2008,82.0,63
2005,45.0,1
2015,81.0,7148
2014,23.0,5754
2012,10.0,2678
2009,57.0,6587
0,4.0,2850
2007,52.0,2
0,8.0,1657
2007,57.0,1
2009,23.0,4843
2012,33.0,6815
2014,50.0,7661
2016,14.0,3935
2014,80.0,6921
2014,29.0,7446
2014,88.0,4444
2010,28.0,6692
2008,28.0,38
2008,75.0,67
2007,82.0,3
2015,67.0,9932
0,78.0,4516
2015,83.0,6694
2008,58.0,44
2009,16.0,2909
2010,97.0,251
2008,31.0,30
0,87.0,1913
2014,54.0,7842
2011,7.0,2599
2015,87.0,5073
2011,17.0,4031
2009,20.0,3775
0,28.0,5290
2004,78.0,1
2016,38.0,6643
2011,90.0,2641
2008,80.0,56
2016,84.0,6612
2015,,32259
2008,55.0,32
2008,16.0,7
2011,55.0,7201
2016,42.0,6669
2009,55.0,6172
2011,73.0,6570
0,27.0,5389
2013,84.0,5909
2013,94.0,843
2009,91.0,610
2005,68.0,2
2015,86.0,5403
2006,85.0,1
2011,24.0,5915
2011,51.0,6809
2012,43.0,6230
2008,79.0,69
2008,42.0,23
2011,103.0,13
2014,25.0,6403
2010,42.0,5732
2009,106.0,1
2009,84.0,3611
2008,81.0,55
2004,27.0,1
2015,25.0,6347
2015,17.0,5007
2011,26.0,6444
2012,20.0,4897
2004,76.0,1
2009,82.0,4288
2015,55.0,8098
2007,73.0,1
2014,60.0,8215
2014,46.0,6530
2011,28.0,6894
2016,104.0,28
2010,10.0,2519
2013,104.0,26
2010,3.0,4068
2012,78.0,7184
2013,16.0,4688
2013,90.0,3197
2014,107.0,3
2016,31.0,7718
2016,86.0,5730
2015,50.0,7602
2010,89.0,2322
2014,44.0,6648
2011,78.0,6705
2012,81.0,6993
2011,18.0,4223
2015,23.0,5627
2014,61.0,8350
2008,37.0,39
2012,56.0,7657
2009,98.0,74
2008,94.0,12
1998,65.0,1
2009,78.0,5556
2012,89.0,3527
2009,74.0,5777
2015,78.0,7332
2016,13.0,3395
2011,39.0,6521
2010,58.0,7043
2016,95.0,1321
2008,84.0,57
2013,66.0,9070
2010,90.0,1735
2016,37.0,6701
2000,26.0,1
2010,60.0,7339
2015,61.0,8755
0,13.0,1655
0,86.0,2166
2015,49.0,7315
0,60.0,5940
2015,94.0,1718
0,90.0,520
2014,106.0,7
2009,14.0,2912
2008,48.0,24
2011,25.0,6084
0,40.0,4416
2015,89.0,4120
2013,10.0,2780
2008,20.0,12
2013,51.0,7110
2012,25.0,6507
2009,33.0,5599
2015,15.0,4833
2015,101.0,87
2011,69.0,6128
2016,43.0,6937
2004,51.0,1
2008,63.0,40
2007,68.0,1
2006,28.0,1
2010,86.0,3477
2004,37.0,1
2016,2.0,4207
2010,22.0,5023
2014,,32454
2011,91.0,1929
2015,85.0,6102
2008,77.0,70
2008,92.0,9
0,11.0,1417
0,33.0,4961
2009,88.0,2157
2014,19.0,4691
2015,27.0,7197
2010,4.0,3668
0,96.0,102
2016,59.0,8851
0,83.0,3144
2016,17.0,5406
2011,95.0,434
2009,41.0,5319
2010,55.0,6837
2012,91.0,2807
2008,85.0,49
2010,64.0,6642
2011,10.0,2658
2010,35.0,6073
2015,77.0,7286
2016,55.0,8621
2015,26.0,6791
2009,46.0,5370
2008,56.0,30
2005,46.0,1
2013,93.0,1627
2010,74.0,6235
2001,54.0,1
2007,33.0,1
2011,20.0,4573
2011,82.0,5734
2010,5.0,3045
2009,52.0,6072
2008,66.0,31
2015,38.0,6258
2016,83.0,6912
2014,97.0,298
2011,93.0,797
2013,50.0,7323
2008,18.0,7
2007,77.0,1
2008,87.0,50
2015,65.0,9425
2013,73.0,6825
2008,32.0,45
2008,98.0,1
2009,56.0,6511
2015,20.0,4663
2011,98.0,223
2008,65.0,31
2006,47.0,2
2010,85.0,3823
2016,91.0,2953
2013,88.0,4153
2009,38.0,5981
2015,76.0,7383
2015,66.0,9654
0,99.0,31
2013,92.0,2320
2014,75.0,7159
0,66.0,4486
2014,73.0,6393
2008,2.0,13
2009,66.0,5288
2012,6.0,2904
2013,23.0,5640
2014,110.0,1
2012,54.0,7407
2012,102.0,50
2011,80.0,6501
2004,43.0,1
2012,66.0,7845
2010,14.0,3296
0,17.0,1558
2015,105.0,7
2008,99.0,3
2010,25.0,5962
2016,18.0,4903
2013,20.0,4558
2010,21.0,4611
0,72.0,4791
2011,9.0,2685
2015,9.0,2779
2008,50.0,29
2012,104.0,15
2006,81.0,1
2016,48.0,7041
2010,29.0,7024
2009,22.0,4677
0,74.0,4797
2012,53.0,7363
2013,31.0,7487
2012,50.0,7207
2016,98.0,265
2008,95.0,8
2003,77.0,1
2015,45.0,6658
2010,47.0,5968
2008,70.0,30
0,36.0,5150
1995,32.0,1
2014,66.0,9589
2012,29.0,7310
2009,6.0,2512
2012,24.0,5999
2009,24.0,5202
2010,59.0,7183
2016,103.0,42
2009,13.0,2655
0,31.0,5112
2013,40.0,6783
0,85.0,2366
2009,51.0,5825
2011,101.0,55
0,39.0,4690
0,53.0,5246
2010,7.0,2421
2014,93.0,1920
2015,79.0,7258
2012,59.0,7823
0,7.0,1759
2000,51.0,1
2014,69.0,7411
2013,96.0,420
2009,97.0,139
2016,66.0,10242
2015,24.0,5935
2006,67.0,1
2014,56.0,7830
0,34.0,5129
2014,78.0,7364
2011,5.0,3394
2016,82.0,6881
2011,50.0,7004
2010,102.0,17
2006,46.0,1
2014,4.0,4098
2012,37.0,6156
2006,65.0,2
2004,63.0,1
2013,39.0,6405
2012,65.0,8825
2011,34.0,6082
0,63.0,4660
2011,85.0,4722
2008,100.0,1
2009,21.0,4241
2012,57.0,7890
2012,70.0,6621
2010,63.0,7477
2013,35.0,6569
2010,44.0,5750
2009,68.0,4790
0,44.0,4605
2016,28.0,7493
2012,8.0,2520
2003,46.0,1
0,103.0,2
2007,75.0,1
2010,82.0,4959
2013,37.0,5982
2012,31.0,7447
2010,70.0,5730
2012,,31953
2006,55.0,2
2010,39.0,6016
2014,16.0,4893
0,45.0,4643
2008,33.0,32
2013,101.0,75
2007,44.0,1
2012,92.0,1917
2011,6.0,2866
0,91.0,387
2016,40.0,6291
2010,62.0,7603
2016,26.0,6679
2013,24.0,6097
2012,101.0,81
2014,103.0,29
2008,74.0,49
2013,74.0,6968
2010,50.0,6617
2009,53.0,6034
2012,77.0,7162
2006,77.0,1
2016,77.0,7681
2009,18.0,2617
0,93.0,341
2013,49.0,7086
2014,74.0,7160
2011,66.0,6484
2013,64.0,8947
2010,2.0,4074
2008,54.0,47
2014,34.0,7226
2014,49.0,7068
2015,63.0,8858
2014,77.0,7117
2016,67.0,10498
2016,47.0,7081
2007,49.0,2
0,29.0,5059
2009,69.0,5285
2014,10.0,2710
2004,74.0,1
2016,5.0,3597
2006,72.0,3
2013,30.0,7372
2009,3.0,3837
2016,,31138
2015,7.0,2607
2009,96.0,237
2012,32.0,7304
2005,79.0,1
2015,102.0,53
2015,54.0,8118
2016,15.0,5053
2004,31.0,1
2005,59.0,2
2013,62.0,8267
2010,54.0,6768
2012,109.0,1
2005,75.0,1
2009,1.0,4537
2014,51.0,7479
2006,45.0,1
2011,63.0,8268
2009,28.0,6439
2012,84.0,5823
2014,11.0,2993
2015,6.0,2878
1995,48.0,1
0,94.0,264
2013,22.0,5383
0,57.0,5567
2012,87.0,4554
2016,88.0,4704
2008,68.0,41
2012,48.0,6967
2009,2.0,3924
2015,44.0,6827
2009,72.0,5501
2009,95.0,334
0,54.0,5365
2010,34.0,5772
2005,39.0,1
2016,50.0,7979
2008,39.0,19
2008,47.0,21
2013,43.0,6403
2013,106.0,4
2007,58.0,1
2013,34.0,6658
2012,88.0,3984
2014,41.0,6903
0,71.0,4826
2016,76.0,7595
2009,89.0,1536
2010,76.0,6071
2010,56.0,6948
0,19.0,2249
2013,1.0,5078
2013,45.0,6302
2012,83.0,6122
2012,93.0,1028
2008,72.0,51
2008,61.0,39
2008,23.0,18
2012,58.0,7846
2012,62.0,8470
2014,90.0,3245
2016,8.0,2683
2009,109.0,1
0,42.0,4612
2015,4.0,3980
2016,73.0,7996
2016,29.0,7727
2014,40.0,6622
2008,53.0,32
2013,58.0,7988
2013,52.0,7424
2005,63.0,1
2007,36.0,1
2016,34.0,7508
2012,80.0,6989
2010,57.0,6960
2013,108.0,1
2009,63.0,6092
2009,48.0,5678
2011,41.0,6025
2010,61.0,7481
2008,11.0,1
2015,80.0,7293
2009,12.0,2457
2013,19.0,4483
2016,30.0,7930
0,46.0,4581
2015,14.0,3850
2016,80.0,7251
2009,85.0,3136
2014,37.0,6134
2016,108.0,2
2011,76.0,6612
2013,60.0,8247
2012,86.0,5096
2012,95.0,551
2011,40.0,6533
2016,51.0,8222
2014,86.0,5319
2013,100.0,136
2008,22.0,17
2012,36.0,6101
2014,85.0,5581
2012,61.0,8145
2015,73.0,7081
2011,100.0,96
2011,36.0,6079
2014,42.0,6742
2008,38.0,32
2006,70.0,3
2013,86.0,5109
2010,40.0,5940
2016,56.0,8547
2014,39.0,6269
2004,39.0,1
2011,61.0,7965
2013,59.0,7931
2012,38.0,6359
2015,91.0,2933
2013,67.0,8123
2014,47.0,6631
2009,8.0,2337
2010,52.0,6531
2012,69.0,6830
2013,89.0,3644
2015,71.0,7612
2009,102.0,12
2003,56.0,1
2013,4.0,3884
2014,13.0,3374
2016,24.0,5938
0,59.0,5902
0,55.0,5465
2009,19.0,3000
2011,32.0,6645
0,100.0,21
2012,68.0,6993
2014,3.0,4460
2013,97.0,318
2005,51.0,1
2009,54.0,6349
2013,42.0,6705
0,23.0,3926
2007,56.0,1
2003,23.0,1
2009,44.0,5425
2010,66.0,6023
2015,34.0,7511
2014,14.0,3884
2014,62.0,8538
2013,29.0,7213
2016,6.0,3040
2009,87.0,2514
2012,52.0,7178
2006,60.0,1
2015,53.0,7856
2010,91.0,902
2005,54.0,2
2014,38.0,6109
2013,69.0,7190
2016,32.0,7622
2013,5.0,3406
0,101.0,10
0,51.0,5131
2016,71.0,7969
2009,11.0,2350
2015,93.0,2232
2009,60.0,6944
2011,19.0,4262
2012,21.0,5213
2015,35.0,7307
2010,37.0,6215
0,26.0,4849
2014,65.0,9305
2012,100.0,152
2016,7.0,2664
2004,34.0,1
2009,26.0,5840
2016,11.0,2943
2016,4.0,4020
2006,25.0,1
2014,6.0,2835
0,102.0,4
2012,108.0,2
2012,4.0,4110
2015,42.0,6864
2015,48.0,6879
2014,48.0,6856
2007,61.0,1
2005,84.0,1
2016,70.0,9203
2007,46.0,1
0,82.0,3476
2014,109.0,2
0,22.0,3738
2006,71.0,1
2010,100.0,54
2013,48.0,6867
2012,79.0,7134
2008,24.0,21
2012,60.0,8025
2012,45.0,6349
2012,15.0,4345
2013,57.0,7702
2014,57.0,7841
2010,78.0,6221
2010,96.0,355
2014,100.0,161
2012,34.0,6572
2009,7.0,2383
2010,99.0,72
2012,1.0,5195
0,70.0,4750
2008,46.0,19
2011,102.0,33
2012,85.0,5442
2015,70.0,7689
2009,49.0,5634
2014,36.0,6458
2010,45.0,5814
2010,79.0,6094
2007,55.0,1
2016,49.0,7283
2009,36.0,6091
2011,57.0,7416
2016,27.0,7230
2008,78.0,73
2016,96.0,840
0,95.0,185
2016,94.0,1793
2010,27.0,6482
2014,96.0,478
2015,107.0,2
2007,71.0,2
2008,4.0,5
2008,40.0,19
0,21.0,3471
2009,45.0,5523
2015,13.0,3224
2009,77.0,5571
2014,55.0,7885
2012,44.0,6178
2009,73.0,5741
2012,14.0,3646
2000,67.0,1
2016,78.0,7292
2008,21.0,13
2004,69.0,1
0,98.0,51
2011,49.0,6461
2010,68.0,5640
2014,89.0,3876
2015,95.0,1106
2010,105.0,2
2016,62.0,9058
2009,70.0,5531
2010,33.0,5997
2015,60.0,8460
2011,97.0,375
2013,54.0,7513
2011,37.0,6142
2008,1.0,27
2009,31.0,6136
2008,90.0,17
2013,55.0,7754
2012,64.0,8803
2014,5.0,3358
2008,6.0,4
0,56.0,5451
2013,25.0,6385
2012,76.0,7142
2012,74.0,6852
2011,23.0,5514
2005,43.0,1
2016,25.0,6370
2012,23.0,5813
2007,74.0,3
2013,83.0,6504
0,58.0,5745
2015,99.0,160
2012,99.0,208
2013,41.0,6651
2015,39.0,6067
2014,1.0,4967
2015,75.0,7380
2013,18.0,4575
2011,3.0,4523
2010,11.0,2560
2013,46.0,6428
2008,43.0,23
2014,72.0,6840
2009,64.0,5504
2014,91.0,2790
2004,56.0,2
0,14.0,1823
2015,56.0,8175
2015,18.0,4746
2011,45.0,6193
2010,92.0,715
2014,84.0,6303
2011,70.0,5785
2012,47.0,6677
2016,97.0,396
2010,72.0,5859
2014,31.0,7509
2013,61.0,8204
2013,8.0,2543
2013,21.0,5093
2016,79.0,7324
2011,33.0,6337
2014,21.0,4875
2015,8.0,2717
0,41.0,4538
2010,101.0,34
2003,79.0,1
2014,26.0,6998
2014,24.0,5971
2016,53.0,8315
2009,58.0,6368
2011,1.0,5086
2004,58.0,1
2016,68.0,10509
2013,65.0,9134
2010,,30332
2014,27.0,7184
2016,23.0,5414
2007,41.0,2
2014,64.0,9172
2016,100.0,100
2006,61.0,1
2009,32.0,5886
2011,,31384
0,30.0,5184
2009,61.0,6812
2009,25.0,5449
2016,19.0,4839
2016,93.0,2147
2009,101.0,15
2009,104.0,1
2011,96.0,462
2011,99.0,155
2010,36.0,6227
2004,32.0,1
2009,80.0,4689
2011,4.0,4085
2014,22.0,5255
2012,40.0,6768
2007,53.0,1
0,9.0,1573
2014,68.0,8485
2008,71.0,50
2011,106.0,2
2013,27.0,7087
2011,8.0,2649
2016,74.0,7410
2012,22.0,5542
2015,64.0,9009
2008,64.0,35
2015,92.0,2484
2015,22.0,5183
2012,55.0,7436
2008,73.0,46
2007,76.0,1
2015,47.0,6748
2012,73.0,6899
2016,3.0,4353
2010,73.0,6080
2009,93.0,337
2009,94.0,387
2016,105.0,12
2016,107.0,1
2010,30.0,6737
2010,81.0,5228
2013,33.0,7147
2010,69.0,5304
2012,39.0,6603
2010,94.0,382
2008,96.0,3
2014,95.0,655
2015,19.0,4771
2007,47.0,1
2014,28.0,7195
2008,83.0,75
2013,14.0,3631
2012,49.0,6691
2009,5.0,3002
2014,87.0,4892
2016,33.0,7570
2015,10.0,2727
2006,56.0,1
2016,60.0,8749
0,49.0,4805
2009,99.0,59
2015,100.0,140
2006,59.0,2
2006,68.0,1
2011,88.0,3338
2008,45.0,24
2010,20.0,4026
2012,19.0,4681
2013,26.0,6767
0,84.0,2663
2011,31.0,7057
2014,30.0,7423
1999,26.0,1
2008,7.0,5
2016,75.0,6824
2013,79.0,6924
2011,79.0,6616
2008,8.0,7
2011,52.0,7028
2012,82.0,6558
2013,15.0,4338
2011,35.0,5991
2016,63.0,9340
2010,8.0,2381
0,69.0,4646
2011,87.0,3815
2011,43.0,5918
2009,90.0,784
2016,12.0,3065
0,97.0,59
2015,104.0,17
2013,107.0,1
2009,50.0,6074
2014,2.0,4225
2012,42.0,6550
2014,79.0,7377
2012,11.0,2875
2016,1.0,4998
2013,17.0,4886
2005,34.0,1
2008,13.0,2
2014,35.0,6914
2015,12.0,3073
2016,90.0,3567
2004,20.0,1
2016,54.0,8414
0,77.0,4897
0,10.0,1475
2011,107.0,1
2010,104.0,4
2009,86.0,2777
2012,12.0,2956
2008,36.0,26
2015,106.0,6
2011,44.0,5989
2012,105.0,8
2002,77.0,1
2010,32.0,6222
2012,41.0,6734
2010,83.0,4650
2013,105.0,10
2010,53.0,6540
2009,43.0,5408
2013,47.0,6653
2012,94.0,795
2012,103.0,40
2011,46.0,6388
2014,53.0,7533
2013,,31929
1998,45.0,1
2012,16.0,4688
0,73.0,4861
2010,93.0,474
2015,36.0,6715
2015,3.0,4307
2011,11.0,2794
0,47.0,4708
1999,24.0,1
2013,102.0,39
0,62.0,5314
2014,82.0,6878
2013,103.0,31
2015,109.0,1
2012,13.0,3174
2006,35.0,1
2004,50.0,1
2009,65.0,5506
2009,,27517
2015,72.0,7584
2008,59.0,35
2015,98.0,242
2010,31.0,6456
2011,27.0,6449
2009,17.0,2680
2015,43.0,6776
0,52.0,5197
2007,63.0,2
2011,58.0,7585
2008,49.0,29
2014,71.0,7330
2015,40.0,6383
2012,2.0,4370
2013,85.0,5581
2013,91.0,2787
0,16.0,1734
2016,102.0,66
0,32.0,4908
2008,88.0,49
2011,74.0,6661
2007,87.0,1
2012,17.0,4594
2010,98.0,152
2007,50.0,1
0,20.0,2939
2008,52.0,27
2010,43.0,5617
2014,17.0,4860
2008,3.0,5
2002,22.0,1
2010,87.0,2962
2012,96.0,407
2011,14.0,3503
2010,65.0,6015
2009,40.0,5588
2006,54.0,1
2010,26.0,6015
2016,57.0,8618
2013,81.0,6871
2001,48.0,1
2008,44.0,26
2008,12.0,7
2003,38.0,1
2010,41.0,5761
2003,57.0,2
2010,38.0,6160
2009,30.0,5971
2008,97.0,2
2006,50.0,4
2007,69.0,1
2013,71.0,6662
0,48.0,4793
0,106.0,1
2011,47.0,6409
2012,3.0,4355
0,5.0,2383
2014,8.0,2718
2008,29.0,40
2014,58.0,8072
2009,67.0,5236
2013,68.0,7129
2009,37.0,5863
2011,48.0,6291
2013,6.0,2880
2015,28.0,7331
2012,5.0,3580
2011,89.0,3080
2012,9.0,2564
2010,88.0,2745
2012,98.0,357
2008,17.0,7
2014,102.0,54
2015,58.0,8161
2016,41.0,6541
2012,18.0,4483
2014,94.0,1365
2007,80.0,2
2013,99.0,214
2009,34.0,5773
2009,81.0,4549
2010,48.0,5944
2014,15.0,4537
2015,1.0,5149
2013,72.0,6306
2011,77.0,6758
2015,57.0,8124
2015,5.0,3474
2009,62.0,6946
0,43.0,4557
0,15.0,1946
2011,2.0,4287
2011,54.0,7135
2010,18.0,3307
2013,70.0,6955
2016,20.0,4643
2006,69.0,3
2014,52.0,7536
2016,36.0,7322
2016,81.0,7219
2015,33.0,7697
2014,105.0,12
2012,46.0,6505
2016,35.0,7602
2011,60.0,7758
2003,42.0,1
0,67.0,4160
2008,15.0,4
2004,55.0,1
2010,103.0,5
2011,65.0,7366
2013,77.0,7250
2008,,405
2000,53.0,1
2015,37.0,6562
2013,13.0,3145
0,88.0,1386
2009,35.0,5872
2016,39.0,6289
2014,63.0,8648
2012,27.0,6802
2008,60.0,37
2009,39.0,5481
2010,24.0,5574
2015,11.0,2989
2015,69.0,8778
2016,10.0,2922
2008,89.0,25
2007,64.0,3
2016,16.0,5301
2015,97.0,391
2010,13.0,2797
2012,67.0,6913
2014,70.0,7355
2016,85.0,6241
2011,104.0,7
2008,93.0,10
2015,84.0,6638
2009,47.0,5487
2011,94.0,539
2007,26.0,1
2009,59.0,6858
2011,29.0,7292
2013,7.0,2736
2014,92.0,2411
2011,53.0,7027
2013,53.0,7369
2006,66.0,2
2005,65.0,1
2016,52.0,8240
2011,83.0,5558
