month_year,PRS_N,PRS_N_ID,PRS_N_Consults,PRS_N_Visites,PHA_N_Presta,PHA_N_ID,BIO_N_Presta,BIO_N_ID,CCAM_N_Presta,CCAM_N_ID,TIP_N_Presta,TIP_N_ID,UCD_N_Presta,UCD_N_ID,ETE_N_Presta,ETE_N_ID
00-6-2013,23217490,1688140,2684139,263615,5463531,1249079,3179778,315480,718739,339874,602958,252555,8430.0,3591.0,1632017,228285
00-10-2016,30975980,1819578,2698163,233202,6012810,1340310,3510260,328541,1169476,498531,699517,296702,7033.0,4085.0,1616035,243430
00-3-2013,25076974,1702825,2782311,304374,5828819,1288104,3418264,331017,725772,340828,618139,258269,9208.0,3885.0,1709293,222943
00-11-2010,17587912,1639555,2624545,296208,5783209,1255680,2851247,292801,692761,300626,507041,213019,10404.0,4081.0,1292333,179436
00-2-2014,25338831,1734914,2778935,288899,5715317,1299989,3226333,313214,724675,343035,634152,264111,8885.0,3976.0,1619162,225222
00-12-2013,23874174,1705658,2582123,277157,5921890,1309070,2984090,294737,642310,310662,635738,264305,9471.0,4029.0,1530721,210413
00-4-2010,17951262,1612288,2571711,303811,5746402,1232106,2777968,298566,635836,276371,519238,214330,9539.0,3690.0,1269732,174862
00-6-2015,31455437,1755449,2938899,263835,5751348,1292373,3544884,338085,1257979,531443,694962,285851,6984.0,3548.0,1842477,265720
00-10-2014,25528643,1838963,2956456,270956,6402776,1371489,3650902,347206,1066448,468353,680571,282929,7442.0,3657.0,1770185,252021
00-5-2012,393490,69555,70610,3445,5734,1901,52359,6020,25210,15591,4774,2045,220.0,99.0,168607,34719
00-4-2009,17943661,1610958,2596533,303478,5768721,1233979,2725049,297100,649635,243473,436837,182603,10739.0,3636.0,1341571,177891
00-7-2017,11515272,947885,1034186,76713,2593227,652425,1167144,126549,431954,205534,254115,113754,1372.0,881.0,297766,67797
00-8-2011,14736317,1435547,1941769,242761,4930352,1103908,2355441,243172,420591,215825,443718,183269,8896.0,3439.0,997997,133967
00-8-2016,25833313,1554324,2008039,208222,4940566,1146451,2868088,271836,770486,346327,600039,251278,6595.0,3597.0,1298670,184964
00-5-2016,30856189,1726157,2615627,243917,5585101,1269873,3444538,321778,1158222,493713,671170,284604,6802.0,3695.0,1617295,232757
00-2-2009,17274253,1566143,2481131,315853,5425014,1199335,2432806,280761,605885,229266,404638,171592,3125.0,1480.0,1219335,166443
00-10-2018,32886389,1830221,2927373,223653,6125103,1347514,3979391,353319,1395741,570216,804277,326509,8402.0,4973.0,1980169,298522
00-1-2009,19723437,1666958,2894046,398785,6429455,1327225,2263075,288394,636286,238218,426755,180315,2803.0,1296.0,1295543,172101
00-1-2014,28317630,1802785,3072290,324433,6197290,1345997,3520439,334465,784195,363779,655036,272053,9776.0,4116.0,1781268,238627
00-1-2017,35946546,1846639,3092939,301790,6338382,1385448,3585302,326596,1272451,525059,705619,297069,7843.0,4491.0,1820029,259085
00-12-2012,10134803,926214,745051,156896,1115951,339500,1115634,116349,253052,124106,276959,123066,7315.0,3246.0,1179799,150546
00-7-2014,23473565,1705477,2527546,257053,5669551,1248787,3032900,294478,804019,368173,650109,264670,6840.0,3219.0,1561792,217635
00-1-2018,36236758,1835242,3082267,273654,6184397,1362076,3892119,350239,1321057,541623,766524,313508,9839.0,5729.0,1975220,280614
00-5-2018,30531141,1698286,2509384,212116,5390626,1239315,3567079,325819,1160659,492018,715170,298219,8342.0,5143.0,1779121,261009
00-10-2013,24896241,1820895,2961214,285128,6236508,1347087,3537519,340503,784629,367947,657035,272924,9993.0,4008.0,1716154,241832
00-6-2011,17588870,1612482,2527981,275847,5523634,1218832,2837797,292289,590706,293558,526672,219509,8807.0,3463.0,1263443,178721
00-4-2016,31660197,1787243,2658954,249952,5717107,1293150,3541391,333807,1162919,497457,710596,296998,6832.0,3750.0,1608230,231814
00-12-2018,30754621,1716097,2401596,196101,5587977,1281041,3334078,303273,1087833,469531,761141,313986,7101.0,4292.0,1739882,251818
00-11-2013,22808276,1710626,2619188,261210,5690268,1283984,3175534,312325,691505,331347,595144,252682,9075.0,3966.0,1552221,219887
00-3-2015,33343619,1755152,2994819,292860,5921946,1316368,3664973,345209,1236158,520765,698134,289213,7428.0,3736.0,1892086,254282
00-7-2008,13909913,1355266,2091403,246933,4812981,1029787,1697505,225451,446059,179323,381789,154903,34.0,16.0,1020321,146728
00-11-2014,23048230,1716515,2636255,248617,5596106,1280954,3232475,315433,1044244,460561,621162,264004,6733.0,3496.0,1644266,234187
00-7-2011,16299129,1541880,2201570,249254,5343949,1179268,2493349,259754,491559,246429,508920,211496,8455.0,3370.0,1120263,152067
00-6-2012,512578,89510,93151,4501,7511,2479,63126,7039,32527,20084,6802,2813,284.0,127.0,212094,43605
00-4-2008,15715361,1428704,2437999,283514,5129020,1084487,2030753,261762,512916,213029,378402,156825,3.0,3.0,1159496,165841
00-11-2017,3010814,357110,196536,26826,36599,13261,231184,18996,124170,61531,72678,46347,1865.0,1277.0,483721,73535
00-2-2013,24532861,1738556,2816470,310123,5879889,1323715,3118359,308029,690700,328757,590206,248175,8882.0,3892.0,1565520,215706
00-1-2015,35257206,1820294,3044559,315826,6376934,1378396,3408159,325577,1134404,483680,667343,278329,7415.0,3751.0,1775517,242415
00-2-2012,291457,55702,65280,3395,4170,1332,38090,4437,21892,14020,3024,1368,174.0,85.0,150255,32064
00-2-2011,18552408,1655304,2672677,307084,5720219,1270420,2809788,288794,604678,299704,523150,221309,9540.0,3788.0,1266313,177099
00-5-2013,23376373,1663199,2571160,271060,5568240,1242121,3113610,307178,675765,322962,577172,241903,8925.0,3682.0,1575404,218198
00,592181,83001,164,25,8,6,26,5,10,10,16,12,,,74,18
00-1-2011,20724750,1715158,2993661,361794,6297980,1346753,2958118,298311,705082,307780,530277,224244,10365.0,4142.0,1405951,183464
00-9-2015,30248954,1798960,2981394,250229,5781997,1314544,3577894,339107,1193074,504970,669220,280039,6509.0,3363.0,1746677,252154
00-5-2011,19042025,1656443,2763718,300194,5765166,1258898,3034925,306463,664580,324105,547120,228526,9355.0,3638.0,1365381,190160
00-3-2017,34038073,1793300,2984961,254955,6022698,1333794,3987137,362593,1354572,557502,766112,317760,8237.0,4748.0,1875651,275208
00-4-2014,25641481,1772849,2775350,280223,5820154,1293446,3327498,319314,753524,352253,645354,270698,6508.0,3117.0,1708723,234910
00-2-2016,32357810,1777782,2779104,268106,5856292,1333453,3435051,324468,1152830,489550,680262,286789,7081.0,3821.0,1524934,221722
00-6-2010,18291244,1643885,2775617,305549,5795739,1250499,2936617,314976,691075,299003,521187,213320,10095.0,3854.0,1372619,190642
00-8-2008,11136081,1181975,1537573,203492,3937771,899166,1439151,191331,325442,132466,285418,120976,31.0,15.0,801596,112032
00-3-2008,15364503,1404289,2351665,281547,4973788,1078788,1970236,254367,485162,204338,360197,150250,13.0,7.0,1178636,159234
00-9-2008,14910469,1471383,2553116,263087,4987873,1093563,1986823,259128,542837,212204,358730,151107,141.0,70.0,1105545,160922
00-7-2012,586810,97543,91832,5733,11568,3983,68701,7577,31973,19529,8197,3637,389.0,173.0,211432,41755
00-6-2018,31364650,1758598,2754494,213715,5524257,1274974,3773696,344447,1314238,543798,770433,319253,8089.0,5112.0,1882001,282814
00-5-2015,28570286,1646562,2376527,233036,5185831,1209417,3110016,303245,982249,436260,619883,260303,6431.0,3389.0,1623712,225180
00-8-2009,13635391,1378987,1831350,239592,4696628,1062657,2086555,229886,457075,171838,364289,151820,10027.0,3517.0,1007202,130141
00-11-2015,29565260,1745501,2692427,240516,5643237,1290482,3363070,320030,1153789,493572,645562,276367,6778.0,3611.0,1674599,246669
00-2-2015,31893845,1743510,2772473,293782,5890647,1321104,3181373,307153,1066453,463702,638015,270256,6762.0,3593.0,1621341,226426
00-6-2017,25664591,1656446,2362887,181953,5188036,1219260,2919922,287776,1023914,454377,580161,249488,4483.0,2752.0,989048,182050
00-11-2016,30588261,1776667,2713224,237615,5877906,1321471,3469240,325904,1197717,506925,713836,298592,7225.0,4217.0,1631895,246737
00-8-2017,577100,73590,42524,4645,10783,3423,41250,3758,19894,10658,9523,4471,607.0,382.0,90176,16607
00-7-2010,16485964,1550132,2302700,275597,5538988,1193320,2460194,261931,559515,244976,524609,211255,9895.0,3773.0,1181040,161104
00-5-2008,14518156,1377532,2197540,249755,4730181,1043668,1869964,246894,469903,196431,358785,149661,17.0,9.0,1064543,155155
00-4-2018,31302416,1750044,2625634,218095,5421389,1261403,3561089,325612,1223035,513850,708845,300397,8137.0,5102.0,1811663,269795
00-11-2008,14469191,1438516,2243352,257456,4816798,1068666,1889825,247752,510311,199542,343762,148855,290.0,133.0,1079572,157233
00-12-2015,31439729,1756315,2628946,252026,6091891,1339259,3295602,315547,1067595,467109,733908,298793,7152.0,3690.0,1593540,232618
00-1-2008,16861615,1470367,2594056,339895,5413047,1145670,1994492,258688,489921,208673,369726,155502,30.0,12.0,1147621,158828
00-8-2013,19204102,1485566,1921415,227151,4850036,1119702,2578226,257852,459872,228906,522535,216300,8691.0,3567.0,1239704,165489
00-8-2014,19236157,1477362,1872905,210321,4715213,1105965,2620831,258259,556875,269920,524122,218895,5897.0,2968.0,1263035,169336
00-9-2018,28983405,1734846,2649687,198612,5175668,1233294,3712471,337221,1204272,504720,721238,303088,7753.0,4995.0,1778794,267935
00-8-2012,627152,94962,82536,6926,12291,4440,69783,7561,29160,17925,8716,3756,421.0,202.0,196226,37088
00-7-2016,28364528,1687161,2270122,214823,5365673,1229000,2922483,281437,981779,426219,673977,280104,6721.0,3718.0,1431417,207600
00-2-2008,15416577,1431103,2374393,293814,5054098,1104315,1893045,249803,475797,203067,361964,151544,11.0,7.0,1079640,155712
00-10-2017,1635787,249220,113648,12607,25438,8974,117676,10366,61003,31615,25514,13391,865.0,610.0,240796,41075
00-12-2010,18214981,1649828,2515233,319662,6223859,1310105,2632187,272788,616733,270699,544927,223947,10257.0,3975.0,1231423,167288
00-9-2016,30077266,1793103,2869784,234524,5632945,1293817,3630363,340179,1222561,511122,691785,290264,6754.0,3868.0,1639751,245384
00-9-2011,17673576,1688217,2790610,269300,5742543,1270684,3039429,310138,628572,308942,526819,220274,8799.0,3482.0,1239369,175503
00-3-2018,34541946,1795953,2945454,254124,6005734,1332992,4032819,363649,1333323,548677,800516,326147,9076.0,5649.0,1986964,286675
00-7-2018,29680656,1698390,2442168,204250,5343440,1231362,3256690,298454,1172781,488427,740310,303954,8351.0,5156.0,1737928,256087
00-4-2011,18066935,1631116,2516448,278253,5612010,1241658,2819187,288399,587436,293211,545848,229447,8964.0,3538.0,1262056,174568
00-12-2009,18035587,1641330,2549850,326890,6284458,1304707,2511012,275230,649842,242950,488716,198347,11012.0,3981.0,1209912,162760
00-6-2016,31328036,1767188,2796468,245870,5745829,1301029,3553859,335038,1252903,524729,710080,296449,6967.0,3781.0,1693858,249577
00-10-2011,17605089,1675617,2620338,261206,6004546,1303222,2933838,300307,601137,299983,538388,225938,8509.0,3486.0,1189327,170631
00-9-2014,23632266,1771907,3000842,264704,5548418,1277700,3451894,331495,992534,440034,621468,261280,6577.0,3279.0,1690499,242035
00-12-2011,11055967,1488464,1907632,139434,5076216,1173595,1836790,214651,360290,205798,328395,151760,2440.0,1254.0,390002,83197
00-12-2016,32281323,1784987,2648475,248001,6281848,1376636,3283831,311184,1073190,467450,748914,307268,7188.0,4256.0,1550715,229913
00-12-2017,12250438,920102,647659,87413,1053444,325879,1142959,112615,343977,159896,302436,146249,5997.0,4091.0,1263262,172125
00-4-2015,31689285,1771480,2758725,265088,5741887,1286597,3445059,326542,1150238,495637,681762,281841,7107.0,3585.0,1808707,248779
00-6-2008,14773531,1406076,2369361,258096,4779272,1060624,1907467,252223,513051,209571,368557,153235,44.0,15.0,1129468,165756
00-10-2015,31355960,1824731,2821580,251806,6132170,1347112,3580352,338677,1190751,508026,701904,293354,7053.0,3605.0,1738248,254081
00-6-2014,23799071,1697649,2712175,261212,5513105,1251028,3246855,316693,819074,380820,618221,260067,6225.0,3091.0,1654289,234340
00-3-2016,34346899,1817229,2998399,284962,6288390,1382834,3702223,345234,1249026,521769,727129,300189,7311.0,3811.0,1744042,242761
00-7-2015,29263733,1703425,2449313,240985,5583308,1241487,3050734,292840,1032425,445435,687184,275774,6939.0,3381.0,1641447,228326
00-12-2008,16747477,1555103,2476703,328441,5692613,1185805,1920148,252743,522957,202491,395284,166867,423.0,177.0,1143030,158267
00-3-2014,25975172,1722584,2820820,288164,5800214,1293338,3469120,332567,752733,353751,649208,270981,6328.0,3113.0,1756269,234963
00-3-2010,19898323,1658465,2952713,352444,6221914,1287023,3139889,329411,727474,309021,534915,220380,10572.0,3934.0,1450075,189776
00-11-2018,30754654,1759518,2701321,208496,5646628,1292979,3731127,335587,1291241,536153,756335,315364,7475.0,4402.0,1879836,284045
00-11-2011,16339575,1639278,2482714,238236,5840330,1276820,2754939,288889,556118,283497,471907,204829,7522.0,3080.0,998050,151098
00-4-2012,352108,63930,67597,3214,5305,1812,45676,5286,23667,14542,3944,1816,205.0,97.0,158401,32999
00-5-2010,17350889,1587689,2492308,292511,5495271,1209764,2674349,288487,609283,266501,474531,201144,9638.0,3711.0,1282021,172736
00-5-2014,23813029,1672889,2518411,255970,5462429,1241307,3201680,312215,683135,326202,633457,260164,6231.0,3029.0,1588387,220273
00-10-2012,1755987,286080,201598,25219,38551,14908,155287,16279,74058,42826,27405,13341,1154.0,556.0,375714,69266
00-2-2017,30543133,1720216,2568733,236759,5374563,1252333,3411804,318842,1140348,486222,674589,291202,7062.0,4320.0,1592310,238345
00-1-2013,27368441,1788756,3118009,358424,6470728,1385148,3344455,322507,748245,347152,609450,255961,10009.0,4114.0,1707838,227087
00-9-2010,17785950,1675591,2841041,292609,5853388,1269060,2947184,303218,716306,306712,518707,215208,10064.0,3870.0,1324243,184452
00-8-2015,24467106,1502467,1921609,205290,4660348,1107348,2753567,266477,693845,319657,553774,231561,6018.0,3075.0,1343888,182235
00-9-2017,919927,127286,71875,7402,16070,5111,70292,6231,35968,19153,19226,10652,464.0,320.0,143469,25305
00-2-2010,17558079,1586882,2524991,318115,5546032,1213609,2643226,286273,605019,263570,467358,198661,10338.0,3980.0,1216891,167432
00-1-2012,305451,59520,73727,4358,3881,1278,44144,5436,23943,15294,3071,1409,184.0,87.0,170369,35115
00-10-2009,18885464,1711668,2928370,315013,6431528,1336575,2902000,312810,749336,274697,484495,201099,11134.0,3940.0,1389192,190810
00-5-2017,30017605,1721457,2556949,215407,5591420,1272909,3416691,319612,1157830,497199,675180,286995,6793.0,4056.0,1452529,234485
00-4-2017,29319284,1730951,2396257,208605,5294896,1236760,3267138,307242,1075075,468127,679691,289419,6682.0,4170.0,1524056,234341
00-3-2009,19077828,1626843,2826139,331816,5911764,1260976,2903917,313857,701268,259291,446814,185611,7381.0,2924.0,1453082,185008
00-3-2011,19986168,1674565,2881734,324444,6055161,1288192,3203392,321212,681876,331605,587152,240021,9861.0,3809.0,1437196,193447
00-7-2009,16375734,1543303,2331072,278882,5583282,1185923,2416268,266053,593248,221513,459818,187461,11039.0,3718.0,1220129,162682
00-1-2010,19134807,1620784,2692097,351437,5908372,1258257,2668765,285923,707666,261851,470849,199782,10701.0,3989.0,1308116,171255
00-1-2016,33599145,1787653,2812614,279371,5887959,1323805,3422721,323146,1146662,482534,669544,282364,6768.0,3699.0,1577786,219773
00-3-2012,347254,63312,73209,3214,4925,1578,47876,5430,25240,15831,3819,1726,195.0,95.0,174916,36007
00-9-2012,960863,152463,129525,11224,18885,7143,99614,10652,44911,27147,14896,7368,569.0,275.0,268221,52396
00-11-2012,3064388,402910,314412,64931,58413,22738,294956,29319,126111,69085,65948,33933,2325.0,1074.0,564849,88881
00-12-2014,25114950,1747155,2713085,269209,6208732,1347921,3139711,305802,1042784,458659,701044,285618,7420.0,3691.0,1656118,232199
00-9-2009,17970446,1692217,2932093,306631,6051379,1296136,2831310,308153,720916,264933,454557,187976,10794.0,3755.0,1333394,181340
00-5-2009,16779286,1558534,2401451,281335,5395213,1189402,2544128,281607,610160,230873,409783,172631,10095.0,3546.0,1267137,171098
00-10-2010,18133466,1675333,2708951,296148,6042235,1289024,2912807,298257,706160,304877,535102,224247,10185.0,3987.0,1342340,185088
00-9-2013,22622556,1736752,2857262,263891,5489275,1265361,3272182,320354,708822,337586,582811,247228,8671.0,3742.0,1580741,221457
00-11-2009,17413672,1660198,2687050,307440,5916056,1287562,2645106,290264,712591,265273,443012,186140,10714.0,3942.0,1269501,175186
00-4-2013,24760497,1723308,2833492,293651,5787765,1287748,3271706,318786,742149,348560,612523,258905,9103.0,3755.0,1680932,232176
00-8-2010,14264380,1409833,1919739,251298,4793798,1079523,2274266,238905,468371,208661,424275,176983,9398.0,3596.0,1011746,135153
00-2-2018,31658836,1744609,2673114,232193,5511448,1283043,3438597,317311,1194733,501698,703078,299852,8486.0,5510.0,1752397,260967
00-7-2013,23338255,1712467,2610056,272085,5679440,1255518,2990343,293130,668877,315615,631298,259491,9515.0,3770.0,1582251,216552
00-10-2008,15986207,1503091,2575649,277179,5487135,1142343,2108129,272089,581434,224267,389786,164587,316.0,141.0,1186016,173022
00-6-2009,17591094,1603026,2672914,300181,5640026,1220567,2720378,298790,689180,256543,446706,185461,10841.0,3734.0,1350608,185153
00-8-2018,26086297,1535003,1977074,186790,4818841,1134893,3038066,278219,822251,363040,661764,272038,8168.0,4977.0,1458317,210559
