year,PFS_PRA_SPE,count
2017,54,9
2008,35,721
2008,34,7
2012,72,753
2012,0,6
2011,42,1297
2016,46,2014
2014,18,1971
2008,19,71487
2011,0,3
2013,36,3641
2010,12,4881
2008,67,495
2015,2,11528
2017,40,63
2013,11,4843
2012,30,8597
2017,78,16
2012,51,112
2009,42,1192
2017,79,525
2017,19,101909
2015,46,1878
2016,61,922
2013,38,1992
2017,39,887
2011,75,111
2013,2,10486
2013,76,626
2015,31,1098
2008,30,6668
2014,33,10619
2010,51,110
2008,41,3679
2011,72,628
2008,62,73
2017,4,6683
2013,78,11
2012,71,37
2011,64,15603
2017,43,245
2012,28,37844
2009,15,7553
2012,35,1020
2010,46,970
2017,0,3
2016,45,690
2015,74,942
2016,64,20263
2008,5,4652
2013,80,4
2016,22,24
2013,75,127
2009,79,190
2014,12,5736
2010,19,76511
2017,34,165
2013,28,39793
2013,63,3224
2012,75,118
2010,71,28
2009,29,4480
2011,22,26
2016,65,5556
2011,30,7661
2009,71,26
2013,9,1013
2015,68,315
2011,62,91
2015,32,1543
2014,76,670
2017,64,21142
2010,75,107
2011,68,217
2008,27,17341
2013,0,2
2009,4,5221
2008,10,286
2013,32,1419
2012,26,120698
2017,18,2026
2013,12,5527
2011,16,1847
2008,51,107
2008,9,907
2013,3,9948
2010,80,1
2011,71,33
2015,21,9545
2016,44,165
2010,6,23051
2012,7,7595
2015,41,6563
2010,67,584
2015,62,104
2009,75,100
2017,2,12931
2011,38,1840
2011,13,2200
2010,49,577
2008,57,42
2011,67,621
2017,11,5659
2008,14,2900
2012,63,3067
2016,21,10404
2016,9,1096
2009,76,438
2010,9,927
2008,26,97781
2017,49,1331
2010,15,7816
2016,72,981
2008,76,432
2014,32,1475
2010,16,1584
2010,17,1032
2013,56,46374
2010,1,103229
2017,6,39172
2014,20,35
2010,77,62
2014,67,811
2015,29,6132
2011,12,5113
2015,51,106
2015,30,10718
2009,10,308
2011,56,41860
2014,43,194
2014,7,8253
2014,45,558
2015,16,2890
2009,9,916
2011,21,6558
2017,12,6341
2017,27,25901
2013,44,138
2014,9,1039
2009,27,18026
2011,15,8509
2014,23,11
2012,10,415
2009,57,372
2017,38,2235
2016,14,3567
2012,33,9962
2014,50,46717
2014,80,7
2014,29,5825
2010,28,34116
2008,28,30504
2008,75,93
2015,67,829
2009,16,1436
2008,31,961
2014,54,5
2011,7,7114
2011,17,1035
2009,20,7
2017,14,3640
2016,38,2167
2008,55,11129
2008,16,1340
2017,72,1058
2011,55,12078
2016,42,1576
2011,73,381
2009,55,11473
2017,51,107
2012,43,142
2011,24,130645
2011,51,111
2008,42,1167
2008,79,2
2010,42,1236
2017,70,2371
2015,17,1039
2017,22,36
2012,20,25
2011,26,114259
2015,55,12917
2011,28,36018
2014,60,9613
2014,46,1729
2010,10,326
2012,78,9
2010,3,7637
2013,16,2477
2017,37,2480
2016,31,1129
2015,50,47867
2014,44,145
2011,18,1830
2011,78,9
2014,61,750
2015,23,12
2008,37,1388
2012,56,44046
2017,57,504
2009,78,8
2016,13,2851
2015,78,14
2009,74,381
2011,39,654
2017,23,10
2013,66,90
2016,37,2250
2015,61,851
2010,60,8262
2015,49,1115
2009,14,2958
2008,48,430
2013,10,458
2008,20,2
2017,60,10725
2013,51,113
2015,15,11030
2009,33,8973
2016,43,229
2008,63,2254
2016,2,12128
2017,15,12523
2017,48,1190
2008,77,62
2010,0,7
2014,19,90106
2015,27,23657
2010,4,5304
2016,17,1035
2009,41,3893
2010,55,11764
2011,10,369
2010,64,14443
2015,77,63
2010,35,813
2016,55,13090
2015,26,139728
2008,56,32485
2009,46,910
2010,74,420
2011,20,19
2008,66,66
2010,5,4782
2015,38,2108
2013,50,45584
2008,18,1754
2013,73,545
2015,65,5132
2008,32,1149
2015,20,40
2008,65,2579
2009,56,37145
2015,76,681
2015,66,93
2009,38,1717
2014,73,618
2014,75,134
2008,2,7782
2009,66,71
2013,23,10
2012,6,28590
2011,80,1
2012,66,86
2010,14,3040
2017,29,6736
2016,18,2009
2013,20,33
2010,21,6032
2011,9,954
2015,9,1066
2008,50,39601
2016,48,1100
2010,29,4744
2013,31,1068
2012,50,44515
2017,76,718
2015,45,608
2010,47,318
2008,70,2163
2012,29,5284
2014,66,90
2009,6,21568
2012,24,137572
2009,24,117454
2009,0,9
2009,13,1876
2013,40,63
2009,51,108
2010,7,6732
2015,79,475
2017,3,12742
2016,66,97
2015,24,158634
2014,56,48390
2011,5,4933
2014,78,12
2017,75,158
2011,50,43238
2012,37,1655
2014,4,6158
2013,39,776
2017,10,614
2012,65,4008
2011,34,62
2012,57,459
2009,21,5614
2013,35,1117
2012,70,2213
2010,44,85
2010,63,2710
2009,68,176
2017,66,100
2016,28,45862
2012,8,4694
2013,37,1829
2012,31,1050
2010,70,2174
2017,46,2179
2014,16,2716
2008,33,8762
2010,39,607
2011,6,25473
2016,40,63
2010,62,84
2016,26,148424
2017,69,1
2017,80,7
2013,24,144226
2008,74,343
2013,74,764
2012,77,62
2010,50,41861
2016,77,64
2009,18,1760
2013,49,916
2014,74,881
2017,65,5983
2013,64,17572
2011,66,80
2010,2,8384
2014,34,115
2017,73,820
2014,49,1011
2014,77,62
2015,63,3948
2016,47,626
2016,67,931
2014,10,492
2016,5,5707
2013,30,9630
2009,3,7332
2015,7,8649
2017,24,173758
2012,32,1364
2017,42,1649
2016,15,11727
2015,54,6
2013,62,98
2014,51,106
2009,1,101320
2011,63,2890
2014,11,5043
2015,6,34505
2009,28,32274
2013,22,16
2008,68,167
2012,48,774
2015,44,155
2009,2,8074
2009,72,505
2010,34,47
2016,50,49012
2008,39,589
2008,47,268
2013,43,167
2013,34,99
2014,41,6145
2016,76,702
2010,76,450
2010,56,39706
2013,1,113518
2013,45,490
2008,61,303
2008,72,467
2016,8,5764
2012,62,97
2015,4,6352
2015,0,4
2016,29,6439
2016,73,765
2014,40,63
2017,5,5849
2017,36,4152
2016,34,146
2012,80,2
2010,57,414
2009,63,2481
2017,31,1165
2011,41,4656
2008,11,3846
2010,61,410
2009,48,485
2015,80,7
2013,19,86477
2009,12,4763
2016,30,11000
2015,14,3513
2016,80,7
2014,37,1944
2013,60,9329
2011,76,478
2011,40,61
2016,51,107
2012,36,3513
2017,1,128939
2012,61,579
2015,73,700
2011,36,3419
2014,42,1475
2008,38,1652
2017,61,982
2010,40,61
2016,56,53166
2014,39,812
2012,38,1930
2011,61,484
2013,67,687
2014,47,534
2009,8,3505
2015,71,61
2013,4,5997
2014,13,2569
2016,24,166125
2011,32,1266
2009,19,73924
2012,68,237
2014,3,10740
2013,42,1414
2014,14,3424
2015,34,123
2010,66,74
2009,44,73
2014,62,100
2016,6,37005
2013,29,5550
2017,77,63
2015,53,73
2016,32,1613
2014,38,2060
2013,5,5290
2017,67,885
2016,71,79
2009,11,3950
2009,60,7979
2011,19,79868
2012,21,7188
2015,35,1300
2010,37,1443
2016,7,9055
2014,65,4792
2014,0,6
2016,4,6500
2016,11,5461
2009,26,103064
2014,6,32603
2012,4,5854
2014,48,941
2015,42,1520
2015,48,1020
2016,70,2336
2017,68,352
2013,48,864
2012,79,396
2008,24,111374
2017,13,2992
2012,15,9315
2012,60,8963
2012,45,419
2013,57,481
2014,57,487
2010,78,9
2012,34,82
2009,7,6546
2012,1,109846
2008,46,830
2014,36,3771
2015,70,2294
2010,79,250
2010,45,291
2009,49,491
2016,49,1221
2016,27,24718
2011,57,446
2009,36,3206
2008,78,8
2010,27,18771
2008,4,5186
2008,40,62
2017,50,50371
2012,14,3298
2012,44,121
2014,55,12729
2015,13,2723
2009,45,271
2009,77,61
2009,73,313
2016,78,15
2008,21,5151
2017,56,55066
2011,49,661
2010,68,198
2017,71,100
2016,62,110
2010,33,9234
2009,70,2160
2015,60,9989
2011,37,1507
2008,1,99187
2009,31,977
2013,55,12501
2012,64,16584
2014,5,5440
2008,6,20066
2017,74,1184
2017,26,161160
2012,74,656
2012,76,579
2011,23,140
2012,23,14
2017,7,9513
2013,41,5720
2015,39,828
2013,18,1944
2014,1,117257
2015,75,144
2011,3,8486
2010,11,4016
2013,46,1588
2008,43,77
2014,72,877
2009,64,13501
2011,45,350
2015,56,51006
2015,18,1989
2012,47,446
2011,70,2198
2014,31,1081
2010,72,564
2017,33,11650
2013,8,4934
2013,61,678
2013,21,7907
2016,79,498
2011,33,9583
2014,21,8691
2015,8,5507
2016,53,97
2011,1,105956
2014,24,151293
2014,26,133296
2017,55,13279
2016,68,334
2013,65,4381
2016,23,13
2014,27,22654
2014,64,18533
2009,32,1180
2016,19,97830
2009,61,341
2010,36,3306
2011,4,5560
2009,80,1
2014,22,18
2012,40,63
2014,68,285
2008,71,23
2017,44,177
2013,27,21607
2011,8,4158
2016,74,1063
2012,22,22
2015,64,19358
2008,64,12536
2015,22,23
2012,55,12282
2008,73,299
2012,73,480
2015,47,571
2016,3,12067
2010,73,338
2016,0,6
2010,30,7119
2017,63,4114
2013,33,10279
2012,39,728
2017,17,1031
2015,19,93903
2017,9,1111
2017,21,11310
2017,20,59
2014,28,41741
2013,14,3353
2012,49,824
2009,5,4711
2016,33,11302
2015,10,523
2016,60,10351
2008,45,243
2017,16,3395
2012,19,83129
2010,20,11
2013,26,126728
2011,31,1025
2014,30,10439
2008,7,6490
2016,75,148
2013,79,420
2011,79,359
2008,8,3395
2017,8,6044
2016,63,3977
2013,15,9846
2011,35,894
2010,8,3624
2016,12,6147
2011,43,128
2017,41,7515
2014,2,10990
2009,50,40651
2016,1,124790
2013,17,1039
2012,11,4629
2012,42,1362
2014,79,440
2008,13,1827
2017,32,1693
2014,35,1182
2015,12,5930
2016,54,7
2012,12,5313
2008,36,3081
2011,44,100
2010,32,1205
2012,41,5212
2009,43,88
2013,47,501
2011,46,1147
2014,53,41
2012,16,2228
2015,3,11390
2015,36,3878
2011,11,4309
2017,45,741
2012,13,2377
2015,72,920
2009,65,2880
2010,31,994
2011,27,19836
2015,43,216
2009,17,1032
2008,49,440
2014,71,53
2012,2,9876
2015,40,63
2011,74,494
2012,17,1038
2014,17,1039
2008,3,7043
2010,43,104
2008,0,8
2011,14,3166
2010,65,3224
2009,40,61
2010,26,108538
2016,57,501
2008,12,4673
2008,44,73
2017,35,1463
2010,41,4075
2010,38,1782
2009,30,6920
2013,71,49
2012,3,9311
2011,47,379
2014,8,5234
2008,29,4262
2013,68,255
2009,67,534
2013,6,30367
2011,48,655
2009,37,1417
2012,5,5178
2015,28,43785
2012,9,978
2008,17,1033
2016,41,7010
2012,18,1916
2017,47,679
2014,15,10418
2015,1,120938
2010,48,545
2009,34,37
2013,72,808
2011,77,63
2017,28,47454
2015,5,5582
2015,57,492
2009,62,76
2011,2,9167
2016,20,48
2013,70,2240
2010,18,1771
2016,36,4013
2015,33,10955
2016,35,1372
2012,46,1420
2011,60,8581
2017,53,116
2008,15,7342
2013,77,62
2011,65,3580
2013,13,2458
2015,37,2066
2017,30,11249
2016,39,854
2014,63,3699
2009,35,770
2012,27,20723
2008,60,7807
2015,11,5264
2010,24,123660
2009,39,597
2016,10,576
2017,62,115
2016,16,3082
2010,13,1957
2012,67,653
2014,70,2267
2009,47,297
2013,7,7913
2011,29,4995
