year,IMB_ALD_NUM,count
2008,12,48849
2008,25,3096
2008,24,5731
2008,1,11512
2008,6,7791
2008,3,17641
2008,2,509
2008,18,285
2008,4,6
2008,8,79949
2008,28,458
2008,27,3513
2008,13,40831
2008,11,1157
2008,33,34
2008,99,2350
2008,17,2562
2008,31,1276
2008,7,4784
2008,29,676
2008,19,4096
2008,0,227124
2008,23,49897
2008,26,955
2008,22,7903
2008,21,2811
2008,98,7107
2008,14,13914
2008,30,74781
2008,9,10450
2008,10,586
2008,16,3284
2008,32,128
2008,20,1527
2008,5,28460
2008,15,7666
2009,12,55546
2009,25,3316
2009,24,6168
2009,1,13405
2009,6,8420
2009,3,20185
2009,2,612
2009,18,300
2009,4,6
2009,8,89167
2009,28,499
2009,27,3860
2009,13,45186
2009,11,1286
2009,33,66
2009,99,2226
2009,17,2804
2009,31,1626
2009,7,5031
2009,29,667
2009,19,4719
2009,0,246721
2009,23,53017
2009,26,1110
2009,22,8730
2009,21,3131
2009,98,7047
2009,14,15660
2009,30,83853
2009,9,11414
2009,10,663
2009,16,3879
2009,32,178
2009,20,1618
2009,5,33288
2009,15,9770
2010,12,63055
2010,25,3544
2010,24,6662
2010,1,15574
2010,6,9183
2010,3,22901
2010,2,746
2010,18,313
2010,4,8
2010,8,99357
2010,28,539
2010,27,4247
2010,13,49937
2010,11,1463
2010,33,130
2010,99,2180
2010,17,3089
2010,31,2071
2010,7,5339
2010,29,702
2010,19,5468
2010,0,267031
2010,23,56885
2010,26,1296
2010,22,9585
2010,21,3485
2010,98,7025
2010,14,17577
2010,30,94211
2010,9,12474
2010,10,738
2010,16,4584
2010,32,257
2010,20,1688
2010,5,38914
2010,15,12273
2011,12,65667
2011,25,3782
2011,24,7144
2011,1,17843
2011,6,9926
2011,3,25777
2011,2,933
2011,18,324
2011,4,8
2011,8,109759
2011,28,585
2011,27,4624
2011,13,54781
2011,11,1615
2011,33,317
2011,99,2077
2011,17,3347
2011,31,2618
2011,7,5590
2011,29,706
2011,19,6330
2011,0,285581
2011,23,60768
2011,26,1477
2011,22,10400
2011,21,3885
2011,98,7005
2011,14,19398
2011,30,105523
2011,9,13622
2011,10,804
2011,16,5372
2011,32,344
2011,20,1785
2011,5,45009
2011,15,15213
2012,12,63597
2012,25,4022
2012,24,7635
2012,1,20180
2012,6,10573
2012,3,28367
2012,2,1106
2012,18,348
2012,4,8
2012,8,120115
2012,28,632
2012,27,4990
2012,13,59592
2012,11,1720
2012,33,645
2012,99,1991
2012,17,3576
2012,31,3402
2012,7,5909
2012,29,732
2012,19,7275
2012,0,303581
2012,23,64675
2012,26,1703
2012,22,11162
2012,21,4291
2012,98,6971
2012,14,21174
2012,30,113471
2012,9,14704
2012,10,861
2012,16,6126
2012,32,471
2012,20,1870
2012,5,51453
2012,15,18339
2013,12,60357
2013,25,4235
2013,24,8118
2013,1,22647
2013,6,11060
2013,3,30772
2013,2,1278
2013,18,362
2013,4,6
2013,8,130090
2013,28,671
2013,27,5395
2013,13,64135
2013,11,1845
2013,33,1163
2013,99,1954
2013,17,3797
2013,31,4206
2013,7,6230
2013,29,734
2013,19,8301
2013,0,321386
2013,23,68325
2013,26,1831
2013,22,11914
2013,21,4730
2013,98,6875
2013,14,22754
2013,30,121614
2013,9,15734
2013,10,913
2013,16,6880
2013,32,613
2013,20,1940
2013,5,57663
2013,15,21321
2014,12,56471
2014,25,4436
2014,24,8549
2014,1,24906
2014,6,11419
2014,3,33072
2014,2,1476
2014,18,377
2014,4,7
2014,8,139580
2014,28,729
2014,27,5807
2014,13,68585
2014,11,1946
2014,33,1688
2014,99,1929
2014,17,4042
2014,31,5009
2014,7,6468
2014,29,712
2014,19,9336
2014,0,339412
2014,23,71787
2014,26,2030
2014,22,12660
2014,21,5197
2014,98,6872
2014,14,24324
2014,30,129155
2014,9,16899
2014,10,969
2014,16,7651
2014,32,777
2014,20,1990
2014,5,63896
2014,15,23982
2015,12,50282
2015,25,4671
2015,24,8843
2015,1,26445
2015,6,11580
2015,3,34913
2015,2,1630
2015,18,385
2015,4,10
2015,8,148268
2015,28,764
2015,27,6174
2015,13,72611
2015,11,2064
2015,33,1752
2015,99,1903
2015,17,4276
2015,31,5342
2015,7,6684
2015,29,695
2015,19,10398
2015,0,356397
2015,23,75130
2015,26,2214
2015,22,13335
2015,21,5634
2015,98,6871
2015,14,25559
2015,30,134313
2015,9,17931
2015,10,1037
2015,16,8327
2015,32,902
2015,20,2065
2015,5,69402
2015,15,26504
2016,12,42724
2016,25,4855
2016,24,9122
2016,1,27887
2016,6,11704
2016,3,36643
2016,2,1763
2016,18,400
2016,4,9
2016,8,156728
2016,28,829
2016,27,6651
2016,13,76539
2016,11,2190
2016,33,1752
2016,99,1859
2016,17,4520
2016,31,5401
2016,7,6862
2016,29,677
2016,19,11576
2016,0,368273
2016,23,79468
2016,26,2386
2016,22,14051
2016,21,6148
2016,98,6869
2016,14,26216
2016,30,138082
2016,9,19176
2016,10,1099
2016,16,8962
2016,32,937
2016,20,2111
2016,5,74565
2016,15,28743
