month_year,PRS_N,PRS_N_ID,PRS_N_Consults,PRS_N_Visites,PHA_N_Presta,PHA_N_ID,BIO_N_Presta,BIO_N_ID,CCAM_N_Presta,CCAM_N_ID,TIP_N_Presta,TIP_N_ID,UCD_N_Presta,UCD_N_ID,ETE_N_Presta,ETE_N_ID
00-6-2013,23734586,1771802,2765012,265822,5583805.0,1287963.0,3280414.0,323871.0,738991.0,350364.0,620044.0,261094.0,9104.0,3813.0,1708530.0,236456.0
00-10-2016,30064279,1863125,2673300,221544,6105128.0,1372600.0,3502987.0,331128.0,1155457.0,499367.0,683860.0,294416.0,7126.0,4174.0,1507490.0,232247.0
00-3-2013,25607419,1785670,2868258,306890,5952826.0,1328271.0,3478598.0,339057.0,743225.0,351779.0,632948.0,265995.0,9589.0,4050.0,1740968.0,231021.0
00-11-2010,17479642,1682216,2692927,274622,5781853.0,1272667.0,2816073.0,292788.0,702167.0,307631.0,496254.0,212583.0,9800.0,4014.0,1310072.0,190119.0
00-2-2014,25795879,1815727,2861553,288867,5829004.0,1337454.0,3295146.0,321233.0,742170.0,351894.0,647373.0,271166.0,9432.0,4159.0,1677733.0,234060.0
00-12-2013,24338353,1788130,2657378,278270,6038691.0,1347512.0,3066093.0,302047.0,661976.0,319929.0,651140.0,272470.0,9821.0,4163.0,1593629.0,217701.0
00-4-2010,17332805,1628408,2593675,264372,5641355.0,1230299.0,2698232.0,295659.0,633477.0,280049.0,493332.0,207757.0,8838.0,3475.0,1232686.0,179935.0
00-6-2015,32020040,1836540,3014369,266631,5876818.0,1332312.0,3617260.0,345506.0,1292397.0,547304.0,712846.0,294638.0,7232.0,3686.0,1913240.0,273288.0
00-10-2014,25924602,1915524,3031794,273016,6536510.0,1412608.0,3736293.0,355018.0,1096353.0,483311.0,693627.0,288114.0,7605.0,3788.0,1830734.0,260143.0
00-5-2012,20094181,1729209,2634663,286245,5697463.0,1280651.0,3141256.0,312708.0,676548.0,320740.0,567265.0,240239.0,9667.0,3837.0,1542246.0,213414.0
00-4-2009,16622825,1592157,2570633,242121,5510038.0,1206681.0,2525525.0,283664.0,625971.0,239324.0,393722.0,169586.0,8216.0,2973.0,1206264.0,175855.0
00-8-2011,15411690,1502095,2059908,243304,5018342.0,1133975.0,2447838.0,251121.0,455544.0,231750.0,453016.0,189161.0,9074.0,3618.0,1161927.0,159597.0
00-8-2016,25789322,1610111,2031267,204680,5036534.0,1176290.0,2911866.0,276895.0,776717.0,351419.0,600748.0,254290.0,6951.0,3854.0,1290236.0,183697.0
00-5-2016,31155877,1796157,2660142,243594,5701653.0,1304921.0,3492187.0,328065.0,1176227.0,502471.0,679512.0,289994.0,7125.0,3950.0,1632755.0,231387.0
00-2-2009,15894554,1547529,2455411,250764,5167053.0,1171057.0,2256650.0,267296.0,583715.0,224910.0,364568.0,160387.0,2984.0,1377.0,1100628.0,163342.0
00-1-2009,17982583,1636711,2857246,320936,6125808.0,1294551.0,2078121.0,272839.0,611249.0,233662.0,379592.0,165575.0,2774.0,1278.0,1154884.0,167674.0
00-1-2014,28745494,1879012,3147035,325795,6314732.0,1383067.0,3606208.0,343257.0,800566.0,373323.0,665652.0,276704.0,10321.0,4352.0,1830967.0,245716.0
00-1-2017,176,135,0,0,,,,,,,,,,,,
00-12-2012,22868445,1780973,2619756,287557,6097568.0,1362246.0,2918000.0,294120.0,612921.0,298765.0,615315.0,257290.0,9510.0,3945.0,1503556.0,204408.0
00-7-2014,23885188,1771578,2596789,258741,5787179.0,1286142.0,3127397.0,302974.0,827960.0,380394.0,661041.0,269682.0,7046.0,3363.0,1630285.0,225140.0
00-10-2013,25308535,1896159,3042824,287229,6353707.0,1383894.0,3609188.0,348326.0,804687.0,379035.0,672217.0,278652.0,10336.0,4204.0,1781515.0,249757.0
00-6-2011,18154124,1682100,2658504,270547,5612916.0,1251077.0,2918634.0,299905.0,625492.0,309859.0,533787.0,225117.0,9060.0,3710.0,1415390.0,205482.0
00-4-2016,31886977,1856926,2682539,247500,5830570.0,1327138.0,3598395.0,340978.0,1183259.0,507981.0,715410.0,299954.0,7078.0,3936.0,1597455.0,229652.0
00-11-2013,23206966,1790479,2694301,263479,5795031.0,1320289.0,3259895.0,320374.0,711519.0,340677.0,608374.0,259861.0,9499.0,4098.0,1619076.0,227769.0
00-3-2015,33880748,1837237,3070996,294518,6042985.0,1357188.0,3744114.0,353562.0,1267693.0,536079.0,708215.0,296520.0,7702.0,3918.0,1951305.0,263206.0
00-7-2008,12477252,1305287,2036541,182091,4478934.0,986667.0,1533070.0,211221.0,419381.0,173659.0,325338.0,137979.0,32.0,15.0,892605.0,140696.0
00-11-2014,23468140,1793881,2713855,251214,5719596.0,1319444.0,3309274.0,323364.0,1078340.0,474521.0,634363.0,271268.0,6912.0,3633.0,1709591.0,242606.0
00-7-2011,16864594,1595096,2316955,249082,5420962.0,1205938.0,2559969.0,267293.0,526178.0,263930.0,515130.0,214845.0,8969.0,3641.0,1254785.0,177628.0
00-6-2012,21343335,1796684,2908637,289241,5957307.0,1335676.0,3358050.0,336072.0,751498.0,352159.0,618315.0,259027.0,9547.0,3864.0,1637600.0,231413.0
00-4-2008,14092367,1374108,2370076,209094,4766316.0,1036949.0,1829823.0,243780.0,479885.0,204359.0,325248.0,139680.0,16.0,9.0,1017664.0,158741.0
00-2-2013,25026555,1821435,2898083,312919,6005911.0,1364187.0,3174019.0,314388.0,706006.0,336735.0,601114.0,254322.0,9298.0,4026.0,1614791.0,223550.0
00-1-2015,35878539,1897416,3120618,318177,6520214.0,1420191.0,3509159.0,334559.0,1168398.0,498506.0,679932.0,283944.0,7504.0,3895.0,1854207.0,250174.0
00-2-2012,21352688,1805047,2875587,343645,6209886.0,1366819.0,3073435.0,307260.0,692207.0,328087.0,573979.0,245865.0,9407.0,4077.0,1532109.0,214767.0
00-2-2011,18734995,1712337,2771246,294672,5782308.0,1296847.0,2816686.0,291554.0,624511.0,310150.0,523178.0,223985.0,8987.0,3783.0,1316956.0,191525.0
00-5-2013,23871875,1739579,2648429,274815,5679897.0,1277908.0,3214232.0,315775.0,694197.0,332337.0,589024.0,248334.0,9946.0,3973.0,1649424.0,226294.0
00,798037,91373,123,26,39.0,26.0,60.0,6.0,11.0,9.0,11.0,7.0,,,54.0,14.0
00-1-2011,20779707,1759423,3096061,343831,6341118.0,1368469.0,2959964.0,300747.0,729055.0,321502.0,524437.0,222985.0,10049.0,4099.0,1467412.0,201750.0
00-9-2015,30811535,1881650,3060858,250747,5904159.0,1354217.0,3650384.0,346449.0,1228065.0,520318.0,682518.0,287284.0,6905.0,3637.0,1806263.0,259983.0
00-5-2011,19477023,1719128,2886531,294134,5838046.0,1288039.0,3064570.0,310596.0,693455.0,339326.0,551156.0,233702.0,9203.0,3725.0,1480340.0,214979.0
00-4-2014,26053460,1853336,2847690,280566,5933451.0,1329138.0,3423448.0,329057.0,770963.0,362353.0,658745.0,275439.0,6764.0,3214.0,1770342.0,243623.0
00-2-2016,32741236,1853337,2821593,268000,5972620.0,1371608.0,3484451.0,330460.0,1175700.0,499589.0,691357.0,292605.0,7386.0,3993.0,1533042.0,220308.0
00-6-2010,17908364,1675729,2818189,271684,5744187.0,1259780.0,2869308.0,312100.0,694588.0,303912.0,503039.0,211278.0,9311.0,3670.0,1353236.0,197396.0
00-8-2008,9881200,1146927,1499552,149969,3653399.0,861740.0,1286141.0,177408.0,304186.0,126733.0,247695.0,109532.0,29.0,14.0,686072.0,106929.0
00-3-2008,13782466,1362935,2297493,209660,4635910.0,1034105.0,1777046.0,236718.0,455672.0,196529.0,311418.0,136019.0,24.0,12.0,1038828.0,152621.0
00-9-2008,13627754,1439464,2512333,200858,4694870.0,1057128.0,1816517.0,244414.0,518019.0,207184.0,318846.0,139137.0,110.0,56.0,984043.0,156504.0
00-7-2012,19923552,1701984,2554907,270953,5668548.0,1271838.0,2903370.0,291913.0,634454.0,300634.0,581201.0,241721.0,9676.0,3799.0,1508819.0,207368.0
00-5-2015,29064850,1720179,2440012,233992,5295491.0,1245554.0,3187699.0,309971.0,1008209.0,448444.0,632412.0,267095.0,6593.0,3536.0,1690176.0,232684.0
00-8-2009,12648580,1374326,1829284,195847,4511388.0,1046923.0,1939990.0,220378.0,440966.0,169671.0,331907.0,143905.0,7902.0,2932.0,907414.0,128654.0
00-11-2015,30043460,1819845,2758039,241237,5759370.0,1325861.0,3445447.0,327649.0,1184599.0,506217.0,656643.0,282222.0,7111.0,3793.0,1740850.0,252413.0
00-2-2015,32459056,1825516,2849065,295208,6030762.0,1363101.0,3239993.0,315007.0,1092363.0,476214.0,648115.0,276469.0,7027.0,3819.0,1653506.0,232897.0
00-11-2016,28348226,1811161,2623176,213976,5944437.0,1351503.0,3366126.0,323358.0,1128423.0,490748.0,649692.0,286291.0,6248.0,3707.0,1307708.0,213261.0
00-7-2010,16053151,1562751,2330260,244537,5460574.0,1196241.0,2390833.0,259381.0,563312.0,248762.0,505655.0,206522.0,9159.0,3656.0,1161320.0,166782.0
00-5-2008,13038223,1338145,2143580,183796,4403578.0,1001467.0,1691882.0,230041.0,437713.0,187412.0,309224.0,134627.0,17.0,9.0,933003.0,148797.0
00-11-2008,13252793,1407383,2214810,203530,4550537.0,1034204.0,1740768.0,233825.0,486913.0,193765.0,310828.0,138738.0,225.0,110.0,975374.0,152724.0
00-12-2015,31946792,1837147,2692234,251877,6226556.0,1381009.0,3370912.0,322316.0,1097387.0,480631.0,752305.0,307539.0,7495.0,3923.0,1667853.0,238697.0
00-1-2008,14798727,1417709,2524169,251851,5010389.0,1091487.0,1782096.0,238921.0,456247.0,199865.0,313825.0,137040.0,17.0,8.0,986982.0,150958.0
00-8-2013,19571455,1552464,1985342,226699,4935370.0,1149850.0,2649460.0,264534.0,470734.0,235457.0,533048.0,222712.0,9051.0,3654.0,1298171.0,171066.0
00-8-2014,19566205,1541766,1929153,212053,4811804.0,1137106.0,2684245.0,265044.0,572463.0,278030.0,537229.0,225424.0,6194.0,3076.0,1316840.0,176379.0
00-8-2012,17433337,1561132,2072739,245424,5088754.0,1169682.0,2637687.0,266700.0,488858.0,241071.0,504097.0,209533.0,9507.0,3681.0,1270303.0,172417.0
00-7-2016,28374358,1739221,2290233,209481,5459794.0,1260373.0,2989878.0,287709.0,996253.0,433551.0,676718.0,282594.0,6966.0,3937.0,1441374.0,206062.0
00-2-2008,13734896,1384848,2315212,219475,4702052.0,1056612.0,1703155.0,231225.0,444060.0,193602.0,310647.0,135922.0,16.0,6.0,948073.0,147793.0
00-12-2010,18154265,1700870,2600102,299825,6266156.0,1334508.0,2601552.0,273662.0,634553.0,280304.0,538728.0,225573.0,9856.0,4033.0,1242499.0,178034.0
00-9-2016,29801471,1861439,2892064,226234,5734638.0,1330641.0,3678050.0,345989.0,1225314.0,516600.0,688724.0,293201.0,7016.0,4046.0,1594212.0,239746.0
00-9-2011,18842062,1781272,2990901,278157,5880524.0,1312903.0,3177067.0,321884.0,683885.0,335238.0,546154.0,230040.0,9183.0,3784.0,1469635.0,212170.0
00-4-2011,18317696,1685437,2614916,268560,5663432.0,1265640.0,2845674.0,293062.0,612615.0,306786.0,547493.0,232055.0,8596.0,3579.0,1340956.0,194892.0
00-12-2009,17086558,1656367,2570467,281534,6141723.0,1301297.0,2380046.0,267644.0,641742.0,243713.0,459459.0,193105.0,9649.0,3547.0,1129614.0,164273.0
00-6-2016,31544605,1839810,2834533,244820,5862695.0,1339223.0,3601112.0,339636.0,1266738.0,533356.0,718777.0,302701.0,7181.0,4024.0,1688260.0,246369.0
00-10-2011,19300682,1773876,2842044,281590,6147815.0,1343169.0,3102059.0,313886.0,668817.0,331723.0,569443.0,237789.0,9405.0,3942.0,1485507.0,215460.0
00-9-2014,24076365,1857312,3097048,265448,5675752.0,1319146.0,3539931.0,339375.0,1018879.0,454447.0,634268.0,269211.0,7060.0,3510.0,1760589.0,250985.0
00-12-2011,20021437,1767727,2673071,298610,6177398.0,1350236.0,2927133.0,300112.0,606679.0,304910.0,597114.0,251027.0,9562.0,4016.0,1438058.0,200659.0
00-12-2016,21538417,1684739,2132282,155453,5490546.0,1291299.0,2318299.0,246931.0,789178.0,377898.0,466258.0,211534.0,2424.0,1528.0,475208.0,110814.0
00-4-2015,32108012,1837591,2810333,266756,5852018.0,1321529.0,3509914.0,333849.0,1177532.0,509278.0,689027.0,286655.0,7461.0,3764.0,1845312.0,254730.0
00-6-2008,13402903,1370519,2328830,191876,4472987.0,1020446.0,1729265.0,236560.0,483690.0,202379.0,320251.0,139648.0,24.0,7.0,997323.0,159492.0
00-10-2015,31803492,1895970,2884274,252388,6237795.0,1383800.0,3674504.0,347416.0,1229199.0,523439.0,710312.0,297365.0,7343.0,3829.0,1803300.0,262151.0
00-6-2014,24329497,1778284,2796016,265776,5636288.0,1290086.0,3330825.0,324540.0,843518.0,392501.0,633379.0,267855.0,6606.0,3278.0,1738557.0,243129.0
00-3-2016,34782472,1899508,3053218,284987,6427356.0,1426200.0,3762945.0,351666.0,1271993.0,532711.0,739362.0,307976.0,7769.0,4123.0,1743313.0,241292.0
00-7-2015,29702129,1766601,2504623,242238,5689092.0,1275574.0,3124457.0,300277.0,1062963.0,459728.0,697368.0,280363.0,7047.0,3505.0,1694028.0,235394.0
00-12-2008,15225576,1530936,2450736,260484,5414998.0,1154369.0,1757683.0,238863.0,497602.0,197292.0,357282.0,156102.0,417.0,194.0,1006522.0,154476.0
00-3-2014,26446277,1805287,2907623,287899,5912891.0,1332180.0,3557931.0,341298.0,775241.0,365814.0,662216.0,277695.0,6453.0,3212.0,1826418.0,243941.0
00-3-2010,19218340,1683002,2989324,305415,6119512.0,1289708.0,3024948.0,324524.0,723883.0,312987.0,510024.0,215440.0,9582.0,3622.0,1389683.0,195907.0
00-11-2011,19307973,1766510,2825624,288723,6023121.0,1325465.0,3063375.0,311042.0,670791.0,331387.0,542168.0,233728.0,9524.0,4040.0,1495007.0,214799.0
00-4-2012,20161635,1743451,2668854,291499,5718242.0,1296874.0,3104521.0,309887.0,675100.0,321644.0,561658.0,240272.0,9191.0,3838.0,1553149.0,213900.0
00-5-2010,16872194,1611594,2528116,258159,5421320.0,1214040.0,2589640.0,284153.0,608833.0,269898.0,454918.0,197153.0,8936.0,3540.0,1253232.0,178729.0
00-5-2014,24269795,1748301,2592764,257307,5561391.0,1274793.0,3297596.0,319228.0,701806.0,334773.0,645602.0,266840.0,6475.0,3155.0,1669648.0,228790.0
00-10-2012,23150405,1879066,3200285,309753,6593902.0,1419379.0,3533367.0,345177.0,806595.0,378037.0,632966.0,266172.0,10426.0,4101.0,1747887.0,246598.0
00-1-2013,27874527,1860840,3197501,361088,6595025.0,1424138.0,3424198.0,331573.0,768237.0,358184.0,623299.0,261199.0,10563.0,4251.0,1766900.0,234654.0
00-9-2010,17586760,1718199,2914675,265979,5836772.0,1284728.0,2891268.0,300780.0,723137.0,313506.0,504646.0,214574.0,9299.0,3769.0,1312151.0,193122.0
00-8-2015,24908541,1567324,1969534,206572,4755821.0,1138118.0,2819805.0,273164.0,715447.0,329811.0,565743.0,237552.0,6240.0,3279.0,1392884.0,188783.0
00-2-2010,16883037,1603516,2543714,275701,5440423.0,1212190.0,2552071.0,281766.0,601898.0,265474.0,443789.0,194446.0,9117.0,3570.0,1161591.0,171350.0
00-1-2012,23105041,1820028,3146876,355598,6366177.0,1382448.0,3350423.0,329802.0,754125.0,355891.0,588545.0,250740.0,9837.0,4166.0,1665920.0,226818.0
00-10-2009,17869520,1704524,2932679,265487,6227671.0,1320827.0,2750924.0,304400.0,738093.0,275050.0,449916.0,191202.0,9109.0,3390.0,1282735.0,190467.0
00-3-2009,17705881,1615808,2809914,265397,5657193.0,1237042.0,2707635.0,300669.0,682956.0,256818.0,403653.0,174019.0,5938.0,2460.0,1329879.0,183973.0
00-3-2011,20274179,1736626,2998642,312098,6126428.0,1318282.0,3236052.0,326602.0,710857.0,346641.0,586303.0,243367.0,9437.0,3823.0,1519500.0,213335.0
00-7-2009,15259162,1522208,2317662,225968,5346953.0,1163524.0,2260422.0,255772.0,577021.0,220622.0,420138.0,175496.0,8944.0,3121.0,1114305.0,161386.0
00-1-2010,18189809,1623570,2705997,302700,5775693.0,1252651.0,2549054.0,280004.0,702453.0,263804.0,445847.0,192336.0,9283.0,3555.0,1231508.0,173979.0
00-1-2016,33942378,1854090,2850365,274968,6004128.0,1360290.0,3487675.0,330192.0,1167667.0,492665.0,679318.0,286687.0,7422.0,3959.0,1587755.0,218613.0
00-3-2012,22343708,1812707,3037601,330956,6264561.0,1370423.0,3532158.0,346745.0,765439.0,359561.0,629351.0,263751.0,9691.0,4033.0,1702030.0,231680.0
00-9-2012,20068679,1800555,2848506,261519,5578871.0,1304876.0,3238743.0,325146.0,684640.0,328988.0,572744.0,242859.0,9202.0,3747.0,1535759.0,217285.0
00-11-2012,21586421,1797606,2789222,283461,5913031.0,1333363.0,3243683.0,323068.0,716471.0,343136.0,586840.0,249741.0,9476.0,3977.0,1591065.0,224951.0
00-12-2014,25567299,1831576,2793840,273572,6345983.0,1392019.0,3227997.0,312612.0,1075862.0,472266.0,713039.0,292878.0,7830.0,3965.0,1739160.0,239951.0
00-9-2009,17016530,1697730,2949045,254528,5872224.0,1285579.0,2662858.0,297564.0,708130.0,265210.0,422423.0,180854.0,8802.0,3231.0,1233742.0,181966.0
00-5-2009,15619821,1547169,2397004,224561,5162157.0,1167293.0,2370837.0,269645.0,590701.0,227720.0,375049.0,162933.0,7838.0,2883.0,1159834.0,169543.0
00-10-2010,17880862,1703511,2763713,271944,6018399.0,1300417.0,2857828.0,297219.0,712854.0,310691.0,519806.0,221042.0,9382.0,3874.0,1324485.0,193393.0
00-9-2013,23100064,1823164,2953380,265937,5608404.0,1304392.0,3359683.0,329220.0,730668.0,349192.0,596630.0,254973.0,9175.0,3884.0,1640244.0,229778.0
00-11-2009,16550940,1667160,2704508,264144,5763265.0,1279468.0,2514326.0,281485.0,700775.0,264320.0,414826.0,180086.0,9069.0,3419.0,1197525.0,176651.0
00-4-2013,25186769,1797808,2904990,294588,5887200.0,1322472.0,3364329.0,327325.0,761785.0,358456.0,620386.0,262747.0,9888.0,4003.0,1732106.0,239681.0
00-8-2010,13911900,1435145,1955321,224286,4749409.0,1086944.0,2210234.0,235347.0,471892.0,211672.0,409755.0,174503.0,8692.0,3479.0,997897.0,141435.0
00-7-2013,23731972,1779278,2674657,273635,5779658.0,1289522.0,3059311.0,300329.0,683292.0,324546.0,642344.0,263629.0,10262.0,4006.0,1654167.0,224134.0
00-10-2008,14570502,1458008,2525752,216280,5150660.0,1099989.0,1941381.0,257548.0,555067.0,217805.0,346870.0,150250.0,229.0,108.0,1070448.0,168044.0
00-6-2009,16495670,1599147,2672770,241153,5424001.0,1203349.0,2546446.0,287345.0,667348.0,254481.0,410636.0,175850.0,8292.0,3026.0,1248974.0,184914.0
