year,Nb_medUCD,count
2014,11,212
2015,87,1
2016,6,668
2011,38,13
2018,64,2
2012,20,5
2016,1,2201
2010,24,198
2017,33,6
2013,48,41
2017,44,1
2015,93,1
2011,33,75
2014,10,240
2013,56,9
2016,13,248
2017,21,50
2016,54,2
2009,87,2
2009,112,2
2011,165,1
2009,19,93
2011,52,11
2010,31,51
2013,98,1
2013,57,7
2015,79,1
2013,21,65
2010,73,2
2012,14,14
2014,60,3
2014,17,68
2011,14,139
2014,77,1
2013,76,2
2011,77,1
2018,47,2
2015,78,1
2010,136,4
2016,27,38
2012,11,11
2013,69,3
2010,118,1
2011,12,309
2011,99,2
2009,16,176
2016,21,58
2015,46,7
2018,72,3
2013,34,43
2011,85,1
2018,26,112
2009,85,1
2008,12,4
2017,28,16
2016,53,3
2014,43,6
2017,10,200
2013,39,53
2017,35,2
2012,22,6
2018,32,27
2016,46,5
2018,61,3
2013,97,1
2015,48,22
2014,113,1
2010,228,1
2010,25,80
2015,34,23
2009,45,16
2013,135,2
2013,78,1
2016,8,392
2015,67,2
2013,7,229
2013,87,3
2016,61,1
2011,137,1
2011,50,18
2013,103,1
2018,52,5
2011,148,1
2017,16,100
2013,28,59
2013,10,255
2014,70,1
2010,74,4
2013,91,3
2013,112,1
2013,18,127
2018,25,60
2014,41,5
2008,1,89
2011,132,1
2016,16,107
2018,42,8
2016,24,170
2013,47,17
2010,57,12
2011,61,7
2016,40,10
2009,41,34
2009,84,2
2015,18,122
2015,15,118
2014,27,44
2011,35,27
2017,8,428
2018,40,7
2011,44,33
2009,61,6
2010,125,1
2012,43,1
2017,46,1
2011,118,1
2009,80,5
2009,102,1
2008,18,4
2012,23,2
2017,15,69
2009,57,5
2013,151,1
2010,150,1
2010,23,80
2013,62,2
2009,69,4
2008,9,5
2014,38,10
2009,47,10
2009,93,1
2009,34,50
2012,17,3
2014,44,13
2013,36,116
2018,39,24
2010,33,40
2018,16,116
2011,81,4
2011,46,19
2014,35,18
2014,16,120
2012,18,14
2009,38,39
2010,38,33
2010,75,2
2009,12,278
2016,23,44
2014,47,4
2008,26,1
2013,52,43
2013,5,264
2014,29,22
2015,21,67
2012,16,12
2016,62,1
2008,4,37
2014,24,195
2009,128,1
2011,21,85
2017,9,216
2016,84,1
2018,53,3
2013,126,1
2012,4,382
2013,53,24
2014,6,587
2016,35,17
2015,41,6
2013,162,1
2011,82,3
2010,49,23
2014,51,4
2016,47,6
2012,48,1
2018,56,1
2009,86,1
2009,83,1
2013,90,2
2018,11,532
2011,19,74
2010,87,5
2010,39,34
2017,25,8
2011,150,2
2017,48,3
2013,117,1
2018,45,13
2009,59,7
2010,154,2
2010,17,82
2009,49,6
2009,25,52
2010,120,1
2013,41,18
2010,72,1
2013,86,2
2017,6,859
2010,5,388
2016,19,63
2018,17,86
2010,384,1
2016,2,1289
2011,278,1
2016,39,17
2010,3,699
2009,96,2
2018,10,702
2017,20,47
2017,34,2
2017,65,1
2009,10,317
2014,36,111
2009,97,3
2015,5,368
2011,25,65
2014,66,2
2017,30,13
2018,50,7
2010,248,1
2013,143,1
2010,153,1
2011,271,1
2009,28,68
2010,41,20
2011,74,5
2011,11,264
2013,29,41
2015,185,1
2013,19,78
2012,33,1
2014,7,278
2013,74,2
2008,20,1
2017,3,1078
2013,136,1
2009,64,1
2015,220,1
2008,15,1
2015,60,2
2013,164,1
2013,157,1
2011,62,2
2011,31,50
2016,25,32
2018,46,6
2010,4,660
2012,13,15
2018,41,8
2010,83,1
2011,90,2
2010,101,2
2018,13,296
2013,92,1
2012,41,1
2014,32,29
2009,238,1
2010,98,1
2009,70,1
2018,27,48
2013,66,3
2009,98,1
2010,28,76
2010,133,2
2016,31,21
2013,1,1896
2013,59,6
2013,284,1
2009,5,313
2011,5,309
2009,54,16
2016,43,4
2009,109,2
2014,34,27
2011,79,2
2010,13,190
2009,42,32
2010,8,348
2013,65,4
2018,73,1
2014,59,3
2018,34,18
2016,56,3
2014,58,1
2010,56,15
2017,19,27
2010,68,5
2014,12,378
2011,101,1
2013,13,218
2015,51,1
2016,4,721
2009,39,40
2012,34,1
2009,2,1021
2015,20,84
2015,55,1
2013,8,268
2009,44,22
2010,175,1
2011,64,3
2017,11,105
2013,80,2
2011,6,446
2009,133,2
2014,21,73
2018,21,67
2015,40,18
2018,55,5
2009,107,1
2010,86,2
2016,91,2
2012,24,10
2018,6,584
2012,32,1
2017,14,149
2010,139,1
2016,48,19
2013,15,127
2011,4,581
2018,5,468
2009,40,39
2014,15,109
2011,1,1711
2016,30,45
2010,124,1
2008,21,1
2018,70,1
2011,169,1
2009,24,172
2014,28,49
2011,229,1
2018,18,118
2015,3,1016
2015,19,51
2013,79,4
2009,55,8
2013,77,1
2015,54,1
2015,27,40
2014,37,18
2010,55,12
2010,69,3
2009,100,1
2013,99,1
2009,17,113
2010,40,33
2013,46,19
2014,49,4
2009,75,4
2009,89,2
2010,107,1
2010,19,71
2018,48,18
2009,11,202
2009,67,8
2010,168,1
2018,35,8
2013,54,8
2013,63,3
2011,138,1
2015,56,1
2013,24,206
2010,20,112
2017,12,251
2011,17,77
2011,75,1
2018,9,472
2010,10,277
2012,6,201
2014,107,1
2013,154,1
2013,23,78
2011,20,136
2013,49,19
2010,143,1
2009,73,2
2010,61,11
2010,97,3
2017,43,2
2014,81,1
2014,3,801
2011,24,130
2009,74,8
2013,22,105
2010,93,3
2010,114,1
2018,8,512
2011,71,2
2014,54,3
2011,7,270
2014,30,60
2014,39,34
2009,118,2
2010,116,2
2012,40,1
2011,69,1
2016,73,2
2010,59,4
2011,110,2
2013,9,232
2018,20,107
2009,27,63
2011,26,55
2010,7,251
2013,165,1
2008,2,83
2010,63,9
2008,5,10
2012,60,1
2013,37,32
2010,1,2182
2013,43,23
2018,44,10
2009,82,1
2014,18,120
2016,37,12
2009,116,3
2011,73,2
2017,7,580
2008,8,12
2011,32,45
2012,35,2
2009,115,2
2013,31,33
2016,228,1
2013,40,27
2013,67,1
2011,39,17
2018,76,1
2010,144,1
2009,9,221
2011,15,112
2013,44,24
2009,6,409
2013,142,2
2010,211,1
2016,166,1
2018,30,41
2009,103,1
2014,40,11
2010,81,2
2009,8,322
2011,55,9
2010,91,1
2017,22,16
2012,28,3
2017,37,3
2015,6,677
2015,62,4
2010,14,171
2009,186,1
2014,52,9
2016,17,74
2014,9,344
2017,4,845
2018,66,2
2010,64,6
2015,22,118
2013,42,23
2015,32,24
2009,56,12
2011,29,45
2011,16,138
2013,111,1
2010,135,1
2018,4,735
2014,55,6
2011,84,1
2012,39,1
2011,147,1
2009,29,56
2011,8,305
2014,57,2
2009,32,34
2009,105,3
2009,37,44
2015,7,299
2010,32,54
2018,49,4
2018,3,1034
2014,23,48
2010,94,3
2015,1,1978
2013,2,1135
2013,14,137
2015,30,42
2010,50,26
2013,60,10
2016,68,1
2013,121,1
2013,153,1
2012,19,2
2017,39,1
2010,123,1
2012,21,7
2011,104,2
2009,78,3
2013,33,81
2017,24,40
2013,55,5
2010,22,149
2009,111,2
2008,22,1
2009,99,1
2018,23,66
2018,7,459
2016,34,23
2010,78,3
2009,66,2
2014,8,492
2013,16,157
2012,25,3
2017,36,4
2013,75,1
2015,89,1
2014,33,65
2010,96,2
2015,13,208
2010,45,16
2009,88,2
2011,111,1
2010,16,142
2015,77,1
2014,62,2
2014,1,1849
2011,3,584
2008,17,1
2017,23,14
2013,25,54
2011,43,31
2011,57,8
2015,58,2
2011,18,143
2011,66,2
2010,110,2
2011,68,3
2010,70,1
2009,4,554
2011,36,58
2018,14,200
2009,53,15
2011,48,34
2016,14,157
2018,24,161
2012,9,70
2010,170,1
2010,223,1
2010,156,3
2016,33,53
2009,7,225
2012,12,34
2013,191,1
2016,9,303
2010,36,53
2011,114,1
2013,3,682
2016,67,1
2010,137,2
2015,26,81
2013,11,198
2013,20,88
2009,79,3
2016,3,1071
2011,65,1
2009,13,149
2009,68,5
2015,61,2
2011,88,4
2013,122,1
2011,95,1
2010,34,39
2010,76,3
2013,64,1
2010,82,2
2013,152,1
2013,94,1
2013,12,384
2010,62,8
2015,8,303
2010,102,3
2015,57,1
2009,108,1
2016,26,81
2011,30,94
2013,32,43
2011,10,282
2011,59,2
2014,31,22
2015,44,15
2014,20,110
2011,105,4
2009,20,175
2009,110,1
2009,1,1612
2018,15,115
2012,1,1339
2009,33,63
2011,67,3
2017,1,3171
2011,51,11
2016,44,16
2012,7,40
2011,23,61
2016,57,3
2010,103,3
2015,121,1
2016,116,1
2016,12,476
2015,50,4
2014,45,6
2014,19,43
2010,90,3
2016,52,3
2011,143,5
2011,63,3
2018,63,1
2010,29,56
2011,56,8
2011,135,1
2010,117,1
2009,36,46
2010,46,30
2011,53,9
2013,17,91
2013,88,2
2016,50,1
2014,14,130
2010,35,31
2015,72,1
2009,76,3
2009,15,144
2008,13,5
2009,22,138
2010,12,343
2015,11,253
2013,105,1
2015,10,305
2010,54,15
2016,29,26
2010,43,30
2008,16,3
2011,27,93
2017,41,1
2016,49,5
2016,60,3
2010,37,37
2017,66,1
2009,65,4
2016,66,1
2009,94,1
2018,84,1
2012,3,536
2014,22,98
2016,45,7
2010,60,7
2013,83,2
2009,62,5
2009,14,169
2013,51,29
2010,79,4
2016,42,8
2015,84,1
2011,2,1021
2015,9,233
2009,30,81
2014,2,1364
2010,53,21
2018,120,1
2018,36,55
2017,27,11
2010,27,83
2018,83,1
2015,28,48
2008,10,7
2015,42,15
2015,17,75
2016,5,373
2018,29,18
2014,100,1
2018,62,2
2010,180,1
2016,20,81
2018,1,3135
2009,227,1
2010,190,1
2018,43,7
2015,45,5
2012,10,36
2009,52,13
2018,2,1519
2015,31,20
2009,51,11
2018,71,1
2011,47,23
2018,33,30
2017,18,89
2009,71,2
2009,26,91
2009,23,77
2017,29,2
2014,46,4
2012,15,12
2015,38,7
2013,137,1
2010,95,1
2014,13,215
2013,72,1
2012,137,1
2015,35,17
2017,32,4
2013,73,4
2010,58,10
2010,15,124
2009,91,1
2015,91,1
2011,42,19
2009,63,7
2013,45,15
2010,47,23
2011,60,4
2016,83,1
2015,4,611
2009,58,8
2012,5,137
2016,36,70
2011,28,41
2010,42,26
2014,42,9
2018,51,4
2010,52,22
2015,53,3
2015,2,1107
2013,58,6
2009,60,11
2015,47,11
2017,2,1621
2015,37,21
2016,18,114
2016,32,19
2013,146,1
2018,89,1
2014,68,1
2010,2,1266
2009,35,35
2011,13,117
2010,26,124
2010,18,125
2011,94,2
2011,92,3
2016,7,325
2013,61,3
2011,22,139
2013,156,2
2013,6,444
2015,33,52
2009,117,2
2011,106,2
2011,83,1
2013,50,22
2009,48,11
2009,119,2
2011,40,22
2013,89,1
2011,37,30
2017,49,2
2015,16,121
2017,26,7
2016,28,43
2015,59,2
2013,118,1
2010,122,1
2008,3,37
2018,78,1
2018,95,1
2011,9,254
2010,48,33
2017,40,2
2018,31,18
2018,12,636
2017,50,1
2013,27,74
2011,49,20
2012,27,2
2015,39,28
2015,14,154
2016,70,2
2011,45,26
2010,189,1
2015,49,4
2010,44,25
2010,121,1
2009,3,543
2015,65,1
2015,43,9
2013,71,3
2009,81,4
2010,67,1
2010,6,500
2016,38,10
2009,50,12
2009,101,2
2008,14,1
2010,51,25
2011,41,17
2011,34,35
2010,71,3
2010,88,1
2016,11,309
2011,54,12
2009,21,115
2011,70,1
2015,36,95
2013,30,63
2013,26,103
2013,96,2
2009,77,6
2018,57,1
2013,84,3
2018,60,4
2014,98,1
2018,19,69
2016,22,104
2017,5,664
2010,21,72
2008,6,21
2013,68,2
2009,31,38
2016,51,4
2013,196,1
2015,23,63
2018,54,5
2015,29,20
2014,50,3
2011,78,1
2009,18,152
2014,26,85
2018,22,75
2015,25,48
2017,13,62
2013,35,39
2016,15,116
2014,48,28
2014,61,2
2015,69,1
2014,5,403
2014,4,706
2010,105,1
2010,127,2
2016,10,339
2017,31,5
2010,65,4
2017,54,1
2010,30,74
2018,28,41
2010,11,219
2011,80,3
2013,4,533
2013,38,19
2012,2,1027
2010,9,254
2011,72,2
2011,86,1
2009,43,19
2011,58,2
2009,46,17
2010,134,1
2011,102,1
2010,181,1
2017,17,38
2011,93,1
2018,67,1
2015,52,3
2012,36,1
2018,38,22
2018,37,11
2010,80,4
2012,29,1
2015,12,368
2015,24,182
2013,130,1
2014,25,58
2013,93,1
2009,72,5
2013,70,1
2012,8,74
2010,89,1
2016,41,7
2009,185,1
2008,7,12
2016,55,2
