year,Nb_visites,count
2014,11,2442
2014,72,316
2015,87,125
2008,176,20
2018,289,8
2015,456,4
2015,318,8
2010,289,6
2016,218,10
2011,222,6
2013,541,1
2013,463,1
2010,431,2
2015,412,1
2017,484,1
2014,691,1
2013,829,1
2016,6,20074
2011,38,864
2016,93,93
2010,345,3
2016,489,3
2015,726,1
2017,338,1
2018,64,271
2018,101,68
2018,485,3
2012,20,152
2012,67,3
2011,215,12
2016,656,2
2008,591,1
2018,317,1
2018,1143,1
2018,290,3
2018,355,1
2016,845,1
2016,1,12128
2010,24,4807
2017,33,1003
2016,78,223
2008,107,35
2009,153,36
2018,336,9
2014,192,19
2011,187,15
2013,791,1
2013,325,4
2017,176,12
2008,239,5
2016,265,4
2010,277,6
2018,458,2
2017,278,1
2017,418,1
2011,576,1
2013,48,1215
2008,52,397
2017,44,374
2018,126,87
2013,1116,1
2014,232,11
2018,457,1
2014,117,70
2008,97,58
2015,75,232
2009,192,12
2015,777,1
2010,550,2
2010,229,11
2009,357,1
2008,343,3
2010,265,9
2009,429,2
2009,274,6
2011,1075,1
2016,501,1
2015,1015,1
2015,93,105
2008,214,8
2018,379,3
2009,279,10
2014,287,5
2015,431,3
2015,477,1
2017,53,132
2016,165,42
2013,485,4
2015,167,22
2009,361,3
2011,314,4
2016,272,16
2017,224,5
2017,527,2
2009,422,1
2014,841,1
2016,413,2
2017,227,1
2018,134,48
2008,121,47
2012,66,14
2016,273,8
2011,480,2
2008,384,1
2011,257,5
2010,628,1
2016,417,1
2014,10,4305
2013,56,373
2011,33,2928
2016,222,14
2013,183,17
2009,180,15
2015,552,1
2017,318,2
2014,504,1
2015,544,1
2011,213,13
2010,130,41
2015,187,11
2016,300,4
2008,299,7
2013,1092,1
2010,479,1
2015,472,1
2015,459,2
2009,725,1
2017,21,3555
2016,54,714
2016,13,2017
2014,110,72
2009,87,130
2017,58,136
2011,165,30
2017,239,5
2009,112,48
2009,549,1
2011,454,2
2014,573,1
2016,512,2
2009,594,1
2015,326,1
2009,19,1273
2011,52,344
2015,70,213
2008,181,16
2015,307,2
2013,239,8
2011,171,19
2018,600,1
2009,563,1
2011,853,1
2010,356,4
2014,775,1
2009,496,1
2010,31,680
2013,102,104
2013,145,31
2013,98,88
2017,182,13
2016,188,23
2010,166,13
2017,457,3
2011,201,7
2017,663,1
2014,567,1
2018,203,16
2014,179,20
2013,57,560
2009,142,29
2015,79,94
2018,69,237
2010,216,10
2015,125,41
2008,116,30
2013,405,1
2013,448,2
2015,1095,1
2011,468,2
2016,470,3
2008,305,1
2018,586,1
2014,265,10
2008,80,139
2010,149,22
2018,329,3
2009,533,2
2016,1679,1
2009,650,2
2017,588,1
2011,564,1
2013,21,4588
2010,73,146
2014,198,24
2010,321,2
2008,260,2
2013,200,20
2013,334,3
2018,235,7
2013,291,4
2015,347,6
2017,363,3
2010,585,1
2018,373,1
2014,635,1
2008,766,1
2015,491,2
2012,14,290
2015,119,65
2008,209,13
2008,325,5
2015,344,2
2015,433,3
2015,1026,1
2014,60,520
2011,194,12
2009,324,2
2011,310,1
2016,418,2
2016,388,2
2017,296,2
2014,17,2695
2011,14,3473
2014,77,155
2016,107,61
2009,163,15
2018,516,4
2013,819,1
2009,498,2
2008,643,2
2015,492,1
2014,470,1
2012,-23,1
2013,76,177
2014,125,43
2016,171,30
2011,0,37
2011,77,129
2008,100,67
2014,342,7
2011,351,3
2018,174,21
2008,126,43
2008,192,12
2008,187,14
2017,505,1
2014,320,6
2010,920,1
2018,47,348
2015,78,233
2009,177,18
2016,161,43
2017,138,41
2009,253,10
2015,534,1
2013,322,5
2010,615,1
2015,442,3
2018,265,4
2011,410,2
2008,496,2
2011,414,2
2010,1136,1
2011,182,25
2009,301,5
2017,94,47
2016,65,224
2011,158,18
2010,136,40
2018,332,2
2016,167,25
2015,217,21
2016,284,5
2018,240,18
2018,642,1
2011,252,8
2009,464,1
2013,733,2
2018,405,1
2011,664,1
2016,27,2672
2012,11,444
2013,69,313
2010,118,36
2008,180,16
2016,285,8
2015,435,5
2008,704,1
2015,249,14
2016,450,1
2018,326,7
2012,122,3
2011,-3,2
2016,241,5
2018,399,2
2012,-4,11
2014,620,1
2013,796,1
2016,807,1
2011,12,11058
2017,101,36
2011,234,16
2011,99,79
2018,117,74
2018,159,41
2015,162,25
2013,280,6
2013,273,13
2009,156,34
2013,451,3
2016,699,1
2009,16,3127
2009,113,33
2011,185,17
2010,460,2
2008,406,2
2013,585,1
2011,1607,1
2016,21,3948
2014,278,3
2016,231,19
2013,148,44
2018,292,9
2011,663,1
2014,343,4
2008,275,4
2015,486,2
2016,427,2
2015,46,575
2008,41,760
2018,72,278
2013,170,23
2009,193,12
2018,109,50
2010,212,5
2013,281,5
2010,498,2
2014,1655,1
2016,371,4
2009,451,1
2008,594,1
2013,34,1100
2014,178,16
2011,85,87
2011,457,1
2018,424,2
2014,196,14
2016,259,7
2010,163,18
2010,782,1
2012,102,4
2018,707,1
2010,571,1
2013,1347,1
2014,570,2
2008,89,79
2014,64,229
2010,1064,1
2009,560,1
2015,733,1
2014,405,3
2008,285,10
2011,392,3
2014,358,3
2015,451,3
2017,375,1
2018,435,1
2010,409,1
2015,788,1
2018,26,1984
2008,12,9333
2009,122,40
2009,85,122
2013,108,94
2014,306,6
2009,106,45
2014,331,3
2014,851,1
2008,377,1
2014,1816,1
2017,28,724
2016,53,336
2014,43,461
2016,160,35
2011,368,3
2008,147,26
2011,322,6
2018,273,14
2018,1096,1
2010,812,1
2009,512,2
2017,10,3260
2013,39,2474
2012,22,185
2017,35,406
2016,95,96
2011,221,17
2017,59,115
2012,52,28
2012,110,1
2013,240,12
2015,141,34
2015,269,6
2011,1525,1
2009,259,5
2017,196,4
2013,1044,1
2015,1312,1
2009,576,2
2011,604,1
2014,69,306
2018,229,15
2015,219,13
2008,79,94
2014,455,3
2011,223,10
2010,262,5
2016,456,1
2014,1249,1
2008,578,1
2013,436,2
2016,626,1
2015,1435,1
2010,411,1
2018,32,1384
2014,231,21
2016,46,519
2017,211,5
2009,187,19
2013,166,20
2017,-2,16
2013,250,16
2013,278,7
2010,239,10
2017,446,1
2016,385,2
2008,765,1
2016,680,2
2018,61,173
2013,97,73
2010,741,1
2017,392,1
2008,171,20
2010,517,1
2015,298,5
2018,487,1
2018,2231,1
2011,460,1
2015,48,1133
2014,113,51
2018,75,198
2015,234,16
2014,402,6
2010,228,16
2013,490,1
2015,4517,1
2017,331,2
2014,274,4
2011,524,1
2008,783,1
2015,34,1112
2009,45,1675
2010,25,875
2014,557,4
2013,78,250
2013,135,70
2017,226,2
2017,2988,1
2014,1080,1
2016,8,6704
2015,67,157
2014,75,253
2018,90,144
2017,151,14
2009,378,4
2009,331,4
2018,316,4
2016,576,1
2011,290,2
2008,321,4
2015,1311,1
2012,300,1
2013,7,2387
2008,24,3593
2008,189,15
2013,201,19
2011,153,32
2010,339,4
2015,332,3
2009,1045,1
2010,218,10
2013,287,7
2015,578,1
2008,499,1
2018,528,1
2009,830,1
2016,61,197
2013,87,141
2011,144,38
2017,80,72
2011,137,27
2015,221,19
2014,692,1
2014,433,1
2010,1470,1
2008,323,2
2015,375,3
2014,458,2
2014,594,2
2011,2031,1
2008,149,23
2011,172,12
2013,922,1
2018,128,67
2013,413,1
2018,194,18
2015,203,16
2013,187,19
2009,167,15
2015,279,7
2016,302,7
2011,253,10
2018,416,2
2009,292,3
2008,315,2
2010,452,2
2015,310,2
2016,426,2
2012,51,29
2011,50,398
2009,161,25
2014,208,25
2014,302,3
2018,283,5
2010,278,3
2008,460,1
2015,835,1
2008,312,8
2015,655,2
2010,297,5
2010,388,2
2013,1432,1
2011,891,1
2015,519,2
2012,133,1
2016,483,1
2018,52,487
2015,128,59
2013,103,57
2009,266,9
2017,432,2
2011,148,16
2014,363,5
2012,189,2
2008,595,2
2017,16,1946
2016,113,62
2008,62,236
2018,395,3
2014,209,21
2008,273,5
2011,432,2
2016,301,9
2009,176,16
2018,736,2
2010,522,3
2014,229,13
2017,478,1
2017,142,15
2009,628,1
2010,1101,1
2013,539,3
2014,535,1
2016,1849,1
2015,1106,1
2014,70,193
2013,28,1596
2013,10,4539
2018,259,9
2015,254,7
2011,116,52
2009,90,141
2010,162,21
2014,388,5
2014,149,29
2016,141,38
2017,1087,1
2012,77,8
2008,495,1
2013,1198,1
2014,872,2
2014,980,1
2018,248,15
2018,242,9
2010,74,178
2013,336,4
2013,365,1
2011,163,8
2016,219,11
2016,390,6
2013,303,6
2009,226,8
2017,225,5
2014,384,2
2015,782,1
2018,541,1
2018,335,1
2014,615,2
2011,506,1
2015,1053,1
2013,91,112
2017,87,79
2016,152,37
2013,112,67
2010,200,17
2015,195,27
2014,266,11
2015,124,58
2009,372,3
2011,303,3
2010,221,13
2016,249,9
2010,451,1
2014,414,4
2016,714,2
2014,375,2
2013,963,1
2013,574,1
2015,1183,1
2018,25,810
2013,18,7100
2014,82,105
2016,256,14
2013,304,12
2018,155,24
2010,219,9
2011,265,6
2010,203,9
2015,902,1
2016,757,1
2017,212,4
2018,387,2
2013,724,1
2014,41,635
2018,180,53
2014,197,14
2009,711,1
2014,239,5
2010,254,6
2018,390,1
2016,558,2
2008,38,943
2014,295,6
2013,549,2
2013,-3,1
2015,193,17
2014,571,2
2010,342,2
2015,539,1
2009,1563,2
2011,376,2
2017,308,1
2011,508,1
2008,1,18845
2018,131,43
2018,129,46
2015,107,61
2011,188,11
2008,198,10
2009,132,54
2015,205,14
2011,132,54
2018,431,1
2016,326,2
2016,625,2
2013,510,1
2015,405,4
2016,379,1
2010,866,2
2009,625,1
2016,16,2884
2013,417,3
2011,218,5
2018,93,92
2008,873,1
2016,429,2
2008,217,7
2009,341,5
2017,168,22
2013,536,1
2014,835,1
2008,987,1
2018,42,1626
2016,139,33
2015,294,7
2008,262,5
2017,171,19
2015,244,10
2011,227,9
2018,427,2
2014,742,1
2016,354,2
2011,880,1
2012,432,1
2014,658,1
2015,576,1
2016,24,4186
2013,47,475
2008,68,227
2008,316,3
2013,221,19
2016,351,3
2013,362,5
2015,482,2
2014,609,3
2015,277,5
2016,834,1
2018,469,3
2010,523,1
2014,168,38
2014,191,25
2011,208,16
2016,101,84
2016,195,30
2008,186,23
2008,320,2
2017,118,25
2010,57,621
2015,399,4
2014,280,7
2018,636,3
2018,357,2
2010,213,6
2016,730,1
2009,339,4
2018,1075,1
2015,365,1
2014,479,2
2010,357,1
2018,1010,1
2016,40,676
2011,61,182
2017,133,25
2016,556,1
2018,543,2
2010,468,2
2009,216,12
2017,373,1
2016,460,1
2015,409,1
2009,41,668
2013,95,80
2018,307,5
2016,150,64
2009,404,1
2009,298,3
2018,494,2
2017,351,2
2013,433,2
2018,277,8
2016,628,2
2011,294,10
2009,293,7
2016,444,1
2016,667,2
2008,281,1
2008,412,1
2018,356,2
2011,151,18
2016,110,75
2009,84,161
2010,236,7
2018,312,3
2010,249,6
2008,300,3
2018,825,1
2011,1716,1
2014,273,11
2009,386,2
2016,1178,1
2010,415,1
2015,18,6798
2013,127,44
2009,159,23
2009,152,25
2008,131,29
2010,242,11
2008,163,11
2015,1285,1
2008,637,2
2013,557,1
2015,15,6316
2014,27,3070
2008,104,67
2009,169,29
2014,160,31
2009,391,3
2008,372,2
2015,901,1
2014,487,1
2016,410,1
2011,367,3
2016,445,2
2011,35,812
2015,461,3
2014,120,69
2015,161,33
2013,324,7
2008,393,2
2014,371,3
2015,3266,1
2018,40,642
2017,8,5049
2011,44,622
2014,79,105
2016,178,14
2015,340,7
2008,135,40
2011,293,6
2018,254,8
2008,226,4
2016,363,4
2015,366,2
2009,61,189
2017,210,15
2015,81,171
2014,180,45
2013,675,2
2010,505,1
2017,149,20
2016,411,5
2009,124,22
2017,301,3
2012,95,5
2013,434,2
2015,389,5
2017,-9,1
2015,517,1
2018,576,2
2011,357,2
2015,744,1
2013,449,1
2018,869,1
2017,46,319
2017,72,154
2010,125,54
2016,138,65
2010,359,5
2011,1161,2
2012,43,21
2008,651,1
2018,382,1
2013,404,5
2014,312,7
2016,515,1
2013,380,3
2013,242,9
2014,135,71
2008,160,12
2018,967,1
2011,154,31
2009,356,3
2011,118,36
2016,754,1
2014,643,1
2013,241,3
2017,246,3
2010,481,2
2016,291,2
2009,524,1
2013,1299,1
2018,92,151
2013,224,16
2018,322,10
2017,119,48
2010,240,10
2017,409,1
2011,894,1
2015,512,1
2018,1023,1
2016,105,112
2014,94,103
2008,96,90
2009,80,146
2009,102,87
2010,207,9
2018,888,1
2015,1225,1
2013,218,12
2015,418,1
2009,194,12
2015,1326,1
2016,244,7
2011,233,9
2010,303,7
2017,398,1
2009,334,5
2009,528,1
2016,561,2
2017,326,4
2011,734,1
2018,1944,1
2016,299,17
2008,18,5668
2012,23,247
2018,216,16
2015,180,45
2013,207,18
2018,481,1
2017,356,1
2014,359,4
2015,353,1
2011,662,1
2017,248,3
2011,263,1
2017,698,1
2013,522,1
2012,116,1
2017,15,4956
2009,57,592
2013,151,29
2010,84,196
2015,255,10
2017,70,113
2009,544,1
2015,650,2
2013,171,30
2012,-2,41
2018,169,36
2009,178,12
2014,432,1
2009,313,4
2015,316,5
2014,563,1
2015,926,1
2013,607,1
2013,332,3
2008,-3,4
2018,380,1
2018,105,95
2008,33,2420
2015,105,84
2010,150,27
2014,93,114
2008,454,3
2016,122,61
2010,23,1352
2013,62,296
2008,58,232
2017,91,79
2015,390,4
2009,346,3
2016,481,2
2015,498,1
2015,560,1
2010,306,1
2008,9,11054
2014,111,81
2009,69,292
2016,132,91
2016,471,3
2013,504,2
2014,472,1
2012,100,6
2015,495,3
2016,327,4
2013,394,3
2013,0,41
2011,270,4
2010,182,20
2017,-22,1
2014,298,8
2016,584,1
2011,306,4
2015,1304,1
2017,273,4
2014,826,1
2014,38,1003
2008,49,387
2010,496,1
2016,378,3
2017,108,45
2015,230,12
2016,305,7
2010,234,8
2010,285,7
2013,544,1
2015,475,2
2010,1238,1
2014,700,1
2010,100,55
2009,93,92
2009,47,476
2018,342,6
2018,385,4
2016,261,9
2009,416,2
2011,421,1
2013,363,2
2011,415,1
2013,614,2
2016,664,1
2014,704,1
2012,318,1
2014,44,736
2012,17,395
2009,34,1074
2015,174,30
2018,172,20
2015,127,41
2014,440,2
2011,430,2
2016,211,14
2011,384,1
2014,350,6
2014,214,11
2013,521,3
2015,580,1
2008,246,3
2014,449,1
2011,571,1
2018,39,1682
2013,36,2953
2013,114,82
2008,508,1
2015,100,97
2018,122,57
2018,86,116
2009,375,5
2015,225,21
2016,201,13
2016,197,18
2017,272,3
2015,488,1
2013,553,1
2010,389,5
2010,1138,1
2013,612,2
2016,790,2
2018,16,2714
2010,33,2816
2011,81,157
2015,64,255
2010,176,19
2015,250,8
2015,211,12
2014,357,6
2010,530,2
2015,432,4
2018,486,3
2013,297,9
2013,662,1
2010,363,3
2011,335,2
2017,305,2
2012,150,1
2016,866,2
2008,658,1
2017,1491,1
2016,86,124
2014,35,892
2011,46,465
2008,94,80
2016,233,7
2011,304,6
2009,240,8
2014,1099,1
2008,359,2
2009,179,8
2014,2141,1
2008,243,5
2011,327,1
2015,1432,1
2014,435,3
2016,74,162
2014,16,2924
2018,205,6
2012,18,547
2018,99,71
2010,862,1
2013,245,13
2008,472,1
2013,248,9
2014,672,1
2011,496,2
2018,374,2
2018,496,3
2014,898,1
2018,408,6
2011,497,1
2015,554,1
2014,540,3
2008,926,1
2010,38,977
2009,38,981
2010,75,261
2008,249,6
2014,256,9
2010,435,2
2015,699,1
2018,445,1
2014,445,1
2018,488,1
2009,428,1
2018,127,43
2010,205,9
2018,228,19
2008,531,2
2011,970,1
2011,331,3
2014,1055,1
2010,280,4
2011,470,1
2012,128,1
2016,23,1525
2009,12,11450
2008,44,718
2014,47,483
2015,266,15
2018,214,10
2012,160,1
2018,404,2
2017,936,1
2014,602,3
2009,336,2
2010,282,3
2009,245,3
2008,26,1485
2014,95,83
2015,430,7
2015,268,7
2015,231,12
2014,1324,1
2016,701,2
2017,609,1
2014,601,2
2014,378,3
2016,1421,1
2008,368,2
2012,73,1
2014,29,916
2013,52,470
2013,5,5567
2008,34,802
2015,133,62
2016,119,48
2009,310,4
2012,46,36
2012,74,3
2014,590,1
2009,580,1
2013,741,1
2015,494,2
2013,620,1
2015,21,4382
2009,150,33
2016,133,52
2014,222,9
2011,389,3
2008,238,12
2008,808,1
2016,525,2
2016,348,3
2010,383,1
2010,552,1
2010,848,1
2012,16,250
2016,62,288
2016,419,2
2008,272,8
2017,-1,10
2013,403,2
2018,728,1
2018,1094,1
2017,426,2
2008,4,16314
2018,413,2
2014,90,162
2016,547,1
2017,573,1
2014,496,2
2018,433,2
2018,514,3
2010,535,1
2008,242,2
2008,522,2
2011,471,1
2014,24,4429
2011,204,15
2009,229,7
2009,128,42
2015,1308,1
2009,123,34
2018,224,14
2015,705,1
2014,260,9
2011,279,9
2014,488,2
2009,640,1
2010,641,1
2017,9,9184
2018,53,293
2011,21,4485
2016,84,226
2013,126,82
2018,193,18
2013,400,6
2015,593,2
2014,457,2
2012,79,3
2016,595,1
2013,212,7
2016,376,3
2018,889,1
2018,519,1
2018,138,72
2012,4,2714
2014,145,33
2013,53,382
2014,311,4
2018,98,89
2016,181,20
2010,433,1
2017,124,34
2011,574,3
2009,236,6
2017,174,6
2016,333,2
2018,614,1
2017,-43,1
2016,35,769
2015,41,636
2014,6,21560
2008,91,82
2018,140,51
2011,211,6
2009,383,3
2009,233,13
2013,162,28
2008,517,1
2015,281,8
2015,297,15
2018,366,8
2011,657,1
2009,433,1
2008,370,1
2013,392,1
2011,493,1
2015,-1,1
2011,82,94
2013,233,16
2014,204,19
2011,109,26
2008,201,5
2010,329,2
2012,72,9
2016,226,11
2016,384,5
2013,428,1
2013,721,1
2013,424,1
2010,49,403
2008,278,3
2013,326,6
2016,220,19
2015,335,4
2009,285,8
2011,516,1
2013,425,3
2009,273,5
2009,906,1
2018,56,398
2014,51,849
2016,47,422
2012,48,35
2011,155,25
2017,154,18
2017,191,5
2015,355,3
2015,333,3
2015,1148,1
2014,701,1
2013,473,2
2010,563,1
2013,270,11
2014,53,368
2009,86,92
2009,83,84
2014,140,44
2014,154,37
2016,527,1
2008,206,9
2015,468,2
2016,825,1
2014,782,1
2009,452,1
2008,112,47
2016,80,132
2014,276,13
2013,528,4
2011,140,24
2012,257,1
2008,352,5
2016,255,13
2014,598,1
2012,-12,1
2013,852,1
2013,195,33
2009,317,4
2013,457,3
2014,348,10
2014,412,4
2018,262,8
2013,357,3
2008,941,1
2013,293,5
2014,787,1
2008,1202,1
2010,942,1
2013,90,155
2017,147,14
2018,231,16
2016,81,156
2017,130,24
2018,512,1
2017,552,1
2016,581,2
2016,861,1
2010,497,1
2015,449,1
2013,483,3
2014,606,1
2008,229,3
2015,440,2
2018,11,2222
2011,19,1210
2010,87,139
2017,179,10
2010,255,9
2011,277,5
2015,209,17
2009,445,3
2009,459,2
2008,553,1
2010,247,12
2014,172,26
2008,129,33
2010,251,6
2014,181,12
2015,646,1
2017,485,1
2010,39,2799
2012,50,21
2015,138,70
2016,190,27
2017,188,5
2018,171,26
2008,115,64
2008,417,4
2013,269,6
2008,424,3
2016,698,2
2011,514,1
2018,104,99
2017,48,378
2017,25,546
2018,2142,1
2013,117,74
2018,324,8
2011,291,4
2017,339,1
2011,150,34
2013,261,8
2018,267,8
2014,764,1
2009,609,2
2012,207,1
2013,668,1
2016,1882,1
2008,692,1
2010,1703,1
2010,106,65
2018,239,8
2015,289,7
2017,277,1
2010,194,12
2017,914,1
2008,627,2
2013,397,3
2016,296,6
2014,418,3
2011,879,1
2018,734,1
2018,45,1036
2010,148,25
2018,253,15
2015,112,64
2009,59,293
2015,306,8
2014,338,5
2010,852,1
2009,136,39
2016,185,17
2014,285,5
2016,520,4
2013,339,1
2017,466,1
2017,249,3
2015,437,2
2018,1363,1
2010,154,30
2011,248,9
2014,314,4
2014,401,1
2008,650,1
2011,600,1
2010,142,38
2010,120,61
2010,17,2347
2009,25,879
2009,49,321
2018,116,71
2013,177,14
2018,206,15
2017,367,2
2010,645,1
2018,215,12
2008,570,1
2012,59,4
2016,482,3
2011,397,1
2012,98,4
2018,58,277
2013,41,673
2010,72,278
2013,86,111
2017,86,58
2008,106,56
2009,377,2
2011,653,1
2018,796,1
2017,6,18692
2010,5,5929
2014,366,4
2013,315,8
2009,189,15
2013,889,1
2008,479,1
2018,937,1
2009,457,2
2015,583,1
2015,483,1
2009,415,1
2014,345,5
2014,385,1
2017,335,1
2011,606,1
2014,116,60
2009,143,47
2008,444,1
2008,164,18
2016,454,3
2010,317,3
2011,267,7
2016,325,7
2012,81,5
2016,1544,1
2010,1292,1
2011,382,1
2008,399,2
2016,416,3
2018,569,1
2016,19,1265
2010,246,8
2013,286,10
2011,400,5
2015,647,1
2017,399,1
2010,448,1
2008,258,2
2018,648,1
2018,17,2231
2010,196,20
2009,170,15
2013,203,13
2015,582,1
2016,397,5
2015,168,38
2010,2429,1
2016,617,1
2016,2029,1
2015,1014,2
2011,815,1
2016,629,1
2015,738,1
2010,384,2
2016,2,56720
2010,0,42
2018,65,198
2017,93,53
2008,179,17
2015,213,15
2015,377,5
2018,321,4
2009,578,1
2016,250,15
2016,600,1
2009,278,2
2018,337,2
2011,712,1
2015,547,1
2008,621,2
2008,168,27
2017,128,29
2008,319,4
2014,545,2
2014,1041,1
2014,205,12
2014,725,1
2011,377,1
2011,278,5
2010,320,6
2009,328,4
2016,2279,1
2018,377,1
2013,698,2
2018,859,1
2016,39,1971
2008,156,30
2014,119,68
2018,472,2
2009,373,1
2015,356,3
2009,440,1
2010,3,68315
2009,96,81
2008,132,43
2010,178,20
2011,324,5
2015,368,5
2008,211,13
2008,267,2
2016,705,1
2014,824,1
2011,532,1
2016,463,1
2018,10,4262
2016,147,41
2013,189,25
2009,151,26
2016,383,5
2016,158,34
2018,346,2
2013,899,1
2017,216,11
2008,425,2
2012,112,1
2014,305,6
2017,263,2
2018,653,1
2011,380,2
2018,574,1
2018,612,1
2017,20,1454
2017,34,504
2015,99,84
2011,96,92
2017,65,132
2014,123,47
2016,279,9
2015,1048,1
2010,264,10
2011,309,2
2013,497,3
2010,386,1
2009,10,5004
2015,92,145
2008,56,322
2011,191,7
2013,345,5
2018,726,1
2016,364,3
2015,827,1
2018,502,1
2010,1602,1
2009,785,1
2014,36,2837
2015,66,372
2014,211,12
2017,88,75
2009,97,59
2015,206,7
2017,197,6
2014,212,15
2016,389,4
2013,323,7
2014,463,1
2018,439,2
2015,510,2
2018,325,2
2017,441,1
2013,978,1
2011,25,799
2015,5,5056
2014,66,397
2010,66,390
2017,242,3
2016,510,3
2013,333,8
2010,199,10
2018,304,8
2016,182,21
2010,364,2
2016,253,11
2008,501,1
2011,1224,1
2011,341,1
2015,525,1
2017,30,1559
2018,50,404
2015,110,63
2013,143,57
2008,155,17
2010,248,17
2013,526,6
2008,282,3
2015,682,1
2014,1022,1
2018,414,1
2010,153,31
2015,71,172
2018,444,2
2008,88,94
2018,270,6
2014,326,4
2017,429,2
2014,808,1
2012,-29,1
2015,401,2
2018,563,1
2009,28,1664
2016,85,138
2010,131,43
2016,99,92
2009,256,4
2014,216,14
2018,363,2
2013,534,2
2011,271,6
2009,181,14
2008,546,1
2013,533,2
2014,650,2
2010,509,3
2013,634,1
2010,41,643
2013,237,13
2016,118,70
2008,215,12
2011,74,132
2015,132,81
2018,68,247
2014,223,10
2008,218,14
2008,394,5
2018,523,2
2013,222,8
2018,857,1
2008,280,3
2009,291,4
2015,951,1
2018,818,1
2011,1028,1
2013,446,2
2010,588,1
2011,11,2501
2018,507,2
2013,350,4
2013,29,934
2015,218,11
2014,142,45
2008,292,5
2013,246,5
2015,185,13
2017,288,4
2010,263,6
2010,1277,1
2009,540,1
2010,472,1
2014,519,1
2017,938,1
2013,19,1282
2016,173,16
2012,33,109
2018,151,32
2011,176,20
2016,287,4
2008,457,1
2015,420,1
2011,686,1
2010,494,2
2017,333,1
2008,488,1
2014,7,2233
2017,207,20
2010,188,17
2015,272,9
2018,384,4
2008,404,4
2008,513,1
2011,697,1
2016,593,1
2015,457,1
2015,599,1
2014,676,1
2008,20,1835
2014,92,148
2016,151,28
2013,74,152
2008,145,22
2013,743,1
2013,236,14
2010,439,1
2015,596,1
2014,762,1
2016,619,1
2011,610,1
2013,453,1
2017,3,36105
2013,136,56
2014,138,72
2015,247,15
2014,309,8
2014,403,3
2018,1807,1
2015,441,2
2011,484,1
2009,64,211
2015,303,5
2013,492,2
2013,344,9
2012,170,1
2008,290,5
2016,536,1
2013,318,5
2013,499,2
2014,769,1
2009,776,1
2011,413,2
2014,1619,1
2018,1121,1
2008,15,6209
2015,220,13
2015,60,500
2012,-1,47
2014,144,56
2013,164,22
2017,205,4
2013,157,27
2017,376,2
2011,308,3
2014,146,38
2011,477,2
2015,382,4
2010,666,1
2015,644,2
2014,369,4
2010,315,4
2015,537,2
2017,42,629
2011,62,239
2014,114,86
2015,227,10
2013,319,5
2010,327,3
2017,243,5
2013,573,1
2016,567,3
2016,518,3
2009,463,2
2009,617,1
2009,751,1
2018,46,530
2011,31,633
2016,25,934
2015,88,133
2011,463,2
2015,163,14
2018,343,6
2018,689,1
2010,395,3
2010,436,1
2013,1443,1
2016,268,13
2018,306,11
2017,195,7
2010,495,2
2008,232,7
2008,268,5
2008,411,1
2009,270,2
2008,1395,1
2014,461,1
2018,834,1
2008,555,1
2010,4,16283
2008,174,16
2012,13,504
2018,1058,1
2010,273,9
2014,485,3
2011,242,7
2013,588,1
2017,266,4
2018,281,5
2016,896,2
2014,373,2
2008,392,2
2011,587,1
2014,593,1
2014,143,46
2018,218,14
2011,196,15
2009,396,3
2011,273,7
2014,579,1
2010,696,1
2017,299,2
2018,428,1
2018,759,2
2018,41,534
2011,90,120
2016,64,274
2010,83,104
2015,157,26
2011,131,35
2010,101,43
2011,286,5
2015,317,5
2009,258,8
2010,463,2
2008,609,1
2016,365,2
2011,450,1
2013,1045,1
2011,1704,1
2018,13,1814
2008,102,78
2010,192,14
2018,96,122
2018,163,22
2018,299,15
2011,1025,1
2015,346,2
2010,426,1
2013,766,1
2013,92,135
2014,139,32
2012,41,21
2012,76,12
2016,229,10
2016,533,3
2008,493,2
2011,804,1
2012,211,1
2014,552,1
2008,2474,1
2014,32,1489
2015,159,24
2009,104,71
2009,238,8
2011,255,9
2018,97,82
2015,118,67
2016,375,7
2016,315,10
2013,197,13
2014,599,2
2011,307,1
2016,837,1
2008,459,1
2014,578,1
2018,520,1
2017,387,1
2014,84,238
2013,85,137
2017,106,48
2013,150,46
2018,359,2
2013,385,4
2009,2584,1
2009,-1,6
2010,776,1
2010,360,4
2010,98,77
2009,507,1
2008,335,2
2014,267,9
2011,639,1
2013,652,1
2016,735,1
2009,70,184
2008,85,85
2010,184,26
2016,428,2
2014,351,7
2011,186,13
2016,769,2
2010,235,9
2014,234,18
2009,234,5
2014,1441,1
2016,936,2
2011,584,1
2011,251,3
2013,4776,1
2013,266,11
2009,370,1
2013,674,1
2018,27,2323
2010,158,23
2008,54,788
2013,66,414
2009,98,68
2008,-1,10
2013,298,7
2015,521,3
2017,280,3
2018,434,1
2011,422,2
2018,396,6
2018,448,1
2018,482,1
2011,426,1
2008,1044,1
2010,28,1534
2011,207,18
2008,388,3
2011,159,19
2008,194,14
2010,133,36
2008,405,1
2017,483,1
2009,474,1
2016,31,666
2013,210,28
2010,155,13
2008,498,1
2013,831,1
2009,303,2
2010,296,4
2018,411,3
2010,1153,1
2010,611,1
2013,59,264
2013,1,13336
2018,280,7
2009,224,7
2017,231,5
2013,284,3
2010,412,3
2014,1394,1
2009,405,4
2009,154,34
2016,208,24
2008,583,1
2009,5,7148
2011,5,5348
2013,-48,1
2017,192,16
2011,174,13
2012,-25,1
2016,1001,1
2017,357,4
2016,882,1
2017,765,1
2013,572,1
2018,758,1
2012,53,11
2016,578,1
2015,136,54
2017,186,12
2016,367,4
2008,322,6
2011,179,8
2010,376,4
2014,381,4
2008,1239,1
2014,733,1
2015,197,17
2017,68,122
2008,152,22
2013,175,13
2016,406,3
2013,342,9
2015,324,7
2008,422,1
2012,107,1
2018,3293,1
2016,702,1
2018,349,1
2016,639,1
2009,54,835
2016,43,507
2010,208,18
2009,109,46
2018,467,2
2016,608,1
2011,3190,1
2011,305,3
2016,548,1
2018,640,2
2014,34,1063
2011,79,90
2008,67,166
2015,305,6
2016,164,32
2016,124,60
2018,256,6
2012,118,2
2017,460,1
2011,750,2
2016,478,3
2017,364,1
2010,344,1
2008,311,1
2018,504,1
2010,13,1985
2009,42,2461
2017,56,216
2017,104,46
2013,193,11
2008,169,17
2011,330,2
2010,217,8
2015,987,1
2009,3917,1
2014,1560,1
2015,1173,1
2008,263,1
2009,809,1
2018,73,115
2010,8,7047
2013,65,250
2015,143,74
2012,47,15
2014,59,250
2010,300,15
2013,252,20
2010,112,45
2008,144,44
2009,208,14
2015,295,7
2009,196,10
2018,430,1
2016,678,1
2016,409,1
2010,421,1
2014,443,1
2015,1276,2
2015,490,1
2009,390,1
2009,350,3
2014,993,1
2013,141,33
2011,282,3
2016,213,12
2013,205,13
2017,89,27
2014,262,7
2014,603,2
2013,231,17
2015,654,2
2018,437,3
2008,355,3
2008,367,1
2013,818,1
2018,34,1075
2014,58,297
2018,130,47
2016,56,418
2011,134,34
2018,77,127
2009,420,2
2013,337,4
2015,338,7
2011,328,5
2013,292,5
2016,1058,1
2018,644,1
2014,349,2
2014,1062,1
2013,470,1
2010,104,74
2009,191,10
2018,268,11
2011,166,20
2014,459,2
2016,414,2
2015,395,3
2018,422,1
2011,920,1
2010,56,358
2017,19,919
2016,69,253
2010,68,220
2015,108,100
2017,120,43
2012,85,4
2013,531,1
2017,157,4
2014,460,3
2015,848,1
2014,765,1
2009,595,1
2010,444,1
2014,12,10861
2011,101,57
2018,183,14
2018,225,13
2011,115,57
2010,111,58
2015,410,2
2018,249,7
2018,137,30
2016,320,4
2008,178,10
2016,310,6
2018,714,1
2015,680,3
2009,649,1
2018,780,1
2016,499,1
2009,500,1
2016,679,1
2014,353,1
2018,639,1
2008,48,1215
2010,191,13
2014,105,104
2008,142,28
2017,144,24
2015,312,9
2008,489,2
2009,472,3
2013,331,2
2009,211,7
2018,986,1
2017,337,1
2015,51,802
2013,13,2202
2014,89,96
2010,939,1
2008,283,8
2015,252,8
2010,561,1
2014,421,3
2014,346,2
2009,919,1
2016,4,13849
2013,159,31
2016,59,240
2011,669,1
2018,167,13
2014,159,29
2008,231,6
2016,373,3
2015,345,5
2018,1050,1
2008,309,4
2012,115,3
2015,1079,1
2009,39,2799
2013,147,50
2012,34,67
2011,89,74
2018,257,8
2018,300,6
2010,459,3
2011,529,1
2013,647,1
2015,20,2419
2009,2,81184
2015,55,271
2011,246,9
2013,583,3
2016,311,4
2015,292,8
2014,555,1
2009,268,8
2016,962,1
2013,523,1
2014,1011,1
2018,6122,1
2013,8,7055
2009,44,736
2009,0,57
2017,184,22
2009,206,9
2008,138,45
2010,-1,8
2014,821,1
2010,527,2
2008,-19,1
2015,339,5
2013,123,44
2010,175,18
2013,435,3
2009,308,4
0,1,1
2011,216,8
2010,423,1
2014,697,1
2015,586,1
2018,1128,1
2015,135,49
2008,224,8
2018,165,32
2013,81,195
2014,88,149
2011,119,61
2018,121,46
2014,236,8
2018,309,7
2008,395,3
2016,319,6
2014,219,12
2018,371,4
2016,1697,1
2008,450,2
2018,658,1
2015,855,1
2011,64,199
2008,157,17
2014,529,4
2011,237,7
2017,370,1
2018,475,3
2013,1421,1
2014,299,13
2014,286,8
2009,213,5
2013,472,1
2009,344,2
2008,333,1
2009,359,2
2011,847,1
2011,704,1
2013,469,1
2017,11,1833
2011,107,66
2014,129,38
2011,323,5
2013,459,4
2016,402,2
2015,404,5
2010,340,6
2014,99,103
2013,80,148
2017,1069,1
2015,5117,1
2009,280,2
2016,455,4
2011,440,2
2009,713,1
2011,6,24622
2008,31,601
2009,133,39
2008,90,129
2008,55,300
2014,131,38
2015,291,8
2016,472,4
2018,629,1
2013,321,5
2017,270,4
2016,345,8
2013,560,1
2013,464,1
2013,830,1
2012,165,2
2018,21,3531
2015,40,729
2014,21,4455
2018,55,297
2010,86,112
2009,168,18
2018,558,2
2009,107,40
2018,123,43
2017,486,1
2013,100,73
2012,70,9
2009,184,16
2016,583,1
2013,202,12
2018,263,9
2018,378,1
2011,473,2
2010,592,1
2016,91,113
2014,515,2
2017,105,66
2018,161,26
2008,233,2
2018,252,19
2016,346,4
2015,216,15
2011,402,2
2012,24,201
2013,225,15
2008,235,4
2016,353,3
2014,383,2
2011,236,4
2009,448,1
2015,992,1
2009,602,1
2016,582,1
2017,462,2
2015,524,1
2018,6,17688
2014,133,46
2014,303,3
2014,448,1
2018,166,24
2017,349,2
2012,32,67
2012,119,2
2010,595,1
2013,294,5
2017,289,1
2013,393,2
2017,468,2
2018,313,1
2015,123,58
2008,84,172
2011,195,20
2011,212,11
2017,235,5
2008,340,4
2011,356,3
2010,393,1
2016,792,1
2010,471,1
2008,53,400
2017,14,2804
2017,189,17
2008,344,2
2008,148,31
2018,247,17
2018,417,4
2010,139,32
2015,352,2
2018,451,1
2015,413,3
2014,503,1
2009,599,1
2016,48,1049
2015,117,78
2013,15,6845
2015,160,36
2011,580,2
2015,152,27
2015,155,31
2008,139,26
2016,146,26
2009,531,1
2011,780,1
2011,274,1
2011,575,1
2013,542,1
2018,5,4262
2011,4,14958
2016,76,172
2009,40,643
2014,137,38
2008,294,7
2010,807,1
2008,297,7
2011,126,59
2013,226,19
2017,1173,1
2018,278,5
2011,239,7
2017,258,2
2008,754,1
2008,828,1
2018,750,1
2018,951,1
2014,15,6676
2015,104,99
2008,398,2
2018,338,5
2014,574,2
2009,382,2
2018,202,16
2012,208,1
2009,419,1
2015,604,1
2008,529,1
2008,458,1
2015,569,1
2016,1678,1
2008,738,1
2016,30,2828
2011,1,12386
2010,124,45
2014,954,1
2018,310,7
2016,264,20
2017,185,6
2016,601,2
2008,721,1
2011,557,2
2014,327,4
2015,480,1
2008,21,4157
2018,70,173
2013,174,20
2011,169,28
2012,55,11
2015,385,3
2010,338,5
2010,177,12
2009,302,4
2008,842,2
2010,335,4
2014,307,3
2015,422,2
2011,313,4
2017,414,2
2015,761,1
2013,488,2
2013,693,1
2014,28,1555
2009,24,4863
2009,231,16
2011,229,5
2009,671,1
2018,521,1
2012,94,3
2010,673,1
2015,1484,1
2008,1075,1
2014,476,2
2017,250,1
2015,511,2
2018,18,5819
2015,3,50645
2015,19,1349
2013,79,110
2010,195,12
2017,51,275
2008,166,11
2009,147,32
2013,353,5
2016,191,12
2018,250,13
2018,276,12
2010,291,3
2009,354,2
2017,391,1
2018,651,1
2018,1558,1
2009,55,297
2011,444,1
2012,88,6
2013,540,1
2013,879,1
2011,396,1
2018,495,3
2015,54,746
2013,77,167
2018,173,25
2008,161,26
2010,119,56
2015,920,1
2017,433,1
2009,748,1
2013,416,4
2018,827,1
2012,152,1
2016,848,1
2011,474,1
2014,56,423
2013,186,17
2009,135,52
2015,183,22
2009,257,5
2013,547,1
2016,266,12
2009,401,3
2018,360,3
2009,174,17
2009,358,2
2016,750,1
2013,340,1
2015,27,2895
2011,87,111
2011,418,2
2010,55,301
2008,75,208
2010,69,268
2011,231,7
2013,99,97
2014,37,559
2009,100,55
2013,1274,1
2008,98,90
2018,156,50
2014,188,15
2017,190,10
2018,5162,1
2018,537,1
2015,634,1
2009,17,2526
2010,836,2
2012,63,14
2015,343,4
2017,313,1
2016,298,5
2018,191,17
2014,367,3
2009,327,6
2016,422,5
2008,366,3
2015,439,1
2010,40,749
2008,110,54
2009,275,6
2018,311,5
2009,379,3
2015,358,4
2010,944,1
2009,171,26
2010,425,2
2017,347,1
2016,108,99
2011,112,56
2013,46,549
2015,175,21
2014,49,308
2010,171,19
2010,77,138
2009,367,2
2015,260,16
2011,342,4
2011,123,46
2015,264,16
2012,64,8
2018,542,1
2015,370,5
2015,795,1
2008,202,17
2018,344,4
2009,376,2
2014,104,115
2014,150,31
2015,176,37
2015,342,4
2017,539,1
2014,465,3
2016,609,1
2011,526,1
2010,109,45
2017,139,17
2013,480,1
2015,114,83
2010,129,42
2018,192,25
2010,324,6
2018,670,2
2015,330,4
2008,1327,1
2014,102,99
2009,75,246
2010,107,65
2013,107,75
2015,86,106
2009,89,79
2011,205,9
2008,434,2
2017,240,6
2015,337,4
2016,382,1
2008,526,2
2015,566,1
2016,589,1
2014,121,57
2015,363,10
2014,300,10
2017,587,1
2010,294,5
2008,523,1
2012,101,2
2010,299,7
2009,521,1
2011,127,26
2014,1410,1
2008,1013,1
2018,703,2
2018,498,1
2017,954,1
2010,19,1229
2014,136,53
2017,67,72
2016,155,28
2008,111,40
2015,359,3
2011,334,4
2010,172,10
2016,5229,1
2008,497,1
2009,627,1
2010,603,1
2018,1048,1
2009,371,1
2009,11,2968
2011,197,14
2018,48,954
2010,168,26
2009,67,133
2016,114,92
2012,132,2
2018,124,60
2011,214,10
2011,534,1
2010,244,7
2014,1121,1
2009,629,1
2017,45,388
2018,698,1
2008,401,2
2011,103,61
2008,234,10
2009,269,4
2017,569,1
2016,1273,1
2017,237,2
2011,391,3
2010,355,1
2011,517,1
2018,35,770
2013,54,772
2013,63,421
2015,56,378
2011,113,44
2008,63,405
2011,138,46
2017,319,2
2015,308,6
2009,505,1
2016,258,3
2010,476,4
2015,694,1
2016,736,1
2013,593,3
2013,437,4
2017,306,3
2013,1026,1
2017,715,1
2018,570,1
2017,12,8460
2013,24,4558
2011,17,2367
2010,20,2419
2014,134,44
2010,230,16
2014,158,33
2011,297,4
2017,300,1
2018,635,2
2016,338,7
2016,303,7
0,3,6
2013,420,2
2016,121,46
2016,103,60
2013,180,43
2008,341,4
2016,459,4
2010,214,8
2009,495,2
2009,1555,1
2018,529,1
2011,75,232
2018,297,14
2013,351,5
2009,263,3
2008,150,29
2016,5208,1
2011,1101,1
2016,992,1
2014,524,1
2018,959,1
2018,9,7973
2010,10,4571
2017,156,22
2017,69,163
2008,236,5
2014,283,4
2009,360,4
2014,132,71
2014,315,9
2010,288,3
2015,215,17
2008,483,1
2017,234,3
2012,178,1
2014,107,62
2012,6,7312
2017,63,192
2013,154,39
2017,81,107
2017,134,16
2008,326,3
2015,396,5
2018,221,16
2013,314,4
2011,317,6
2010,712,2
2013,386,3
2009,658,2
2016,689,1
2013,944,1
2012,237,1
2018,745,1
2014,409,1
2013,23,1607
2013,49,340
2011,20,2363
2010,143,61
2017,172,9
2009,322,10
2009,73,154
2010,381,3
2014,399,5
2018,269,5
2010,274,6
2011,200,13
2014,518,1
2011,1005,1
2011,776,1
2013,729,1
2012,30,129
2008,32,1051
2010,61,201
2010,97,78
2008,119,43
2017,102,43
2018,219,9
2010,310,6
2009,290,2
2015,196,14
2009,441,2
2016,675,2
2017,658,1
2010,475,1
2017,43,244
2014,81,173
2016,277,7
2011,-1,11
2015,300,7
2018,524,2
2017,287,2
2013,327,3
2017,152,25
2014,67,166
2008,143,45
2010,222,9
2015,287,2
2012,-11,1
2018,533,2
2011,962,1
2014,501,2
2010,702,2
2014,670,1
2014,3,52994
2013,158,22
2013,381,2
2013,443,2
2010,800,1
2011,24,4427
2009,74,127
2014,297,11
2010,147,39
2018,170,22
2016,336,5
2013,173,15
2013,551,2
2013,301,3
2015,530,1
2010,267,5
2011,637,2
2011,677,2
2010,711,1
2018,536,3
2010,430,5
2014,411,1
2018,553,1
2018,1345,1
2014,660,1
2013,22,2335
2015,228,13
2008,66,315
2008,61,197
2010,93,109
2010,114,70
2008,265,4
2016,144,55
2008,195,14
2011,419,1
2014,466,2
2013,5336,1
2018,8,6259
2014,227,13
2008,23,1507
2015,150,47
2014,54,716
2018,79,101
2011,71,150
2015,267,3
2009,201,8
2018,286,12
2016,135,55
2016,448,1
2011,287,10
2015,874,1
2014,30,3153
2014,39,2286
2011,7,2171
2009,297,5
2017,71,84
2009,118,37
2009,244,5
2016,494,3
2014,173,16
2018,266,8
2015,419,1
2010,658,1
2013,460,1
2011,299,5
2016,505,2
2013,282,6
2016,673,1
2013,753,1
2014,1356,1
2016,446,1
2014,416,1
2010,116,47
2017,198,16
2014,296,9
2012,40,44
2011,586,2
2015,514,1
2013,723,2
2014,649,1
2016,435,2
2016,519,1
0,11,1
2013,501,1
2011,69,277
2013,124,57
2016,73,122
2015,257,6
2015,415,1
2013,216,15
2017,522,2
2009,880,1
2011,365,1
2010,173,19
2009,114,66
2011,110,64
2008,172,8
2010,59,250
2011,220,9
2011,226,14
2015,242,11
2011,375,2
2017,350,1
2010,245,8
2016,1180,1
2017,255,2
2016,462,2
2018,1309,1
2013,9,10832
2011,160,18
2017,109,25
2016,307,5
2012,61,7
2015,188,22
2012,154,1
2017,111,25
2015,322,6
2015,357,6
2008,678,1
2017,611,1
2011,26,1864
2009,27,3031
2018,20,2268
2014,258,17
2018,162,22
2016,199,16
2009,246,8
2013,296,4
2014,221,21
2008,191,7
2011,219,5
2018,351,3
2013,1135,1
2010,7,2440
2018,271,4
2013,165,38
2015,186,20
2010,659,2
2017,4849,1
2010,764,1
2010,397,2
2011,489,1
2013,466,1
2018,682,1
2014,809,1
2010,63,434
2008,2,73006
2008,45,1527
2008,5,7082
2012,60,22
2014,341,3
2011,157,17
2016,396,4
2018,291,7
2014,294,9
2016,627,1
2013,367,3
2018,442,3
2010,575,2
2013,37,490
2014,249,10
2014,201,11
2009,247,9
2017,330,4
2015,232,13
2008,289,3
2018,676,1
2017,1124,1
2010,316,4
2009,381,1
2012,166,1
2014,619,1
0,2,1
2015,684,1
2013,445,1
2013,1201,1
2010,1,13184
2018,44,704
2013,43,552
2017,82,58
2009,82,96
2015,321,3
2011,569,1
2013,235,8
2013,736,2
2010,729,1
2014,789,1
2008,51,849
2015,792,1
2015,172,34
2013,579,1
2016,322,9
2011,700,1
2010,507,1
2014,339,2
2014,452,4
2016,703,1
2016,564,1
2015,779,1
2008,510,1
2015,886,1
2016,37,502
2014,18,6877
2011,73,113
2016,282,12
2010,99,96
2009,116,45
2016,270,12
2014,1582,1
2008,351,3
2014,206,15
2012,57,15
2014,559,2
2018,383,4
2011,390,2
2010,332,2
2018,598,2
2014,424,3
2013,1109,1
2013,671,1
2008,8,6153
2017,7,1653
2014,103,59
2018,319,4
2018,333,6
2015,362,4
2013,352,2
2011,217,13
2009,141,40
2010,295,5
2018,539,1
2008,441,1
2008,696,1
2008,1261,1
2013,1335,1
2011,333,2
2011,32,1274
2014,151,32
2011,417,1
2016,97,66
2011,247,12
2014,364,5
2016,269,8
2009,300,9
2010,945,1
2016,1460,1
2010,312,6
2012,35,38
2017,217,7
2010,161,26
2010,266,11
2009,318,3
2009,306,4
2011,311,2
2016,420,2
2013,681,1
2013,2278,1
2011,238,13
2018,213,13
2014,255,10
2009,115,44
2008,248,5
2014,282,4
2011,479,1
2012,129,2
2011,379,1
2013,496,2
2017,324,4
2009,613,1
2018,91,130
2017,100,62
2014,199,13
2012,42,60
2016,136,52
2008,535,1
2014,167,24
2009,343,2
2018,1930,1
2009,1071,2
2016,433,2
2015,2269,1
2013,31,732
2013,194,22
2016,502,2
2017,73,58
2015,516,3
2013,793,2
2016,360,5
2010,283,6
2018,418,2
2013,40,685
2011,393,1
2013,155,30
2016,228,13
2010,169,36
2014,109,49
2015,331,4
2016,504,1
2015,805,1
2013,447,2
2013,502,1
2013,1244,1
2015,76,174
2013,67,169
2009,137,27
2014,272,10
2016,328,5
2012,99,2
2009,430,2
2015,651,1
2017,402,1
2011,39,2400
2018,76,198
2015,276,14
2010,144,40
2016,123,46
2014,462,2
2017,574,1
2008,40,595
2015,594,2
2011,133,32
2016,71,135
2011,184,17
2010,354,4
2017,233,4
2013,983,1
2011,321,6
2018,436,4
2018,459,1
2013,601,1
2016,443,1
2011,416,2
2018,474,1
2011,408,1
2009,9,11673
2014,190,25
2009,207,16
2013,219,11
2014,147,44
2015,350,5
2013,258,10
2012,82,1
2018,197,8
2010,206,11
2008,683,1
2008,162,13
2008,642,1
2009,389,1
2017,490,1
2008,439,1
2014,439,1
2013,44,751
2011,15,6766
2013,272,11
2009,160,23
2017,440,2
2013,267,9
2010,346,3
2011,355,3
2015,730,2
2009,309,4
2016,405,2
2018,627,1
2010,292,4
2009,6,28367
2013,142,39
2014,157,31
2016,247,15
2012,-10,4
2011,1752,1
2018,535,1
2016,205,11
2014,108,104
2014,153,45
2014,186,27
2016,166,27
2014,175,27
2010,211,10
2015,639,3
2008,653,1
2017,583,2
2018,30,2529
2014,91,96
2014,40,689
2009,380,2
2014,246,9
2013,364,4
2016,400,4
2009,103,52
2014,225,17
2013,211,11
2012,-6,4
2010,368,5
2017,408,2
2017,1863,1
2009,588,1
2017,394,1
2010,958,1
2012,535,1
2010,81,188
2015,454,3
2009,262,4
2013,254,12
2011,289,5
2017,701,1
2010,333,1
2009,305,4
2018,330,8
2018,328,2
2015,504,1
2011,735,1
2016,368,7
2013,948,1
2014,189,28
2013,440,1
2018,298,9
2018,353,7
2015,236,11
2016,399,2
2008,467,1
2018,784,1
2017,303,1
2011,424,1
2008,328,1
2010,827,1
2010,390,1
2009,8,8081
2011,55,272
2010,91,108
2018,158,21
2015,200,20
2008,419,2
2016,207,17
2017,257,3
2010,446,1
2018,489,1
2009,406,2
2014,931,1
2017,145,19
2018,145,32
2014,194,17
2015,73,137
2011,710,1
2008,177,13
2014,1035,1
2011,332,4
2008,313,1
2008,776,1
2017,22,1435
2014,269,6
2018,111,54
2013,217,10
2014,871,1
2011,436,1
2011,685,1
2013,887,1
2014,332,1
2015,824,1
2017,37,255
2012,28,87
2014,141,36
2017,137,15
2013,220,11
2015,201,15
2014,263,9
2016,174,32
2017,389,1
2018,181,17
2009,267,5
2014,441,2
2015,380,1
2017,325,2
2013,926,1
2015,6,21199
2017,208,10
2008,78,197
2015,146,44
2010,132,57
2010,226,11
2015,529,2
2008,324,3
2014,398,1
2015,323,5
2016,224,14
2013,516,2
2011,465,2
2018,882,1
2018,368,4
2018,296,1
2013,621,1
2014,500,1
2015,762,1
2015,62,278
2008,109,31
2008,228,7
2016,335,2
2017,276,6
2017,475,1
2016,1594,1
2009,747,1
2010,14,3801
2018,87,112
2009,186,19
2018,461,2
2013,328,7
2008,222,9
2016,542,1
2014,52,515
2014,156,48
2018,236,13
2018,244,8
2014,243,11
2008,414,6
2009,878,1
2011,597,3
2014,423,5
2018,513,2
2011,399,2
2018,66,339
2016,17,2341
2014,9,10240
2012,113,2
2017,4,10420
2009,252,11
2009,131,29
2018,125,46
2018,429,3
2017,199,6
2016,254,6
2008,303,5
2008,386,3
2016,605,1
2010,428,2
2016,465,2
2016,111,63
2013,317,4
2008,629,1
2018,320,5
2018,401,3
2010,328,5
2008,442,1
2016,487,1
2018,768,1
2017,3128,1
2010,499,1
2010,64,209
2018,133,56
2017,256,3
2016,506,3
2009,-6,1
2011,522,2
2013,1011,1
2015,22,2451
2013,42,2294
2015,32,1479
2009,56,371
2015,299,8
2015,325,5
2014,467,3
2015,223,9
2011,360,4
2017,465,1
2009,407,2
2014,355,2
2012,80,3
2013,341,2
2013,384,3
2013,709,1
2011,16,2703
2011,29,931
2011,337,4
2018,80,167
2010,135,50
2011,167,21
2010,237,4
2013,111,65
2017,284,3
2013,505,1
2011,433,1
2016,366,3
2018,879,1
2013,455,1
2010,655,1
2018,4,12373
2014,55,307
2015,126,102
2010,160,18
2016,212,14
2017,334,1
2011,594,2
2013,256,7
2009,342,4
2016,516,1
2011,262,1
2014,741,2
2008,470,1
2016,246,14
2014,203,19
2008,136,37
2017,268,4
2018,-1,2
2008,329,2
2015,528,3
2011,84,163
2012,39,53
2008,71,157
2016,140,56
2012,93,6
2014,318,6
2012,71,5
2011,147,31
2011,146,22
2015,406,5
2014,184,29
2010,201,17
2014,162,26
2011,245,7
2011,499,2
2010,1021,1
2014,1236,1
2013,229,6
2009,688,1
2015,500,1
2008,551,1
2018,709,1
2015,286,12
2009,29,922
2011,130,55
2014,130,73
2008,183,16
2008,240,10
2009,212,7
2013,426,3
2009,304,6
2015,315,8
2009,286,2
2012,138,6
2011,446,1
2017,222,11
2016,425,3
2010,377,1
2009,446,3
2010,456,1
2009,1183,1
2011,8,6737
2014,57,545
2017,125,30
2014,73,144
2017,60,222
2009,182,25
2013,251,9
2015,140,40
2008,227,6
2008,99,72
2009,218,4
2010,369,5
2015,428,1
2008,657,1
2016,423,1
2009,352,1
2018,928,1
2009,32,1500
2009,105,73
2016,223,10
2013,450,2
2018,157,21
2008,301,4
2018,315,6
2015,302,7
2015,181,20
2011,906,1
2009,197,6
2013,279,6
2009,287,2
2014,680,1
2012,161,2
2013,1030,1
2014,641,1
2015,85,133
2008,184,13
2013,140,42
2015,320,6
2013,227,13
2011,387,2
2014,1175,1
2010,462,5
2010,432,2
2016,453,1
2015,429,3
2010,951,1
2018,226,9
2013,371,4
2016,758,2
2011,164,19
2016,473,2
2017,218,6
2011,771,1
2008,304,3
2017,232,3
2017,616,1
2013,370,5
2016,522,1
2017,846,1
2010,532,2
2009,37,596
2014,310,5
2013,401,3
2015,455,1
2009,271,2
2015,663,1
2016,543,1
2018,49,275
2010,32,1428
2015,7,2348
2014,247,11
2013,348,9
2010,888,1
2008,350,2
2013,260,10
2014,493,2
2017,317,1
2016,271,2
2008,70,157
2008,74,135
2016,189,27
2013,133,46
2017,114,51
2016,163,23
2011,315,4
2011,320,4
2008,612,1
2017,346,2
2014,475,2
2017,366,1
2013,653,1
2015,575,2
2014,392,1
2013,419,1
2013,1618,1
2008,800,1
2018,114,79
2016,94,80
2018,616,1
2018,107,56
2015,204,20
2016,491,1
2016,475,1
2015,447,2
2016,541,2
2018,3,39383
2014,23,1594
2010,140,45
2010,293,6
2008,141,30
2009,296,5
2014,1114,1
2016,297,7
2015,1715,1
2016,395,3
2009,311,3
2015,102,92
2018,112,79
2015,476,4
2013,192,31
2011,142,28
2013,1008,1
2008,270,9
2015,314,8
2008,27,2837
2010,94,63
2011,170,24
2018,275,10
2016,192,25
2014,235,5
2014,655,1
2011,509,1
2010,2350,1
2015,1,12108
2013,2,62465
2015,95,90
2018,88,117
2008,438,2
2013,307,3
2008,213,9
2011,210,11
2016,238,13
2009,307,4
2017,285,3
2010,518,1
2015,30,2982
2013,14,3859
2008,0,88
2017,173,7
2008,158,19
2009,173,10
2017,342,2
2008,317,2
2008,779,1
2018,571,1
2016,1107,1
2017,127,18
2016,68,255
2008,35,950
2010,115,59
2010,50,455
2013,60,551
2015,122,36
2014,85,105
2018,232,12
2013,467,2
2013,121,51
2016,331,7
2008,502,1
2010,1052,1
2017,853,1
2016,432,1
2014,304,4
2008,1062,1
2012,19,233
2013,153,43
2009,92,82
2011,100,70
2008,241,6
2014,450,2
2016,142,35
2016,286,5
2013,795,1
2018,227,7
2013,624,1
2017,435,1
2011,859,1
2013,703,1
2018,204,24
2017,39,579
2009,237,5
2010,123,39
2018,243,13
2014,377,4
2008,225,10
2012,87,5
2017,286,2
2012,21,365
2009,78,241
2011,104,62
2017,206,6
2015,224,18
2009,1010,1
2010,447,1
2009,509,1
2009,340,1
2016,347,2
2015,522,1
2008,841,1
2013,33,2552
2017,62,123
2010,567,1
2011,180,25
2010,261,12
2016,442,1
2017,264,5
2017,24,2871
2016,75,242
2013,55,304
2012,108,1
2013,160,30
2017,332,1
2015,1111,1
2016,355,3
2014,623,1
2014,482,2
2015,469,2
2014,370,3
2015,903,1
2010,22,2311
2008,22,1387
2014,127,40
2009,99,88
2017,295,3
2014,228,19
2009,111,49
2010,859,1
2013,482,3
2016,257,8
2014,690,1
2014,429,5
2009,282,2
2016,464,1
2009,487,1
2014,406,3
2015,873,1
2018,23,1431
2018,7,2051
2016,0,36
2018,144,51
2009,145,26
2018,135,68
2010,271,8
2016,751,1
2015,241,8
2014,630,2
2018,634,1
2018,672,2
2016,821,1
2009,522,1
2011,592,1
2016,34,1119
2010,78,247
2009,66,379
2017,92,78
2011,178,12
2008,387,2
2011,346,5
2010,257,8
2014,420,2
2016,545,1
2014,8,6720
2013,16,2895
2017,36,884
2015,89,91
2013,75,233
2013,179,11
2009,209,11
2012,25,92
2018,211,11
2013,168,34
2010,540,1
2017,329,1
2012,126,3
2014,995,1
2013,801,1
2009,410,2
2008,901,1
2014,33,2446
2010,96,98
2013,144,38
2013,134,46
2008,221,11
2011,1678,1
2017,281,1
2008,1222,1
2015,13,2152
2010,45,1681
2008,39,2503
2009,88,96
2014,592,1
2015,129,38
2011,111,58
2016,145,36
2013,-1,2
2013,402,1
2008,433,2
2014,281,3
2017,312,1
2018,284,4
2008,251,6
2017,891,1
2015,668,2
2010,16,2873
2015,77,130
2014,62,287
2016,130,60
2015,178,32
2009,330,3
2018,141,34
2013,271,10
2013,563,1
2008,378,2
2014,527,1
2014,1,12531
2011,3,61918
2008,17,2469
2008,19,1110
2018,110,77
2008,130,34
2008,197,16
2009,534,1
2009,516,1
2011,275,5
2015,1065,2
2016,944,1
2016,873,2
2011,354,3
2016,440,1
2013,25,891
2017,23,1037
2015,177,30
2010,351,5
2014,397,3
2013,300,5
2014,495,2
2010,232,8
2011,345,4
2011,372,1
2017,430,1
2016,180,32
2008,122,39
2018,220,17
2011,301,4
2014,744,1
2013,389,1
2009,539,1
2017,547,1
2011,57,478
2011,43,473
2018,362,5
2014,118,56
2015,194,20
2016,157,29
2018,582,1
2012,68,8
2009,321,3
2011,539,2
2013,589,1
2008,428,3
2012,106,1
2010,486,1
2017,-4,1
2015,58,304
2016,217,15
2013,109,57
2008,105,80
2015,238,10
2009,750,1
2009,742,1
2017,463,1
2013,760,1
2011,18,6809
2011,68,202
2011,66,361
2009,95,65
2012,62,6
2010,110,73
2010,70,173
2011,128,37
2015,226,10
2009,646,1
2014,372,3
2009,461,2
2017,360,1
2016,169,36
2017,143,23
2016,112,82
2012,96,6
2018,245,6
2017,275,2
2008,208,9
2017,617,1
2018,632,3
2010,405,2
2016,438,2
2009,596,2
2008,330,1
2017,-27,1
2018,339,3
2014,707,1
2016,523,1
2015,106,73
2011,36,3007
2009,4,19309
2015,274,6
2018,136,49
2015,98,90
2016,106,63
2013,712,1
2010,688,1
2017,252,7
2017,158,16
2016,323,6
2008,327,1
2009,387,1
2011,405,1
2008,371,2
2018,14,3657
2011,48,1138
2009,53,385
2008,82,99
2014,126,67
2013,125,68
2015,214,17
2008,389,3
2016,634,2
2016,361,1
2015,1599,1
2016,14,3797
2015,120,77
2016,221,23
2018,185,17
2018,609,1
2013,355,8
2008,484,2
2016,492,2
2013,354,2
2008,1058,1
2015,394,2
2016,749,1
2018,24,3684
2012,9,2646
2009,120,63
2013,264,12
2010,284,4
2014,284,3
2017,506,1
2013,738,1
2009,772,1
2014,696,1
2018,195,32
2011,254,7
2016,262,7
2017,117,46
2013,129,47
2010,170,18
2008,274,6
2008,188,15
2018,233,9
2014,413,2
2010,223,16
2018,318,3
2009,345,5
2015,386,4
2010,413,1
2009,-17,1
2010,156,45
2008,11,2957
2008,81,178
2013,295,3
2010,220,5
2013,190,22
2009,794,1
2016,304,7
2016,276,17
2017,219,6
2012,-7,1
2010,250,10
2013,361,3
2010,301,7
2013,-12,1
2014,580,1
2016,33,2088
2015,768,1
2016,172,26
2015,212,20
2013,277,8
2015,407,1
2010,269,4
2018,479,1
2018,863,1
2015,587,1
2016,902,1
2012,12,1377
2009,7,3022
2013,191,15
2013,101,76
2009,272,8
2016,530,2
2010,281,4
2008,244,6
2008,675,2
2010,640,1
2011,-2,2
2015,485,1
2017,-10,2
2008,550,1
2012,0,124
2018,327,4
2015,285,13
2013,263,7
2011,145,24
2008,154,28
2014,344,4
2017,283,2
2010,756,1
2017,194,3
2017,348,1
2011,76,146
2018,175,18
2017,473,1
2009,166,25
2015,546,3
2012,103,1
2014,407,1
2009,369,2
2013,1252,1
2014,784,1
2016,9,9047
2008,47,554
2014,469,2
2017,321,2
2009,485,2
2018,334,9
2015,148,34
2016,248,10
2011,1096,1
2012,65,8
2010,352,4
2014,224,15
2010,373,3
2008,293,4
2011,585,1
2011,579,1
2015,484,1
2018,560,2
2016,479,2
2010,36,3328
2010,396,4
2008,127,35
2013,188,18
2016,187,28
2009,242,6
2009,486,2
2015,763,1
2008,261,3
2010,528,1
2017,944,1
2010,1650,1
2018,294,5
2018,152,39
2011,114,51
2013,185,21
2014,177,18
2009,261,2
2014,313,3
2011,603,1
2011,401,2
2013,430,3
2011,784,1
2013,1063,1
2012,114,2
2013,3,59301
2016,67,154
2016,129,53
2015,149,26
2010,137,30
2015,142,37
2017,112,46
2016,232,10
2010,197,13
2010,334,6
2009,355,1
2009,-3,3
2008,923,1
2008,1003,1
2015,26,2121
2013,11,2715
2013,20,2376
2015,63,356
2009,146,35
2008,92,71
2009,79,115
2010,362,5
2015,164,22
2014,977,1
2009,223,8
2010,308,3
2018,230,20
2011,361,3
2013,725,1
2008,436,5
2013,489,1
2014,682,1
2015,1294,1
2014,651,1
2015,935,1
2016,587,1
2016,127,31
2015,74,158
2015,246,5
2015,283,7
2014,323,5
2015,426,1
2016,267,7
2012,220,1
2014,637,1
2016,847,1
2016,358,3
2013,408,1
2015,533,1
2014,688,2
2016,3,46646
2008,36,2607
2018,82,91
2011,65,236
2013,276,14
2011,141,25
2015,166,28
2010,314,7
2016,318,6
2013,359,3
2010,663,1
2017,443,1
2015,471,2
2010,399,2
2015,548,3
2013,396,2
2015,61,208
2009,13,2145
2009,68,212
2013,209,23
2015,184,42
2014,268,11
2018,178,21
2010,305,8
2011,198,14
2018,410,3
2016,941,1
2011,373,3
2008,456,2
2013,308,4
2016,620,1
2009,239,5
2013,648,1
2012,125,1
2011,95,82
2008,43,492
2012,31,46
2011,88,107
2013,122,46
2018,210,32
2009,199,10
2017,260,4
2010,331,2
2013,493,1
2010,34,1023
2013,64,281
2010,82,110
2013,152,42
2010,76,149
2018,397,5
2010,375,2
2010,539,2
2016,344,4
2018,282,5
2009,417,2
2016,1725,1
2018,4849,1
2015,1156,2
2013,94,74
2016,216,17
2018,139,30
2011,420,2
2013,238,10
2012,145,2
2011,495,3
2010,193,12
2011,296,4
2016,-1,1
2016,495,2
2013,498,1
2015,8,6597
2015,57,505
2013,12,11278
2010,62,259
2009,108,88
2010,102,97
2018,601,1
2016,225,14
2013,285,11
2011,129,34
2015,351,8
2018,552,4
2017,245,4
2015,436,2
2013,527,2
2016,362,3
2010,548,1
2016,26,2132
2008,87,97
2013,465,2
2008,284,3
2008,407,3
2010,252,9
2018,450,3
2016,1581,1
2013,599,1
2016,886,1
2014,879,1
2009,1226,1
2016,981,1
2013,32,1507
2011,30,3296
2016,380,5
2015,891,1
2008,-2,14
2015,670,1
2012,2420,1
2016,611,1
2012,163,1
2015,861,1
2014,1002,1
2016,651,1
2010,490,1
2010,562,2
2011,10,4263
2015,153,27
2018,179,13
2016,170,26
2011,59,211
2017,148,10
2010,258,9
2018,212,14
2010,183,14
2018,200,26
2018,288,8
2008,223,5
2014,336,6
2015,311,2
2014,76,160
2008,95,67
2009,214,12
2018,146,53
2010,138,40
2011,369,3
2017,162,16
2017,599,1
2014,215,11
2013,376,3
2016,685,1
2012,105,3
2015,371,2
2015,444,1
2011,766,1
2010,614,1
2015,44,758
2014,20,2339
2014,31,706
2016,234,22
2017,97,28
2018,142,31
2017,323,4
2008,346,3
2015,720,1
2016,349,3
2016,652,1
2011,409,1
2017,477,1
2009,20,2662
2016,117,88
2011,105,80
2013,167,29
2014,538,1
2017,320,1
2013,537,2
2015,243,12
2014,213,4
2014,288,9
2010,311,6
2009,581,1
2017,520,1
2018,721,1
2012,339,1
2016,341,1
2016,120,74
2015,0,41
2014,242,10
2016,292,4
2014,271,7
2014,4859,1
2017,1223,1
2015,210,30
2009,110,49
2018,113,65
2014,484,2
2011,292,6
2014,275,6
2011,281,4
2014,319,6
2011,538,2
2014,546,1
2011,1092,1
2016,202,13
2011,284,5
2018,258,14
2015,972,1
2011,288,4
2013,639,1
2009,1,20634
2008,59,259
2016,156,52
2015,309,4
2012,124,1
2018,370,4
2018,207,17
2015,336,7
2014,250,11
2008,373,3
2008,287,2
2018,15,5354
2016,82,122
2008,812,1
2017,150,20
2010,233,13
2013,1368,1
2009,183,8
2014,207,24
2008,1920,1
2014,544,3
2014,379,5
2016,314,4
2013,377,5
2011,339,3
2014,128,46
2011,91,77
2018,85,135
2011,344,4
2008,445,2
2014,708,1
2010,547,1
2010,829,1
2009,33,2720
2012,1,3794
2016,87,132
2010,243,7
2018,132,56
2010,238,7
2009,228,11
2016,176,30
2015,391,3
2014,618,1
2011,641,1
2010,443,2
2016,764,1
2012,-3,35
2008,114,65
2014,200,16
2015,202,17
2009,980,1
2018,633,1
2013,441,2
2011,67,164
2016,79,96
2010,174,11
2016,230,23
2013,243,10
2011,240,10
2011,318,3
2018,367,3
2012,264,1
2010,358,2
2008,332,1
2016,44,766
2011,23,1416
2011,51,789
2017,1,8608
2012,7,434
2016,98,83
2015,354,5
2018,255,15
2013,477,2
2011,285,9
2015,374,1
2015,549,1
2010,414,1
2008,314,2
2014,442,2
2013,550,2
2015,573,1
2014,679,1
2010,715,1
2016,214,13
2008,93,87
2014,163,22
2015,240,15
2009,385,2
2018,1554,1
2013,414,2
2016,476,1
2011,650,1
2009,775,1
2013,439,1
2016,57,462
2016,330,10
2010,103,48
2016,109,62
2014,171,24
2016,210,21
2015,348,5
2016,332,5
2014,585,1
2014,347,3
2009,363,1
2009,314,4
2015,509,2
2009,990,1
2014,389,2
2018,592,1
2015,121,55
2016,116,59
2014,781,1
2017,96,80
2013,116,51
2015,179,23
2008,185,10
2013,700,1
2009,198,21
2010,586,1
2015,50,476
2016,12,10448
2014,45,1366
2008,50,490
2014,155,44
2013,184,31
2010,225,10
2018,340,3
2014,404,3
2010,378,3
2011,566,1
2014,19,1221
2010,90,148
2018,189,21
2014,277,5
2015,496,1
2013,358,4
2016,391,5
2010,577,1
2015,526,1
2011,591,1
2008,25,787
2016,52,538
2018,209,17
2013,199,15
2008,390,2
2009,200,12
2014,374,5
2018,287,3
2011,374,2
2016,401,1
2014,558,1
2013,598,1
2014,612,1
2013,228,17
2018,63,333
2015,68,293
2011,143,44
2014,502,2
2013,214,20
2016,206,16
2011,63,381
2009,165,34
2015,113,47
2011,280,8
2018,668,1
2016,240,11
2016,263,8
2014,329,3
2016,725,2
2014,417,1
2013,329,3
2011,202,8
2018,975,1
2010,29,967
2013,369,7
2011,135,42
2011,56,310
2010,117,58
2014,86,126
2008,151,20
2013,375,3
2015,411,4
2009,746,1
2008,418,1
2009,319,5
2014,422,1
2015,520,1
2015,373,3
2008,2023,1
2009,36,3154
2014,74,161
2008,108,82
2017,302,3
2018,575,1
2013,476,1
2010,46,522
2011,53,323
2008,159,16
2016,293,5
2015,328,2
2015,239,7
2009,164,9
2013,181,15
2018,891,1
2015,222,11
2008,296,6
2011,528,1
2013,305,5
2015,866,2
2008,308,3
2017,794,1
2009,585,1
2011,435,2
2012,236,1
2014,550,1
2013,17,2601
2013,88,155
2016,50,492
2014,238,23
2018,164,19
2014,1049,1
2015,165,40
2010,268,4
2014,316,6
2009,217,12
2009,235,7
2018,608,1
2016,441,3
2009,478,1
2014,14,3761
2010,35,862
2015,72,303
2016,153,38
2009,76,115
2017,215,6
2015,288,8
2008,354,2
2008,254,5
2018,526,2
2009,15,6859
2008,13,2065
2017,47,169
2014,161,54
2017,352,2
2009,289,6
2011,647,2
2017,-7,1
2013,316,2
2014,512,1
2015,293,2
2010,12,11591
2009,22,2405
2015,101,75
2015,190,22
2016,168,49
2010,470,2
2011,364,2
2010,787,2
2017,400,1
2010,420,2
2013,720,1
2015,11,2552
2011,225,13
2013,105,118
2010,92,105
2009,434,2
2013,247,11
2016,372,6
2012,308,1
2017,591,3
2016,29,904
2015,10,4510
2010,54,924
2010,43,498
2017,77,87
2018,208,21
2014,245,20
2010,165,32
2018,187,28
2017,229,4
2016,183,19
2015,327,5
2014,1152,1
2016,889,1
2017,681,1
2011,27,3183
2008,16,2113
2018,100,75
2013,306,9
2017,175,13
2015,256,9
2014,642,1
2008,356,2
2011,425,1
2016,308,6
2010,372,2
2017,41,267
2014,80,148
2018,103,62
2014,174,35
2014,376,4
2015,360,8
2016,329,4
2011,302,5
2013,618,1
2015,424,3
2016,237,3
2016,60,461
2016,49,319
2008,65,235
2011,325,5
2012,104,5
2018,308,12
2008,374,4
2009,738,1
2009,337,2
2014,83,108
2017,66,190
2016,236,9
2010,37,578
2015,341,3
2010,762,1
2009,195,19
2014,356,4
2012,188,1
2009,149,22
2015,191,21
2018,394,2
2016,524,2
2008,761,1
2018,497,1
2018,84,209
2016,66,369
2013,128,60
2009,65,260
2009,94,61
2017,140,24
2013,313,7
2015,960,2
2014,328,1
2018,441,1
2013,595,1
2016,931,1
2014,22,2338
2012,3,24972
2013,-2,3
2016,96,119
2009,188,9
2015,145,29
2013,106,68
2008,205,9
2009,288,3
2008,468,1
2013,1514,1
2009,1060,1
2011,388,1
2008,413,1
2016,45,1192
2010,60,573
2013,83,126
2009,158,24
2010,365,3
2013,382,4
2013,299,7
2011,352,2
2017,415,1
2010,574,1
2015,900,1
2011,783,1
2008,30,2684
2009,62,240
2018,314,1
2013,244,3
2017,170,19
2017,160,10
2013,444,1
2016,474,1
2013,906,1
2010,558,1
2010,379,1
2016,42,1892
2009,14,4098
2013,51,899
2010,79,132
2016,154,46
2016,186,19
2008,117,40
2015,144,62
2015,84,221
2016,1312,1
2017,90,98
2009,332,4
2014,522,2
2017,253,7
2008,230,11
2011,316,5
2018,562,1
2016,175,29
2015,251,11
2014,166,21
2016,387,7
2008,336,4
2013,427,4
2014,722,1
2013,586,1
2011,347,2
2013,558,1
2018,449,1
2016,603,2
2018,837,1
2015,497,1
2015,501,1
2011,385,1
2017,76,126
2014,756,1
2016,624,1
2013,850,1
2008,520,1
2016,100,99
2015,9,9900
2011,2,63381
2009,30,3314
2016,467,1
2012,92,11
2010,215,9
2010,387,3
2018,769,1
2018,844,1
2011,404,2
2017,825,1
2018,120,86
2014,2,58069
2010,53,381
2010,108,76
2008,153,27
2010,152,29
2009,250,4
2018,400,2
2016,434,3
2017,403,2
2008,357,2
2009,-8,1
2010,286,5
2009,553,1
2018,590,1
2009,-2,1
2018,36,2120
2010,27,3252
2017,27,1840
2018,83,95
2011,264,5
2011,139,30
2016,392,4
2014,415,4
2014,352,4
2010,398,3
2014,586,2
2017,474,1
2014,1172,1
2015,28,1560
2015,90,180
2008,196,10
2017,107,26
2017,136,20
2017,121,19
2018,106,60
2008,207,11
2011,358,3
2015,237,11
2008,307,3
2016,1526,1
2010,323,1
2008,10,3363
2012,156,1
2009,140,35
2010,322,7
2016,209,14
2010,164,21
2010,318,6
2011,727,1
2009,481,3
2013,990,2
2014,365,4
2008,382,2
2011,452,1
2014,562,1
2008,64,199
2011,295,4
2014,165,40
2011,209,19
2016,381,5
2009,248,10
2016,370,1
2010,224,7
2018,358,2
2009,225,6
2009,249,4
2015,878,1
2011,898,1
2008,490,1
2014,494,1
2016,560,1
2016,77,149
2015,42,2017
2017,78,139
2012,56,11
2008,353,4
2016,356,2
2010,708,1
2009,934,1
2018,583,2
2013,432,3
2009,241,3
2009,645,1
2010,1128,1
2018,29,847
2016,5,4766
2015,17,2582
2013,104,102
2017,115,46
2016,115,68
2017,103,27
2015,304,6
2013,412,7
2014,605,1
2014,536,3
2017,244,4
2015,542,1
2018,899,1
2018,62,258
2011,192,14
2010,180,24
2018,115,71
2014,100,84
2008,113,33
2014,264,20
2017,141,18
2008,396,3
2018,544,3
2009,362,1
2018,874,1
2017,344,3
2011,269,2
2018,744,1
2016,20,2499
2014,210,30
2008,77,163
2013,816,2
2010,126,51
2017,267,1
2011,268,4
2010,519,2
2013,283,3
2017,85,68
2015,116,73
2018,456,8
2011,1774,1
2013,330,4
2013,366,3
2016,394,1
2011,515,1
2018,462,2
2014,669,1
2018,1,11286
2011,235,7
2008,133,27
2014,362,5
2009,442,3
2011,1064,1
2018,1087,1
2009,1065,1
2008,237,9
2015,278,10
2014,396,6
2018,1035,2
2015,450,1
2014,447,1
2016,437,6
2017,377,3
2008,705,1
2011,349,3
2010,190,13
2013,149,29
2009,227,8
2009,-4,1
2017,341,2
2009,295,7
2015,275,4
2018,1006,1
2009,1483,1
2018,43,480
2013,461,1
2009,222,4
2016,1407,1
2010,349,4
2018,826,1
2013,335,2
2013,802,1
2018,446,3
2018,765,1
2013,731,1
2018,473,1
2015,45,1315
2013,257,11
2017,84,122
2014,0,41
2018,201,12
2009,190,17
2015,416,2
2014,261,7
2018,285,12
2015,481,5
2015,718,1
2016,488,2
2009,220,11
2010,371,3
2013,630,2
2016,2329,1
2018,188,23
2016,92,129
2012,10,400
2014,510,4
2011,199,12
2010,1104,1
2012,143,1
2016,480,3
2011,690,1
2015,393,3
2009,614,1
2015,624,1
2018,217,11
2014,148,36
2017,122,19
2016,289,14
2015,258,9
2017,-17,2
2018,718,1
2016,412,1
2015,562,2
2018,531,2
2010,917,1
2009,251,7
2015,600,1
2015,1697,1
2010,128,51
2009,52,408
2012,91,4
2015,376,3
2014,317,5
2017,178,5
2011,695,2
2008,485,1
2016,708,1
2018,2,50405
2008,101,70
2016,102,124
2017,265,2
2009,264,10
2013,696,1
2010,302,3
2015,400,3
2011,350,3
2016,588,1
2015,31,754
2013,230,14
2017,200,15
2013,633,1
2017,407,3
2013,290,3
2010,298,5
2016,386,1
2009,125,47
2009,51,982
2014,490,5
2015,169,43
2018,71,150
2014,237,11
2013,176,26
2015,489,3
2016,306,6
2018,190,28
2016,1379,1
2008,576,1
2018,706,2
2010,382,1
2018,293,5
2010,1106,1
2018,33,1897
2011,47,413
2016,295,4
2017,57,214
2013,161,38
2016,559,1
2009,353,2
2015,466,1
2015,629,1
2018,81,157
2015,378,4
2008,120,38
2018,260,11
2017,221,3
2013,422,4
2014,252,10
2008,167,17
2011,243,5
2018,391,6
2008,349,3
2012,179,1
2015,1301,1
2015,591,2
2016,203,13
2017,18,4882
2009,71,164
2016,148,40
2017,123,23
2017,74,66
2018,223,13
2015,248,12
2011,230,14
2008,193,12
2018,251,6
2018,352,4
2014,425,2
2018,345,3
2009,425,4
2018,376,3
2008,72,249
2008,173,15
2009,219,9
2009,172,24
2008,247,8
2011,276,5
2018,350,3
2014,489,3
2016,377,4
2008,291,4
2018,348,2
2017,374,2
2016,552,1
2017,29,520
2009,26,2234
2009,23,1510
2013,204,28
2017,165,17
2017,209,5
2017,422,1
2011,627,1
2014,46,543
2018,361,5
2009,351,4
2014,333,4
2011,203,16
2014,434,2
2018,372,5
2016,280,4
2009,473,1
2017,297,2
2015,462,3
2013,406,1
2015,38,906
2012,15,844
2013,137,43
2014,71,165
2011,125,30
2010,95,79
2011,136,34
2009,157,16
2012,58,12
2008,369,1
2011,266,7
2016,811,1
2014,513,3
2016,537,1
2014,13,2072
2013,72,311
2018,74,175
2014,187,17
2016,283,6
2010,419,2
2014,301,3
2009,462,2
2013,475,3
2008,269,5
2015,541,1
2013,484,1
2015,577,1
2018,1305,1
2018,510,1
2012,313,1
2009,126,66
2017,32,732
2015,35,941
2013,73,117
2015,271,7
2016,529,3
2013,517,1
2015,666,2
2015,760,1
2010,580,1
2010,58,276
2008,134,28
2017,-16,2
2018,186,16
2015,397,4
2018,341,9
2018,460,4
2013,346,1
2018,3617,1
2018,677,1
2017,417,1
2018,1547,1
2010,15,7018
2015,91,101
2009,91,98
2012,49,12
2015,182,38
2014,87,117
2013,833,1
2017,-11,1
2015,372,8
2014,936,1
2017,311,2
2009,454,2
2013,817,1
2016,468,3
2018,1618,1
2011,42,1998
2009,63,423
2011,121,37
2008,140,28
2012,78,8
2009,477,1
2009,265,6
2014,241,3
2014,486,3
2011,494,1
2011,260,3
2009,414,1
2014,395,3
2018,147,36
2017,132,38
2017,261,3
2016,274,4
2016,245,9
2009,618,1
2008,567,1
2009,144,35
2012,54,26
2008,298,3
2017,381,1
2013,969,2
2015,367,3
2016,461,1
2013,1573,1
2008,1517,1
2013,407,2
2018,641,1
2010,418,1
2014,279,6
2014,218,14
2015,319,5
2017,161,18
2010,516,2
2008,402,1
2013,667,1
2010,341,1
2013,45,1443
2011,60,443
2014,101,73
2010,47,486
2016,83,98
2015,130,66
2008,118,43
2015,507,1
2014,193,20
2016,251,8
2011,362,3
2017,223,6
2018,661,1
2016,398,2
2016,682,1
2015,4,13781
2015,134,40
2014,746,2
2009,529,3
2013,255,13
2018,909,2
2011,431,1
2009,215,8
2015,434,1
2009,255,10
2018,515,1
2017,738,1
2015,632,2
2016,649,1
2018,483,1
2010,900,2
2010,683,1
2017,38,423
2009,58,276
2013,198,21
2018,237,7
2008,695,1
2016,557,1
2010,817,1
2008,420,2
2016,36,2552
2016,128,61
2009,232,10
2012,5,747
2018,182,38
2017,110,28
2018,160,32
2014,195,25
2015,229,7
2015,381,4
2016,623,1
2008,277,2
2017,495,1
2009,504,1
2011,28,1332
2010,42,2486
2017,396,3
2016,143,47
2008,361,2
2014,337,6
2013,302,10
2011,533,1
2011,620,1
2018,610,1
2015,728,1
2018,490,1
2013,454,3
2015,734,1
2016,511,1
2018,51,637
2014,42,2065
2009,127,46
2009,210,21
2017,262,4
2015,379,1
2014,427,4
2015,173,20
2011,371,4
2009,325,2
2009,587,1
2015,53,312
2010,52,438
2011,329,3
2017,382,2
2014,1058,1
2011,540,1
2014,1013,1
2013,691,1
2015,2,57150
2013,58,274
2009,60,508
2015,425,1
2013,373,4
2009,221,20
2014,325,7
2009,368,3
2014,112,70
2016,162,28
2015,392,3
2015,296,7
2013,1239,1
2018,412,1
2010,406,1
2016,72,320
2015,47,419
2011,459,2
2014,152,37
2015,80,152
2016,930,1
2015,438,3
2010,145,25
2011,348,4
2011,696,1
2015,313,2
2017,2,40057
2015,37,554
2017,113,23
2014,169,44
2014,230,18
2009,284,3
2018,199,12
2010,204,13
2014,182,26
2013,429,4
2018,440,3
2013,1323,1
2011,336,2
2008,348,1
2010,667,1
2016,18,6337
2016,32,1461
2016,198,33
2013,487,2
2013,146,36
2014,391,3
2008,252,9
2014,393,4
2013,500,2
2014,1112,1
2010,637,2
2009,523,3
2017,213,2
2016,884,1
2008,46,476
2008,28,953
2018,89,73
2014,68,249
2014,456,5
2010,209,18
2016,281,10
2010,290,4
2015,445,2
2014,322,6
2010,259,2
2010,392,1
2018,301,4
2017,379,1
2010,455,2
2010,656,2
2009,437,1
2018,872,1
2010,622,1
2017,605,2
2010,141,34
2011,173,15
2017,238,5
2012,-9,2
2015,109,46
2009,121,37
2014,481,2
2011,443,3
2017,293,2
2013,1056,1
2010,2,68351
2011,13,1897
2009,35,847
2013,411,2
2018,1181,1
2008,435,2
2011,92,96
2011,94,71
2010,18,7344
2010,26,2195
2011,149,16
2013,82,130
2017,775,1
2013,347,3
2013,790,1
2016,540,1
2014,394,1
2016,7,2209
2018,94,113
2013,61,199
2016,275,7
2015,280,10
2013,288,6
2011,261,4
2008,506,1
2008,563,1
2009,561,1
2010,1422,1
2018,466,1
2010,557,1
2016,687,1
2011,22,2091
2016,104,121
2009,204,17
2008,125,33
2009,134,33
2013,234,18
2013,156,48
2015,963,2
2014,426,4
2013,349,3
2015,361,3
2010,465,1
2010,860,1
2015,33,2290
2013,6,24075
2011,83,90
2011,106,54
2009,117,72
2014,1400,1
2014,259,15
2010,287,4
2016,339,9
2013,249,9
2018,493,3
2008,525,1
2013,50,497
2009,48,1322
2013,182,31
2016,125,50
2017,201,7
2009,294,6
2018,347,4
2009,315,8
2014,798,2
2013,512,1
2018,702,1
2015,233,8
2009,432,1
2008,73,131
2014,257,4
2009,119,46
2008,279,3
2009,471,3
2014,386,3
2017,202,5
2013,265,11
2014,254,8
2011,175,12
2015,540,2
2014,387,3
2015,692,1
2013,514,1
2011,877,1
2011,527,1
2011,40,600
2013,89,99
2008,271,4
2011,224,10
2015,259,5
2015,423,2
2009,230,10
2017,615,2
2009,333,1
2010,370,3
2011,488,1
2013,462,1
2015,532,1
2015,499,1
2013,506,1
2010,477,1
2011,37,538
2014,96,136
2018,302,4
2014,270,13
2015,131,38
2016,903,1
2009,316,4
2016,696,2
2015,414,2
2014,848,1
2016,775,1
2017,49,182
2014,961,1
2018,153,34
2016,294,10
2016,196,16
2009,347,4
2016,235,11
2013,717,2
2017,251,1
2011,895,1
2015,16,2940
2014,390,5
2013,139,38
2018,674,1
2016,359,1
2015,235,5
2011,490,2
2008,306,4
2018,761,1
2009,277,4
2016,860,1
2010,863,1
2017,26,1091
2016,28,1601
2015,59,273
2008,42,2078
2008,175,18
2017,254,3
2009,148,24
2017,164,13
2018,150,63
2018,305,5
2017,129,24
2017,177,9
2013,118,51
2013,438,2
2014,124,58
2010,122,49
2008,288,4
2013,253,12
2010,487,1
2011,492,1
2014,607,1
2016,615,3
2008,86,106
2011,108,87
2010,167,11
2017,214,5
2008,219,12
2013,208,14
2014,106,67
2013,206,13
2014,240,4
2011,818,1
2018,78,207
2008,3,70587
2018,95,91
2011,259,5
2018,564,1
2014,244,12
2013,904,1
2015,1042,1
2016,872,1
2010,367,2
2011,283,5
2012,174,2
2017,397,1
2011,9,11295
2015,139,30
2016,393,2
2011,338,4
2008,295,5
2014,183,25
2011,300,5
2014,471,2
2009,817,1
2018,767,1
2016,242,8
2010,330,6
2013,594,1
2011,462,3
2013,529,1
2015,527,1
2010,48,1308
2008,57,511
2017,40,318
2008,170,12
2017,476,2
2010,309,4
2015,273,11
2015,282,7
2009,914,1
2010,1103,1
2010,464,1
2015,387,3
2017,343,2
2015,403,2
2014,115,75
2018,31,653
2011,117,64
2015,151,21
2008,210,8
2017,560,2
2008,423,1
2018,388,3
2009,423,1
2018,12,9515
2018,118,45
2017,50,207
2017,-3,21
2018,468,2
2013,223,17
2016,177,16
2016,350,7
2011,326,4
2018,196,22
2011,249,11
2018,956,1
2016,316,4
2017,193,3
2010,272,5
2014,430,2
2010,504,1
2013,27,3134
2012,27,173
2011,49,323
2016,58,282
2018,143,49
2009,155,19
2017,83,60
2011,181,9
2010,186,11
2015,1067,1
2014,410,4
2014,334,3
2010,623,1
2014,-1,1
2014,444,3
2014,408,3
2011,319,2
2010,553,1
2015,39,2170
2015,14,3947
2010,227,5
2009,162,19
2013,274,5
2010,159,23
2010,391,2
2009,254,4
2009,299,4
2008,334,3
2018,823,1
2009,773,1
2016,70,184
2008,339,2
2016,374,6
2015,383,3
2015,208,27
2013,178,19
2016,340,9
2010,549,1
2012,84,4
2013,390,7
2017,247,7
2011,427,1
2008,256,5
2018,623,1
2010,458,1
2015,739,1
2011,45,1413
2017,98,59
2010,189,16
2017,228,6
2008,589,2
2011,206,16
2014,289,4
2017,298,1
2016,324,9
2008,661,1
2016,1944,1
2014,330,2
2008,565,1
2009,757,1
2015,49,317
2016,88,135
2009,130,39
2016,288,11
2011,363,3
2016,334,6
2010,408,2
2008,216,6
2010,785,1
2017,635,1
2010,44,694
2012,38,52
2010,121,47
2016,200,23
2016,204,22
2017,896,1
2009,558,3
2018,588,3
2017,-8,3
2010,474,1
2011,441,2
2009,3,71792
2016,134,39
2015,65,250
2013,110,86
2010,113,32
2014,525,3
2016,484,3
2016,317,3
2008,362,1
2010,67,175
2013,71,188
2008,220,5
2015,43,490
2017,75,115
2009,81,161
2017,79,55
2013,169,40
2010,157,20
2017,159,18
2017,167,12
2008,200,8
2014,591,1
2016,403,1
2014,233,10
2014,446,2
2018,500,2
2014,438,2
2017,327,2
2016,38,849
2010,6,26519
2014,122,51
2017,613,1
2010,525,2
2014,1516,1
2015,384,1
2013,626,1
2015,1650,1
2011,1450,1
2009,50,519
2017,52,302
2015,96,124
2015,207,27
2009,101,70
2012,117,2
2013,442,3
2016,1359,1
2016,772,1
2010,260,6
2010,185,9
2018,920,2
2013,1059,1
2011,124,34
2008,14,2915
2015,97,69
2015,702,1
2009,276,10
2014,5227,1
2008,492,2
2010,380,2
2012,181,1
2014,419,2
2013,309,5
2011,785,1
2010,256,5
2008,781,1
2009,393,1
2014,468,1
2011,41,560
2010,51,934
2011,241,7
2013,115,60
2015,535,2
2014,308,9
2013,399,1
2011,193,14
2016,449,2
2013,343,3
2010,241,9
2011,429,3
2010,450,2
2018,896,1
2013,1615,1
2015,369,1
2011,34,959
2010,71,168
2015,1728,1
2017,153,15
2011,122,45
2008,253,8
2016,193,13
2016,149,30
2008,302,8
2014,428,4
2016,1897,1
2012,97,3
2017,-76,1
2018,650,1
2013,3091,1
2016,11,2480
2011,54,723
2016,215,22
2010,88,89
2014,368,4
2018,246,11
2018,272,10
2016,179,17
2015,262,6
2008,500,2
2010,5353,1
2010,441,1
2009,21,4612
2011,70,159
2018,154,41
2011,177,13
2009,283,4
2013,513,2
2008,310,1
2013,395,2
2011,572,2
2010,493,2
2018,369,5
2018,731,1
2018,530,1
2015,36,2640
2013,30,3267
2018,177,17
2010,85,111
2010,198,15
2010,319,3
2009,395,2
2017,203,7
2014,671,1
2014,492,3
2013,374,2
2010,350,3
2013,26,2168
2017,0,160
2013,96,120
2008,1213,1
2016,407,2
2018,447,1
2018,684,1
2018,57,407
2018,60,439
2015,103,64
2009,77,122
2013,84,187
2012,45,45
2018,389,3
2009,338,1
2016,260,5
2012,120,3
2008,345,2
2008,60,462
2015,137,41
2013,138,64
2018,119,61
2013,113,46
2014,321,7
2013,360,9
2017,-14,2
2008,212,7
2018,274,9
2011,250,5
2016,357,5
2010,276,10
2008,620,1
2008,475,2
2017,519,1
2015,523,3
2011,1102,1
2008,482,3
2014,98,88
2010,537,1
2011,340,1
2008,250,4
2008,391,2
2013,-22,1
2014,360,3
2018,19,1128
2008,69,281
2015,83,114
2010,146,35
2015,111,67
2008,103,35
2014,251,10
2013,232,12
2013,797,1
2018,354,1
2010,953,1
2016,1344,1
2016,22,2607
2015,189,18
2018,149,28
2011,98,64
2017,126,39
2010,975,1
2010,467,2
2014,253,13
2012,86,4
2016,645,1
2018,1284,1
2016,404,2
2014,528,1
2016,684,2
2017,5,3301
2008,29,959
2011,97,53
2014,248,9
2016,550,1
2018,403,1
2008,840,1
2017,411,1
2010,21,4826
2008,6,24817
2013,68,258
2008,76,119
2009,138,45
2017,220,5
2011,423,4
2017,146,23
2015,551,1
2014,531,1
2014,1004,1
2016,706,1
2011,545,1
2011,359,1
2010,304,9
2016,497,1
2015,803,1
2018,303,5
2008,1180,1
2018,392,5
2015,301,4
2014,523,1
2008,-4,1
2016,51,768
2009,31,674
2017,155,12
2015,290,6
2013,163,20
2014,202,17
2014,533,3
2011,152,26
2009,412,2
2009,243,5
2015,329,7
2011,535,2
2017,491,1
2010,660,2
2008,318,4
2010,427,1
2017,773,1
2017,420,1
2014,220,15
2017,99,70
2013,120,81
2013,196,13
2014,292,5
2008,415,1
2015,505,2
2010,445,1
2018,222,14
2015,23,1602
2015,29,910
2018,54,601
2014,50,503
2013,172,20
2011,78,219
2009,499,2
2011,232,8
2009,537,1
2016,243,14
2009,323,7
2009,693,1
2014,575,1
2017,365,1
2017,282,1
2014,2259,1
2018,452,3
2015,-2,1
2014,26,2159
2009,18,7203
2015,154,40
2018,295,4
2013,131,38
2016,227,14
2010,307,5
2017,187,9
2018,1159,1
2014,480,2
2016,1007,1
2016,562,1
2015,802,1
2013,289,11
2009,203,16
2016,184,36
2018,1579,1
2016,342,4
2013,410,2
2017,336,2
2015,263,6
2009,281,7
2011,312,4
2014,877,1
2009,743,1
2013,423,3
2014,882,1
2016,666,1
2018,22,2388
2008,146,28
2013,268,13
2011,190,16
2012,69,19
2013,338,6
2018,1327,1
2010,478,4
2016,546,3
2015,506,1
2013,456,3
2011,1027,1
2017,13,1609
2015,25,939
2013,35,876
2010,202,10
2009,139,30
2008,245,6
2016,137,49
2017,116,19
2008,466,3
2016,278,6
2010,1335,1
2010,760,1
2016,15,6079
2016,131,31
2013,262,10
2011,258,5
2016,430,4
2012,215,1
2018,0,29
2015,94,99
2014,324,11
2010,253,9
2014,164,19
2014,170,33
2010,270,5
2009,985,1
2016,538,1
2015,683,1
2008,608,1
2008,257,5
2010,325,6
2011,381,1
2015,588,1
2008,383,1
2018,59,213
2014,65,261
2008,83,111
2017,279,5
2011,244,5
2017,163,11
2012,44,28
2010,609,1
2009,431,2
2013,368,2
2011,378,3
2009,374,1
2015,556,6
2014,354,3
2016,337,1
2016,493,1
2013,566,1
2013,570,1
2011,162,28
2017,61,99
2011,161,23
2015,115,73
2017,183,11
2008,337,6
2011,590,2
2013,372,6
2016,610,2
2018,323,7
2015,460,3
2010,279,3
2016,742,1
2017,291,1
2017,371,1
2014,48,1183
2015,69,253
2018,108,119
2014,61,185
2017,95,54
2015,446,4
2009,1566,1
2015,464,1
2018,611,4
2015,453,3
2014,293,6
2016,669,2
2018,381,1
2015,1149,1
2014,4,13784
2014,5,5039
2010,105,98
2010,127,39
2008,276,5
2016,486,2
2008,338,2
2016,321,1
2010,545,2
2008,819,1
2016,10,4516
2017,31,405
2016,90,156
2010,65,257
2014,63,388
2017,54,313
2016,352,3
2016,439,2
2013,310,5
2018,28,1556
2010,11,2555
2010,30,3414
2011,80,128
2016,194,16
2015,199,6
2017,236,6
2008,204,11
2014,217,13
2014,340,3
2012,90,3
2015,617,1
2018,625,1
2011,189,18
2010,151,21
2009,129,29
2018,364,3
2013,275,12
2008,667,1
2009,470,2
2014,703,1
2009,402,2
2013,1095,1
2009,312,2
2013,4,15180
2012,2,15876
2013,38,997
2010,9,11603
2011,72,261
2011,86,75
2014,176,22
2010,336,6
2015,474,1
2015,364,3
2010,326,4
2017,423,1
2016,89,103
2008,123,33
2008,182,16
2009,335,2
2018,375,6
2009,326,1
2015,834,1
2015,82,115
2011,168,26
2018,241,6
2018,176,27
2018,198,31
2016,239,6
2017,204,11
2008,347,2
2017,309,2
2014,1222,1
2017,271,2
2017,310,1
2013,1314,1
2018,643,1
2016,709,1
2017,135,27
2011,353,2
2016,312,6
2010,492,1
2015,538,2
2015,790,1
2014,97,59
2013,312,13
2016,309,5
2018,261,11
2008,286,6
2018,279,6
2015,1100,1
2018,419,3
2008,259,4
2008,408,2
2014,453,1
2009,43,526
2011,58,219
2016,126,96
2015,349,4
2015,265,9
2018,234,16
2008,255,9
2015,563,2
2014,1224,1
2009,46,474
2010,134,36
2014,226,16
2013,398,1
2017,-24,1
2016,252,22
2016,159,29
2015,156,51
2011,102,78
2015,284,5
2008,203,13
2015,147,48
2016,290,4
2015,398,2
2008,266,5
2009,508,1
2011,406,1
2018,331,2
2011,469,3
2011,1097,1
2013,132,68
2018,365,2
2017,166,7
2010,181,21
2008,416,2
2013,215,11
2016,691,1
2014,380,1
2016,570,1
2014,1140,1
2016,63,375
2011,93,90
2017,17,1733
2018,67,147
2017,64,137
2011,183,14
2017,131,15
2008,124,39
2012,75,12
2008,199,13
2013,379,2
2009,202,15
2016,457,1
2016,1104,1
2010,410,1
2016,759,1
2009,605,1
2015,52,483
2017,55,132
2018,168,37
2018,1401,1
2014,290,10
2016,458,1
2010,366,3
2016,343,3
2017,388,2
2014,483,1
2014,78,231
2012,36,93
2011,256,7
2018,420,2
2013,391,5
2010,343,3
2010,374,2
2016,498,1
2009,535,2
2009,348,4
2009,436,1
2013,660,1
2011,272,3
2018,37,490
2018,38,854
2015,158,26
2010,80,142
2015,192,28
2015,170,31
2010,187,24
2012,29,66
2018,386,3
2015,770,1
2008,264,7
2013,320,4
2010,347,2
2010,348,1
2016,436,2
2015,24,4217
2015,12,10561
2014,335,4
2013,259,6
2013,130,57
2010,179,14
2009,205,11
2015,171,28
2018,264,17
2009,399,2
2017,290,3
2010,385,4
2011,672,1
2017,230,8
2009,438,1
2013,705,1
2012,37,29
2018,898,1
2016,1743,1
2008,190,12
2018,238,17
2016,774,2
2008,630,1
2018,567,1
2009,488,2
2014,724,1
2009,637,1
2014,530,1
2018,453,1
2015,687,1
2015,270,9
2015,198,29
2013,479,1
2014,291,3
2018,470,5
2011,811,1
2008,137,28
2012,130,2
2009,426,1
2014,25,885
2009,72,275
2018,148,32
2013,70,203
2012,26,172
2013,213,14
2013,93,109
2011,228,14
2008,430,4
2009,260,9
2010,210,17
2008,165,20
2018,465,3
2017,169,13
2014,657,1
2015,261,11
2015,417,2
2016,586,1
2017,-6,1
2016,813,1
2013,452,3
2011,513,1
2012,8,796
2008,37,577
2015,253,18
2011,156,25
2013,311,2
2010,275,3
2014,361,3
2014,498,1
2018,546,1
2018,184,26
2013,119,63
2010,529,1
2015,245,4
2009,752,1
2016,1089,1
2017,384,1
2013,387,1
2017,437,1
2016,41,623
2009,175,21
2018,102,99
2011,298,5
2010,89,92
2017,470,2
2014,185,23
2017,180,15
2009,185,13
2010,231,8
2009,2208,1
2014,1207,1
2014,437,4
2016,771,1
2017,424,1
2017,556,1
2010,718,1
2010,500,1
2011,343,2
2009,491,1
2015,611,1
2011,595,1
2016,55,291
2008,7,2893
2011,120,53
2008,128,34
2015,735,1
2014,1081,1
2017,181,2
2017,578,1
2018,693,1
2014,732,1
