{
    "base_sample_path": "/analyses/executor/samples",
    "base_analysis_path": "/analyses/executor/analyses",
    "base_interpretation_path": "/analyses/executor/interpretations",
    "base_analysisexport_path": "/analyses/executor/ella/analyses-export",
    "base_single_preprocessed_path": "/analyses/executor/preprocessed/singles",
    "base_trio_preprocessed_path": "/analyses/executor/preprocessed/trios",
    "archive_analysis_path": "/analyses/executor/archive/analyses",
    "archive_sample_path": "/analyses/executor/archive/samples",
    "read_only_perm": "0740",
    "writable_perm": "0760",
    "executor": {
        "poll_interval": 5,
        "max_threads": 4,
        "killfile": "/controls/killexecutor",
        "logs": "/var/log"
    },
    "webui": {
        "killfile": "/controls/killwebui",
        "host": "0.0.0.0",
        "port": 5000,
        "logs": "/var/log"

    }
}
