{
    "ella_incoming": "/ess/p22/data/durable/production/ella/ella-prod/data/analyses/incoming",
    "base_sample_path": "/ess/p22/data/durable/production/data/samples",
    "base_analysis_path": "/ess/p22/data/durable/production/data/analyses-work",
    "base_single_preprocessed_path": "/ess/p22/data/durable/production/data/analyses-results/singles",
    "base_trio_preprocessed_path": "/ess/p22/data/durable/production/data/analyses-results/trios",
    "genepanels_home": "/ess/p22/data/durable/production/reference/public/genepanel-store",
    "sensitive_db": "/ess/p22/data/durable/production/reference/sensitive/sensitive-db",
    "refdata_home": "/ess/p22/data/durable/production/reference/public/refdata/data",
    "read_only_perm": "0764",
    "read_only_group": "p22-diag-ous-bioinf-group",
    "writable_perm": "0760",
    "writable_group": "p22-diag-ous-lab-group",
    "executor": {
        "poll_interval": 120,
        "max_threads": 21,
        "killfile": "/ess/p22/data/durable/production/sw/killexecutor",
        "logs": "/ess/p22/data/durable/production/logs/variantcalling/vcpipe/"
    },
    "webui": {
        "host": "0.0.0.0",
        "port": 8080,
        "killfile": "/ess/p22/data/durable/production/sw/killwebui",
        "logs": "/ess/p22/data/durable/production/logs/variantcalling/webui/"
    }
}