{
    "vcpipe-essentials": {
        "project": "images",
        "repo": "vcpipe-essentials",
        "tag": "1.2.1",
        "filename": "vcpipe-essentials-v1.2.1-rel-fe4a221a.sif"
    },
    "vcpipe-r-cnv": {
        "project": "images",
        "repo": "vcpipe-r-cnv",
        "tag": "1.0.0",
        "filename": "vcpipe-r-cnv-1.0.0-21ead12c.sif"
    },
    "happy": {
        "project": "tsnowlan",
        "repo": "happy-singularity",
        "tag": "v0.2.0",
        "filename": "happy_v0.2.0.sif"
    },
    "convading": {
        "project": "images",
        "repo": "convading",
        "tag": "v2.0.0",
        "filename": "convading_v2.0.0_5164631.sif"
    },
    "svtools": {
        "project" : "images",
        "repo" : "svtools",
        "tag" : "v0.1.5",
        "filename" : "svtools_v0.1.5.sif"
    }
}
