batch_name	sample_barcode	sample_type	well	assay	method_version	workflow_manager_version					
Batch210422	20210422001	Singleton	A1								
Batch210422	20210422002	Singleton	A2								
Batch210422	20210422003	Singleton	A3								
Batch210422	20210422004	Singleton	A4								
Batch210422	20210422005	Singleton	A5								
Batch210422	20210422006	Singleton	A6								
Batch210422	20210422007	Singleton	B1								
Batch210422	20210422008	Singleton	B2								
Batch210422	20210422009	Singleton	B3								
Batch210422	20210422010	Singleton	B4								
Batch210422	20210422011	Singleton	B5								
Batch210422	20210422012	Singleton	B6								
Batch210422	20210422013	Singleton	C1								
Batch210422	20210422014	Singleton	C2								
Batch210422	20210422015	Singleton	C3								
Batch210422	20210422016	Singleton	C4								
Batch210422	20210422017	Singleton	C5								
Batch210422	20210422018	Singleton	C6								
Batch210422	20210422019	Singleton	D1								
Batch210422	20210422020	Singleton	D2								
Batch210422	20210422021	Singleton	D3								
Batch210422	20210422022	Singleton	D4								
Batch210422	20210422023	Singleton	D5								
Batch210422	20210422024	Singleton	D6								
Batch210422	20210422025	Singleton	E1								
Batch210422	20210422026	Singleton	E2								
Batch210422	20210422027	Singleton	E3								
Batch210422	20210422028	Singleton	E4								
Batch210422	20210422029	Singleton	E5								
Batch210422	20210422030	Singleton	E6								
Batch210422	20210422031	Singleton	F1								
Batch210422	20210422032	Singleton	F2								
Batch210422	20210422033	Singleton	F3								
Batch210422	20210422034	Singleton	F4								
Batch210422	20210422035	Singleton	F5								
Batch210422	20210422036	Singleton	F6								
Batch210422	20210422037	Singleton	G1								
Batch210422	20210422038	Singleton	G2								
Batch210422	20210422039	Singleton	G3								
Batch210422	20210422040	Singleton	G4								
Batch210422	20210422041	Singleton	G5								
Batch210422	20210422042	Singleton	G6								
Batch210422	20210422043	Singleton	H1								
Batch210422	20210422044	Singleton	H2								
Batch210422	20210422045	Singleton	H3								
Batch210422	20210422046	Singleton	H4								
Batch210422	20210422047	Singleton	H5								
Batch210422	Batch210422_NTC_H6	NTC	H6	VeriSeq NIPT Assay	1.1.0	
