{
    "aldy_runner": "/ess/p22/data/durable/development/projects/pgx/aldypipeline/scripts/run_aldy.sh",
    "aldy_config": "/ess/p22/data/durable/development/projects/pgx/aldypipeline/config/tsd_aldy_config.json",
    "aldy_pipeline_version": "/ess/p22/data/durable/development/projects/pgx/aldypipeline/archive_version.txt",
    "aldy_result_path": "/ess/p22/data/durable/development/projects/pgx/results",
    "aldy_samples": "/ess/p22/data/durable/development/projects/pgx/metadata/tsd_aldy_samples.csv",
    "samples_json": "/ess/p22/data/durable/production/anno/sample-repo-staging/samples.json"
}