{
  "Nyre_v2.1.0": {
    "regions": "regions.bed",
    "transcripts": "transcripts.bed",
    "phenotypes": "phenotype.bed",
    "report_file": "report_config.txt"
  },
  "UtAv_v2.1.0": {
    "regions": "regions.bed",
    "transcripts": "transcripts.bed",
    "phenotypes": "phenotype.bed",
    "report_file": "report_config.txt"
  },
  "HBOC_v1.0.0": {
    "regions": "regions.bed",
    "transcripts": "transcripts.bed",
    "phenotypes": "phenotype.bed",
    "report_file": "report_config.txt"
  },
  "HBOC_v2.1.0": {
    "regions": "regions.bed",
    "transcripts": "transcripts.bed",
    "phenotypes": "phenotype.bed",
    "report_file": "report_config.txt"
  },
  "DMD_v1.0.0": {
    "regions": "regions.bed",
    "transcripts": "transcripts.bed",
    "phenotypes": "phenotype.bed",
    "report_file": "report_config.txt"
  },
  "DMD_v2.1.0": {
    "regions": "regions.bed",
    "transcripts": "transcripts.bed",
    "phenotypes": "phenotype.bed",
    "report_file": "report_config.txt"
  },
  "OCD_v1.0.0": {
    "regions": "regions.bed",
    "transcripts": "transcripts.bed",
    "phenotypes": "phenotype.bed",
    "report_file": "report_config.txt"
  },
  "OCD_v2.1.0": {
    "regions": "regions.bed",
    "transcripts": "transcripts.bed",
    "phenotypes": "phenotype.bed",
    "report_file": "report_config.txt"
  },
  "RAS_v1.0.0": {
    "regions": "regions.bed",
    "transcripts": "transcripts.bed",
    "phenotypes": "phenotype.bed",
    "report_file": "report_config.txt"
  },
  "RAS_v2.1.0": {
    "regions": "regions.bed",
    "transcripts": "transcripts.bed",
    "phenotypes": "phenotype.bed",
    "report_file": "report_config.txt"
  }
}
