{
  "project_info": {
    "project_number": "463409219002",
    "firebase_url": "https://infact-man.firebaseio.com",
    "project_id": "infact-man",
    "storage_bucket": "infact-man.appspot.com"
  },
  "client": [
    {
      "client_info": {
        "mobilesdk_app_id": "1:463409219002:android:c4e33f54159bbf7a",
        "android_client_info": {
          "package_name": "com.infact.man"
        }
      },
      "oauth_client": [
        {
          "client_id": "463409219002-c11c6u20hqtinoen6q3qq2nk7j1tf0hn.apps.googleusercontent.com",
          "client_type": 3
        }
      ],
      "api_key": [
        {
          "current_key": "AIzaSyD-I2t6ixMJ80tidf9Y92wf8VYI78-djok"
        },
        {
          "current_key": "AIzaSyD-I2t6ixMJ80tidf9Y92wf8VYI78-djok"
        }
      ],
      "services": {
        "analytics_service": {
          "status": 1
        },
        "appinvite_service": {
          "status": 1,
          "other_platform_oauth_client": []
        },
        "ads_service": {
          "status": 2
        }
      }
    }
  ],
  "configuration_version": "1"
}