{
"type": "FeatureCollection",
"name": "setores",
"crs": { "type": "name", "properties": { "name": "urn:ogc:def:crs:OGC:1.3:CRS84" } },
"features": [
{ "type": "Feature", "properties": { "Name": "30115 - SER I - GOIABEIRAS", "description": "DOMICILIAR ECOFOR", "timestamp": null, "begin": null, "end": null, "altitudeMode": null, "tessellate": 1, "extrude": 0, "visibility": -1, "drawOrder": null, "icon": null }, "geometry": { "type": "Polygon", "coordinates": [ [ [ -38.586362032698453, -3.69623559007614, 0.0 ], [ -38.587109353302097, -3.698121342160865, 0.0 ], [ -38.588090458046842, -3.699731232854038, 0.0 ], [ -38.587653674810163, -3.700116984817619, 0.0 ], [ -38.586825702756208, -3.700245421777696, 0.0 ], [ -38.585505346045331, -3.701107250213937, 0.0 ], [ -38.584468638099743, -3.699003930193145, 0.0 ], [ -38.582127009991908, -3.699961023264649, 0.0 ], [ -38.582669271918078, -3.701328673839953, 0.0 ], [ -38.581981436036813, -3.701328821638504, 0.0 ], [ -38.579043077120389, -3.701607189749761, 0.0 ], [ -38.578069241940142, -3.701988763347013, 0.0 ], [ -38.577053362763529, -3.699803300042152, 0.0 ], [ -38.577985072278032, -3.699294745970343, 0.0 ], [ -38.578681627200488, -3.699321303128574, 0.0 ], [ -38.579135335963763, -3.698482409328304, 0.0 ], [ -38.58031235633841, -3.697888984925383, 0.0 ], [ -38.579421589428968, -3.695968990264407, 0.0 ], [ -38.580819048305209, -3.694972535989508, 0.0 ], [ -38.581947326481753, -3.694494766693418, 0.0 ], [ -38.583953403567342, -3.694092784276938, 0.0 ], [ -38.586501447574449, -3.694498944012095, 0.0 ], [ -38.586362032698453, -3.69623559007614, 0.0 ] ] ] } },
{ "type": "Feature", "properties": { "Name": "30117 - SER I - BARRA DO CEARA II", "description": "DOMICILIAR ECOFOR", "timestamp": null, "begin": null, "end": null, "altitudeMode": null, "tessellate": 1, "extrude": 0, "visibility": -1, "drawOrder": null, "icon": null }, "geometry": { "type": "Polygon", "coordinates": [ [ [ -38.572414268523652, -3.705312329217337, 0.0 ], [ -38.572149012457302, -3.705388910391429, 0.0 ], [ -38.572653126180683, -3.706727034073799, 0.0 ], [ -38.569063833555127, -3.708166545149229, 0.0 ], [ -38.566609396386532, -3.708976572465868, 0.0 ], [ -38.566263975586573, -3.708141218933136, 0.0 ], [ -38.564667670507852, -3.708652612301864, 0.0 ], [ -38.564658948372482, -3.708132365652959, 0.0 ], [ -38.564869978476217, -3.706295350625461, 0.0 ], [ -38.564823310198612, -3.705432319366541, 0.0 ], [ -38.565345031467068, -3.705113543093871, 0.0 ], [ -38.564874916352302, -3.704220986437444, 0.0 ], [ -38.57093811060858, -3.701245710966562, 0.0 ], [ -38.572414268523652, -3.705312329217337, 0.0 ] ] ] } },
{ "type": "Feature", "properties": { "Name": "30119 - SER I - COLONIA", "description": "DOMICILIAR ECOFOR", "timestamp": null, "begin": null, "end": null, "altitudeMode": null, "tessellate": 1, "extrude": 0, "visibility": -1, "drawOrder": null, "icon": null }, "geometry": { "type": "Polygon", "coordinates": [ [ [ -38.580315713875578, -3.697894128951713, 0.0 ], [ -38.579207188118531, -3.698371370749239, 0.0 ], [ -38.578725008217319, -3.699295870833308, 0.0 ], [ -38.578005007769512, -3.699338871809819, 0.0 ], [ -38.577090607194982, -3.69980592849321, 0.0 ], [ -38.57899793833419, -3.704076723448827, 0.0 ], [ -38.57482934745682, -3.706025291266822, 0.0 ], [ -38.572662441585727, -3.706764640863228, 0.0 ], [ -38.57217035761807, -3.705410190707661, 0.0 ], [ -38.57241198776461, -3.70531614978857, 0.0 ], [ -38.571035340361782, -3.701270483513182, 0.0 ], [ -38.579435997023268, -3.695880252649954, 0.0 ], [ -38.580315713875578, -3.697894128951713, 0.0 ] ] ] } },
{ "type": "Feature", "properties": { "Name": "30120 - SER I - BARRA DO CEARA III", "description": "DOMICILIAR ECOFOR", "timestamp": null, "begin": null, "end": null, "altitudeMode": null, "tessellate": 1, "extrude": 0, "visibility": -1, "drawOrder": null, "icon": null }, "geometry": { "type": "Polygon", "coordinates": [ [ [ -38.585534052467892, -3.701052511078928, 0.0 ], [ -38.581594585592313, -3.702836787753078, 0.0 ], [ -38.582168007251489, -3.703938932522798, 0.0 ], [ -38.582749493197817, -3.703708213725472, 0.0 ], [ -38.584452834380237, -3.707256483288218, 0.0 ], [ -38.582300151300771, -3.708707724073157, 0.0 ], [ -38.584270342959613, -3.710823452444442, 0.0 ], [ -38.580941366575921, -3.711253095304979, 0.0 ], [ -38.580085116531279, -3.70960472882255, 0.0 ], [ -38.576625317322467, -3.710831659506157, 0.0 ], [ -38.574914725945227, -3.705993037027354, 0.0 ], [ -38.578996814219849, -3.70406484413962, 0.0 ], [ -38.5780408591636, -3.701992546149105, 0.0 ], [ -38.579091100488498, -3.70159348890878, 0.0 ], [ -38.582677845861191, -3.701291373675893, 0.0 ], [ -38.582116723337919, -3.699949440501711, 0.0 ], [ -38.584470147466917, -3.698978965592233, 0.0 ], [ -38.585534052467892, -3.701052511078928, 0.0 ] ] ] } },
{ "type": "Feature", "properties": { "Name": "30101 - SER I - PIRAMBU I", "description": "DOMICILIAR ECOFOR", "timestamp": null, "begin": null, "end": null, "altitudeMode": null, "tessellate": 1, "extrude": 0, "visibility": -1, "drawOrder": null, "icon": null }, "geometry": { "type": "Polygon", "coordinates": [ [ [ -38.565385045853553, -3.705125217188247, 0.0 ], [ -38.564866149563237, -3.705459720795451, 0.0 ], [ -38.564848329431513, -3.706998533911828, 0.0 ], [ -38.564687495804847, -3.708599801482429, 0.0 ], [ -38.566288370381628, -3.708160508846776, 0.0 ], [ -38.566585517657828, -3.708949303756524, 0.0 ], [ -38.563422962038182, -3.709971522842022, 0.0 ], [ -38.558714068059878, -3.711155694747533, 0.0 ], [ -38.558110631256397, -3.708691365548705, 0.0 ], [ -38.557206017662182, -3.706125444066566, 0.0 ], [ -38.560744547994503, -3.705319629523385, 0.0 ], [ -38.56190127399546, -3.705492079659714, 0.0 ], [ -38.564903184040098, -3.704229230941257, 0.0 ], [ -38.565385045853553, -3.705125217188247, 0.0 ] ] ] } },
{ "type": "Feature", "properties": { "Name": "30103 - SER I - PIRAMBU II", "description": "DOMICILIAR ECOFOR", "timestamp": null, "begin": null, "end": null, "altitudeMode": null, "tessellate": 1, "extrude": 0, "visibility": -1, "drawOrder": null, "icon": null }, "geometry": { "type": "Polygon", "coordinates": [ [ [ -38.558120232652797, -3.7086048636264, 0.0 ], [ -38.558720605324147, -3.711126792618621, 0.0 ], [ -38.557799931937048, -3.711495262065803, 0.0 ], [ -38.556748064297899, -3.711645010318739, 0.0 ], [ -38.554829078090407, -3.711999658331085, 0.0 ], [ -38.551459818383847, -3.712839314219899, 0.0 ], [ -38.547829648263772, -3.71394686622108, 0.0 ], [ -38.547025674218517, -3.714283665606541, 0.0 ], [ -38.546057161752017, -3.714745861161215, 0.0 ], [ -38.54482660055119, -3.715042076186537, 0.0 ], [ -38.543447969752968, -3.714886521002893, 0.0 ], [ -38.543954780696239, -3.713760035513497, 0.0 ], [ -38.548735221030931, -3.710822398247245, 0.0 ], [ -38.549204118463379, -3.710756351642861, 0.0 ], [ -38.55230593523666, -3.708777588823133, 0.0 ], [ -38.552960848676449, -3.708616743286674, 0.0 ], [ -38.555676417634551, -3.706531996570141, 0.0 ], [ -38.557299128133003, -3.706072821286833, 0.0 ], [ -38.558120232652797, -3.7086048636264, 0.0 ] ] ] } },
{ "type": "Feature", "properties": { "Name": "30105 - SER I - ALVARO WEYNE", "description": "DOMICILIAR ECOFOR", "timestamp": null, "begin": null, "end": null, "altitudeMode": null, "tessellate": 1, "extrude": 0, "visibility": -1, "drawOrder": null, "icon": null }, "geometry": { "type": "Polygon", "coordinates": [ [ [ -38.582303683554052, -3.708687316331601, 0.0 ], [ -38.584474744081973, -3.707229706300375, 0.0 ], [ -38.587009795726857, -3.708853195225732, 0.0 ], [ -38.588114767511733, -3.709767539701697, 0.0 ], [ -38.590154319951111, -3.70878798265778, 0.0 ], [ -38.588694934457799, -3.714370955429358, 0.0 ], [ -38.58112273518023, -3.715173973183882, 0.0 ], [ -38.579902089004989, -3.715570147953009, 0.0 ], [ -38.577906917668201, -3.710370310616028, 0.0 ], [ -38.580099441884613, -3.709577620610581, 0.0 ], [ -38.580883447050923, -3.711218253263759, 0.0 ], [ -38.584243339499082, -3.710821039387173, 0.0 ], [ -38.582303683554052, -3.708687316331601, 0.0 ] ] ] } },
{ "type": "Feature", "properties": { "Name": "30107 - SER I - BARRA DO CEARA I", "description": "DOMICILIAR ECOFOR", "timestamp": null, "begin": null, "end": null, "altitudeMode": null, "tessellate": 1, "extrude": 0, "visibility": -1, "drawOrder": null, "icon": null }, "geometry": { "type": "Polygon", "coordinates": [ [ [ -38.585822871762652, -3.700980043343585, 0.0 ], [ -38.586742072422169, -3.700250238991, 0.0 ], [ -38.587584653973558, -3.700172306928984, 0.0 ], [ -38.58806305219926, -3.69983398485522, 0.0 ], [ -38.5899070518226, -3.7016259512548, 0.0 ], [ -38.591855837410989, -3.702408222504973, 0.0 ], [ -38.591311680614943, -3.704449581565252, 0.0 ], [ -38.591908167144688, -3.705064788971585, 0.0 ], [ -38.593896380947179, -3.711733564739525, 0.0 ], [ -38.589012223706533, -3.713141286711356, 0.0 ], [ -38.590093693641009, -3.708861320487253, 0.0 ], [ -38.588129304723758, -3.709748425345135, 0.0 ], [ -38.586407143086177, -3.708432657911709, 0.0 ], [ -38.584450951471808, -3.707234532735051, 0.0 ], [ -38.582754221111273, -3.703731575052698, 0.0 ], [ -38.58214922593563, -3.704026552145475, 0.0 ], [ -38.581586806115091, -3.702827956769214, 0.0 ], [ -38.585822871762652, -3.700980043343585, 0.0 ] ] ] } },
{ "type": "Feature", "properties": { "Name": "30109 - SER I - NOVA ASSUNCAO", "description": "DOMICILIAR ECOFOR", "timestamp": null, "begin": null, "end": null, "altitudeMode": null, "tessellate": 1, "extrude": 0, "visibility": -1, "drawOrder": null, "icon": null }, "geometry": { "type": "Polygon", "coordinates": [ [ [ -38.600742755508918, -3.71508282150559, 0.0 ], [ -38.598226631174107, -3.715833684631662, 0.0 ], [ -38.598891597269208, -3.718499896797528, 0.0 ], [ -38.596058974839252, -3.719309006688426, 0.0 ], [ -38.591969222175543, -3.705075977947046, 0.0 ], [ -38.591261231161887, -3.704672666763385, 0.0 ], [ -38.591884210507281, -3.702365936602106, 0.0 ], [ -38.595748072342289, -3.705916767308896, 0.0 ], [ -38.597485088667547, -3.707175296904393, 0.0 ], [ -38.600742755508918, -3.71508282150559, 0.0 ] ] ] } },
{ "type": "Feature", "properties": { "Name": "30111 - SER I - CONJ DOS BANCARIOS", "description": "DOMICILIAR ECOFOR", "timestamp": null, "begin": null, "end": null, "altitudeMode": null, "tessellate": 1, "extrude": 0, "visibility": -1, "drawOrder": null, "icon": null }, "geometry": { "type": "Polygon", "coordinates": [ [ [ -38.601773951913621, -3.708958968049823, 0.0 ], [ -38.602072890061713, -3.707513782743699, 0.0 ], [ -38.602363212470657, -3.707142308808036, 0.0 ], [ -38.603978445980097, -3.706767951036643, 0.0 ], [ -38.604766157538378, -3.706395294924306, 0.0 ], [ -38.604680505118267, -3.706767901569137, 0.0 ], [ -38.603684300940131, -3.707388746032309, 0.0 ], [ -38.603721154117657, -3.70792605116171, 0.0 ], [ -38.603665516575127, -3.709124024642037, 0.0 ], [ -38.603985232266048, -3.710234192253997, 0.0 ], [ -38.604723671611069, -3.710685279019889, 0.0 ], [ -38.605881238993383, -3.710356316937892, 0.0 ], [ -38.606583317252309, -3.710109709125544, 0.0 ], [ -38.607979585763488, -3.710315084840174, 0.0 ], [ -38.608449491755543, -3.71150511846646, 0.0 ], [ -38.60869492401806, -3.711546057570198, 0.0 ], [ -38.608844024218932, -3.710273936533423, 0.0 ], [ -38.60881433829352, -3.709451391793989, 0.0 ], [ -38.608819497952503, -3.709080747983965, 0.0 ], [ -38.609974178694223, -3.708998253205645, 0.0 ], [ -38.610198009520431, -3.710274240823481, 0.0 ], [ -38.610419333258733, -3.712119027983491, 0.0 ], [ -38.610074007229493, -3.71314073393571, 0.0 ], [ -38.60943276809148, -3.714933300544394, 0.0 ], [ -38.608328661683373, -3.715559093326255, 0.0 ], [ -38.604594093458587, -3.717908747800677, 0.0 ], [ -38.603938999309648, -3.715772076807693, 0.0 ], [ -38.601369642339037, -3.716545435465217, 0.0 ], [ -38.597827123597142, -3.707924146579815, 0.0 ], [ -38.597208259314222, -3.707045186400086, 0.0 ], [ -38.601773951913621, -3.708958968049823, 0.0 ] ] ] } },
{ "type": "Feature", "properties": { "Name": "30113 - SER I - JARDIM GUANABARA", "description": "DOMICILIAR ECOFOR", "timestamp": null, "begin": null, "end": null, "altitudeMode": null, "tessellate": 1, "extrude": 0, "visibility": -1, "drawOrder": null, "icon": null }, "geometry": { "type": "Polygon", "coordinates": [ [ [ -38.597638605446413, -3.724880978145502, 0.0 ], [ -38.589281240443157, -3.727343270301783, 0.0 ], [ -38.585001802843607, -3.728629008635359, 0.0 ], [ -38.587086581102682, -3.720637076214863, 0.0 ], [ -38.588791386079912, -3.720483404265268, 0.0 ], [ -38.588919857290733, -3.721502551525588, 0.0 ], [ -38.596053603500032, -3.719424288117565, 0.0 ], [ -38.597638605446413, -3.724880978145502, 0.0 ] ] ] } },
{ "type": "Feature", "properties": { "Name": "30122 - SER I - VILA VELHA", "description": "DOMICILIAR ECOFOR", "timestamp": null, "begin": null, "end": null, "altitudeMode": null, "tessellate": 1, "extrude": 0, "visibility": -1, "drawOrder": null, "icon": null }, "geometry": { "type": "Polygon", "coordinates": [ [ [ -38.60138375058996, -3.716543834198295, 0.0 ], [ -38.603903587360662, -3.715728324626337, 0.0 ], [ -38.604639317957769, -3.717896398195191, 0.0 ], [ -38.608348489173693, -3.715588487731143, 0.0 ], [ -38.609592295456338, -3.717213357728582, 0.0 ], [ -38.609582514051759, -3.718477867451217, 0.0 ], [ -38.609016796875622, -3.719739305673071, 0.0 ], [ -38.605384172196722, -3.721470397987829, 0.0 ], [ -38.60591290806223, -3.72248117248892, 0.0 ], [ -38.602598377202249, -3.723431842539451, 0.0 ], [ -38.597533186292289, -3.724890659555474, 0.0 ], [ -38.597263449395093, -3.723514766528156, 0.0 ], [ -38.596071581232493, -3.719352757779125, 0.0 ], [ -38.59897419157771, -3.718507917611427, 0.0 ], [ -38.598228311382648, -3.715891826736641, 0.0 ], [ -38.600774689797923, -3.715131998718864, 0.0 ], [ -38.60138375058996, -3.716543834198295, 0.0 ] ] ] } },
{ "type": "Feature", "properties": { "Name": "30124 - SER I - PARQUE JARDIM GUANABARA II", "description": "DOMICILIAR ECOFOR", "timestamp": null, "begin": null, "end": null, "altitudeMode": null, "tessellate": 1, "extrude": 0, "visibility": -1, "drawOrder": null, "icon": null }, "geometry": { "type": "Polygon", "coordinates": [ [ [ -38.596091174320037, -3.719390004057775, 0.0 ], [ -38.588910673951133, -3.721474776687248, 0.0 ], [ -38.588816251645767, -3.720451007488458, 0.0 ], [ -38.587119274209371, -3.720584706070579, 0.0 ], [ -38.58902255798364, -3.713169749498604, 0.0 ], [ -38.593834418267157, -3.711703453772758, 0.0 ], [ -38.596091174320037, -3.719390004057775, 0.0 ] ] ] } }
]
}
