<?xml version="1.0" encoding="UTF-8" standalone="no"?>
<!-- Created with Inkscape (http://www.inkscape.org/) -->

<svg
   width="39.6875mm"
   height="15.875mm"
   viewBox="0 0 39.6875 15.875"
   version="1.1"
   id="svg5"
   xml:space="preserve"
   sodipodi:docname="obsr.svg"
   inkscape:version="1.2.1 (9c6d41e410, 2022-07-14)"
   inkscape:export-filename="obsr.png"
   inkscape:export-xdpi="96"
   inkscape:export-ydpi="96"
   xmlns:inkscape="http://www.inkscape.org/namespaces/inkscape"
   xmlns:sodipodi="http://sodipodi.sourceforge.net/DTD/sodipodi-0.dtd"
   xmlns="http://www.w3.org/2000/svg"
   xmlns:svg="http://www.w3.org/2000/svg"><sodipodi:namedview
     id="namedview7"
     pagecolor="#ffffff"
     bordercolor="#000000"
     borderopacity="0.25"
     inkscape:showpageshadow="2"
     inkscape:pageopacity="0.0"
     inkscape:pagecheckerboard="0"
     inkscape:deskcolor="#d1d1d1"
     inkscape:document-units="mm"
     showgrid="false"
     inkscape:zoom="4.1676048"
     inkscape:cx="90.459633"
     inkscape:cy="37.671518"
     inkscape:window-width="1920"
     inkscape:window-height="1007"
     inkscape:window-x="0"
     inkscape:window-y="0"
     inkscape:window-maximized="1"
     inkscape:current-layer="layer1" /><defs
     id="defs2"><style
       id="style2">.cls-1{fill:none;}.cls-12,.cls-2{fill:#fff;}.cls-3{clip-path:url(#clip-path);}.cls-4{fill:#6666cb;}.cls-10,.cls-11,.cls-12,.cls-4,.cls-5,.cls-6,.cls-7,.cls-8,.cls-9{fill-rule:evenodd;}.cls-5{fill:#f60;}.cls-6{fill:red;}.cls-7{fill:#cbcbff;}.cls-8{fill:#33cb66;}.cls-9{fill:#9800cb;}.cls-10{fill:#ffff61;}.cls-11{fill:#fdb900;}</style><clipPath
       id="clip-path"
       transform="translate(0)"><rect
         id="rect4"
         class="cls-1"
         y="0.47"
         width="29.85"
         height="26.690001"
         x="0" /></clipPath></defs><g
     inkscape:label="Layer 1"
     inkscape:groupmode="layer"
     id="layer1"
     transform="translate(-49.533649,-28.395559)"><rect
       style="fill:#209400;fill-opacity:1;stroke:none;stroke-width:0.525628;stroke-linecap:round;stroke-dasharray:none;stroke-opacity:1"
       id="rect5263"
       width="39.6875"
       height="15.875"
       x="49.533649"
       y="28.395559"
       ry="0.22131591" /><g
       id="g8847"
       transform="matrix(0.64339445,0,0,0.64339445,5.5838578,-66.935345)"
       style="fill:#ffffff"><g
         id="g8901"
         style="fill:#ffffff"><g
           id="g8882"
           style="fill:#ffffff"><g
             id="g8830"
             transform="translate(-3.3144002,-20.442761)"
             style="fill:#ffffff"><path
               id="path11-3"
               class="cls-2"
               d="m 79.175065,171.97781 a 2.4353573,2.4353573 0 0 1 1.846,0.71113 3.0198431,3.0198431 0 0 1 0.67216,1.97751 3.2292838,3.2292838 0 0 1 -0.66242,2.05544 2.5132887,2.5132887 0 0 1 -1.87035,0.7647 2.5522545,2.5522545 0 0 1 -1.86062,-0.72087 2.8688509,2.8688509 0 0 1 -0.64293,-1.94828 c 0,-1.42225 0.62832,-2.83963 2.51816,-2.83963 z m -0.94492,4.24239 a 1.2566444,1.2566444 0 0 0 1.94829,-0.0633 2.542513,2.542513 0 0 0 0.35556,-1.50506 3.1123866,3.1123866 0 0 0 -0.13151,-0.94004 1.2517737,1.2517737 0 0 0 -2.16747,-0.48707 2.4353573,2.4353573 0 0 0 -0.38478,1.5294 2.4353573,2.4353573 0 0 0 0.37991,1.46608 z"
               style="fill:#ffffff;stroke-width:0.487071" /><path
               id="path13-6"
               class="cls-2"
               d="m 82.126715,172.08984 h 1.94829 a 2.5863495,2.5863495 0 0 1 1.29561,0.24841 1.3248344,1.3248344 0 0 1 0.58936,1.12026 1.0569451,1.0569451 0 0 1 -0.30686,0.78418 1.4271194,1.4271194 0 0 1 -0.60397,0.35557 1.2566444,1.2566444 0 0 1 1.11052,1.28099 1.3589294,1.3589294 0 0 1 -0.76957,1.23717 3.4095002,3.4095002 0 0 1 -1.31509,0.22405 h -1.94829 z m 1.07643,2.13824 h 0.78419 c 0.32146,0 0.90108,0 0.90108,-0.67703 0,-0.67703 -0.55039,-0.65267 -0.92057,-0.65267 h -0.78905 z m 0,2.26976 h 0.7647 c 0.49194,0.0146 1.0813,0.0146 1.0813,-0.70626 0,-0.72086 -0.68677,-0.74035 -1.22255,-0.74035 h -0.6478 z"
               style="fill:#ffffff;stroke-width:0.487071" /><path
               id="path15-7"
               class="cls-2"
               d="m 87.484505,175.66007 a 0.86211648,0.86211648 0 0 0 0.97414,0.9985 c 0.60884,0 0.97414,-0.29224 0.97414,-0.73548 0,-0.44323 -0.32633,-0.54552 -0.97414,-0.70625 -1.25177,-0.31173 -1.94828,-0.6819 -1.94828,-1.59273 0,-0.91082 0.61371,-1.62681 2.07492,-1.62681 a 1.9482858,1.9482858 0 0 1 1.57811,0.61858 1.519663,1.519663 0 0 1 0.29712,0.97414 h -1.0813 a 0.77931434,0.77931434 0 0 0 -0.85238,-0.7988 c -0.52116,0 -0.86699,0.2825 -0.86699,0.71113 0,0.42862 0.38479,0.57474 1.14462,0.7647 0.90596,0.21431 1.80217,0.48707 1.80217,1.49044 0,0.94492 -0.78419,1.70475 -2.24053,1.70475 -2.01161,0 -2.02622,-1.29074 -2.03596,-1.80217 z"
               style="fill:#ffffff;stroke-width:0.487071" /><path
               id="path17-5"
               class="cls-2"
               d="m 91.040125,172.08497 h 3.51666 v 0.85724 h -2.39152 v 1.25178 h 2.24052 v 0.85724 h -2.24052 v 1.41738 h 2.47432 v 0.87186 h -3.59946 z"
               style="fill:#ffffff;stroke-width:0.487071" /><path
               id="path19-3"
               class="cls-2"
               d="m 95.029245,172.08497 h 2.0116 a 2.3428137,2.3428137 0 0 1 1.59272,0.35556 1.3297051,1.3297051 0 0 1 0.45785,1.01311 1.3150929,1.3150929 0 0 1 -1.09591,1.28587 c 0.78906,0.0731 0.84751,0.52116 0.94492,1.20306 0.0974,0.6819 0.12177,0.87186 0.15586,1.01798 a 0.97414292,0.97414292 0 0 0 0.16074,0.37992 h -1.24204 c -0.0487,-0.29224 -0.20944,-1.62195 -0.2825,-1.82652 -0.10228,-0.29711 -0.37991,-0.29711 -0.56987,-0.29711 h -0.97414 v 2.12363 h -1.15923 z m 1.11052,2.29898 h 0.91082 a 0.91082363,0.91082363 0 0 0 0.56988,-0.14613 0.73060719,0.73060719 0 0 0 0.29224,-0.61371 0.66241719,0.66241719 0 0 0 -0.27763,-0.58935 1.2469029,1.2469029 0 0 0 -0.74035,-0.12177 h -0.75496 z"
               style="fill:#ffffff;stroke-width:0.487071" /><path
               id="path21-5"
               class="cls-2"
               d="m 100.25065,172.1288 1.35893,4.10115 1.3979,-4.10115 h 1.11052 l -1.9483,5.23602 h -1.21279 l -1.933685,-5.23602 z"
               style="fill:#ffffff;stroke-width:0.487071" /><path
               id="path23-6"
               class="cls-2"
               d="m 106.56797,172.08497 1.82165,5.2555 h -1.13488 l -0.37505,-1.13488 h -2.07979 l -0.39453,1.13488 h -1.07643 l 1.89958,-5.2555 z m 0.0292,3.27312 -0.7306,-2.25514 -0.77445,2.24053 z"
               style="fill:#ffffff;stroke-width:0.487071" /><path
               id="path25-2"
               class="cls-2"
               d="m 109.21764,172.95683 h -1.56351 v -0.87186 h 4.26187 v 0.87186 h -1.53914 v 4.38364 h -1.13488 z"
               style="fill:#ffffff;stroke-width:0.487071" /><path
               id="path27-9"
               class="cls-2"
               d="m 114.31727,171.97781 a 2.4353573,2.4353573 0 0 1 1.84601,0.71113 3.0149723,3.0149723 0 0 1 0.66728,1.97751 3.2244131,3.2244131 0 0 1 -0.65755,2.05544 2.7324709,2.7324709 0 0 1 -3.73097,0.0292 2.8785923,2.8785923 0 0 1 -0.6478,-1.94828 c 0,-1.40764 0.6332,-2.82502 2.52303,-2.82502 z m -0.97415,4.24239 a 1.2517737,1.2517737 0 0 0 1.9483,-0.0633 2.5327716,2.5327716 0 0 0 0.36043,-1.50506 3.1123866,3.1123866 0 0 0 -0.13151,-0.94004 1.2176787,1.2176787 0 0 0 -1.20306,-0.93031 1.1933251,1.1933251 0 0 0 -0.97415,0.44324 2.4353573,2.4353573 0 0 0 -0.38478,1.5294 2.3817794,2.3817794 0 0 0 0.40914,1.46608 z m 1.04234,-4.50054 h -0.57962 l 0.62832,-1.05207 h 0.97415 z"
               style="fill:#ffffff;stroke-width:0.487071" /><path
               id="path29-1"
               class="cls-2"
               d="m 117.19586,172.08497 h 2.0116 a 2.3330723,2.3330723 0 0 1 1.59273,0.35556 1.3297051,1.3297051 0 0 1 0.45784,1.01311 1.3150929,1.3150929 0 0 1 -1.09591,1.28587 c 0.78906,0.0731 0.84751,0.52116 0.94492,1.20306 a 8.874442,8.874442 0 0 0 0.16074,1.01798 1.0472036,1.0472036 0 0 0 0.15586,0.37992 h -1.24203 c -0.0487,-0.29224 -0.20944,-1.62195 -0.28251,-1.82652 -0.10228,-0.29711 -0.37991,-0.29711 -0.565,-0.29711 h -0.97414 v 2.12363 h -1.1641 z m 1.11053,2.29898 h 0.91082 a 0.92543577,0.92543577 0 0 0 0.57475,-0.14613 0.74034862,0.74034862 0 0 0 0.32633,-0.61371 0.66241719,0.66241719 0 0 0 -0.27276,-0.58935 1.2615151,1.2615151 0 0 0 -0.74522,-0.12177 h -0.75496 z"
               style="fill:#ffffff;stroke-width:0.487071" /><path
               id="path31-2"
               class="cls-2"
               d="m 121.72563,172.07036 h 1.13001 v 5.27011 h -1.13001 z"
               style="fill:#ffffff;stroke-width:0.487071" /><path
               id="path33-7"
               class="cls-2"
               d="m 125.75858,171.97781 a 2.4353573,2.4353573 0 0 1 1.846,0.71113 3.0198431,3.0198431 0 0 1 0.67215,1.97751 3.2292838,3.2292838 0 0 1 -0.6624,2.05544 2.5132887,2.5132887 0 0 1 -1.87036,0.7647 2.542513,2.542513 0 0 1 -1.86062,-0.72087 2.8785923,2.8785923 0 0 1 -0.6478,-1.94828 c 0,-1.42225 0.63319,-2.83963 2.52303,-2.83963 z m -0.97414,4.24239 a 1.2566444,1.2566444 0 0 0 1.94828,-0.0633 2.5814787,2.5814787 0 0 0 0.35556,-1.50506 3.1123866,3.1123866 0 0 0 -0.13151,-0.94004 1.2517737,1.2517737 0 0 0 -2.16747,-0.48707 2.4353573,2.4353573 0 0 0 -0.38478,1.5294 2.4353573,2.4353573 0 0 0 0.40426,1.46608 z"
               style="fill:#ffffff;stroke-width:0.487071" /></g></g><text
           xml:space="preserve"
           style="font-style:normal;font-variant:normal;font-weight:normal;font-stretch:normal;font-size:7.05556px;font-family:Roboto;-inkscape-font-specification:Roboto;text-align:center;letter-spacing:-0.235479px;text-anchor:middle;fill:#ffffff;stroke:none;stroke-width:1.364;stroke-linecap:round;stroke-dasharray:none;stroke-opacity:1"
           x="73.084412"
           y="161.89799"
           id="text5468"><tspan
             sodipodi:role="line"
             id="tspan5466"
             style="font-style:normal;font-variant:normal;font-weight:500;font-stretch:normal;font-size:7.05556px;font-family:Roboto;-inkscape-font-specification:'Roboto Medium';text-align:start;text-anchor:start;fill:#ffffff;stroke-width:1.364"
             x="73.084412"
             y="161.89799"
             dy="1.99">DE RESÍDUOS </tspan><tspan
             sodipodi:role="line"
             style="font-style:normal;font-variant:normal;font-weight:500;font-stretch:normal;font-size:7.05556px;font-family:Roboto;-inkscape-font-specification:'Roboto Medium';text-align:start;text-anchor:start;fill:#ffffff;stroke-width:1.364"
             x="73.084412"
             y="170.71744"
             id="tspan8867">SÓLIDOS</tspan></text></g></g></g></svg>
