<?xml version="1.0" encoding="UTF-8"?>
<svg width="300" height="416.36" version="1.1" viewBox="0 0 79.375 110.16" xmlns="http://www.w3.org/2000/svg" xmlns:xlink="http://www.w3.org/1999/xlink">
<defs>
<filter id="a" x="-.03712" y="-.026202" width="1.0742" height="1.0524" style="color-interpolation-filters:sRGB">
<feGaussianBlur stdDeviation="1.2276667"/>
</filter>
<clipPath id="b">
<path d="m357.08 1303.7-308.11-380.93c-19.64-24.282-9.115-58.331 23.599-76.342l871.17-479.63c32.714-18.011 74.862-12.962 94.502 11.32l308.11 380.93c19.64 24.282 9.1151 58.33-23.599 76.342l-871.17 479.63c-32.714 18.011-74.862 12.962-94.502-11.32z" style="fill:#ff585d;stroke-dasharray:4.27569, 1.42523;stroke-linecap:round;stroke-linejoin:round;stroke-width:1.4252"/>
</clipPath>
</defs>
<g transform="translate(.30057 .30057)">
<path transform="matrix(.93089 0 0 .93089 -.020772 -.020772)" d="m10.07 2.6458h64.526c4.1132 0 7.4245 2.9936 7.4245 6.7121v99.024c0 3.7185-3.3113 6.7121-7.4245 6.7121h-64.526c-4.1132 0-7.4245-2.9936-7.4245-6.7121v-99.024c0-3.7185 3.3113-6.7121 7.4245-6.7121z" style="fill:#4d4d4d;filter:url(#a);stroke-dasharray:0.4935, 0.1645;stroke-linecap:round;stroke-linejoin:round;stroke-width:.1645"/>
<path d="m6.8906-0.020772h60.067c3.8289 0 6.9114 2.7867 6.9114 6.2483v92.18c0 3.4615-3.0825 6.2483-6.9114 6.2483h-60.067c-3.8289 0-6.9114-2.7867-6.9114-6.2483v-92.18c0-3.4615 3.0825-6.2483 6.9114-6.2483z" style="fill:#ff585d;stroke-dasharray:0.459395, 0.153132;stroke-linecap:round;stroke-linejoin:round;stroke-width:.15313"/>
</g>
<rect x="7.9375" y="35.57" width="31.75" height="1.8521" rx="0" ry=".92604" style="fill:#ffffff"/>
<g transform="matrix(-.060066 .073211 -.1091 -.059215 170.87 51.336)" clip-path="url(#b)" style="fill:none;stroke:#ffffff">
<g transform="translate(1373.3 455.53)" style="stroke:#ffffff">
<path d="m0 0c170.76-86.832 82.281-379.93-346.86-346.86-160.61 12.375-687.58 218.72-533.63 371.12 254.32 251.76 394.84 523.33 549.8 491.59 120.75-24.737-8.307-343.46 330.69-515.84z" style="fill:none;stroke-dasharray:1, 20;stroke-linecap:round;stroke-linejoin:round;stroke-miterlimit:10;stroke-width:4;stroke:#ffffff"/>
</g>
<g transform="translate(1366.3 455.53)" style="stroke:#ffffff">
<path d="m0 0c167.04-85.207 80.455-374.34-339.62-341.99-157.38 12.107-673.28 216.38-522.68 365.72 248.79 246.55 386.47 512.43 538.32 481.37 118.39-24.2-7.652-336.2 323.97-505.1z" style="fill:none;stroke-dasharray:1, 20;stroke-linecap:round;stroke-linejoin:round;stroke-miterlimit:10;stroke-width:3.935;stroke:#ffffff"/>
</g>
<g transform="translate(1359.2 455.53)" style="stroke:#ffffff">
<path d="m0 0c163.33-83.581 78.63-368.75-332.38-337.12-154.15 11.838-658.98 214.03-511.73 360.32 243.26 241.34 378.1 501.53 526.84 471.16 116.02-23.662-6.997-328.95 317.26-494.36z" style="fill:none;stroke-dasharray:1, 20;stroke-linecap:round;stroke-linejoin:round;stroke-miterlimit:10;stroke-width:3.87;stroke:#ffffff"/>
</g>
<g transform="translate(1352.1 455.53)" style="stroke:#ffffff">
<path d="m0 0c159.62-81.956 76.804-363.16-325.14-332.25-150.92 11.569-644.68 211.68-500.78 354.93 237.74 236.13 369.73 490.62 515.37 460.95 113.66-23.124-6.341-321.69 310.55-483.62z" style="fill:none;stroke-dasharray:1, 20;stroke-linecap:round;stroke-linejoin:round;stroke-miterlimit:10;stroke-width:3.804;stroke:#ffffff"/>
</g>
<g transform="translate(1345.1 455.53)" style="stroke:#ffffff">
<path d="m0 0c155.91-80.33 74.979-357.58-317.89-327.38-147.69 11.299-630.39 209.34-489.83 349.53 232.21 230.91 361.36 479.72 503.89 450.74 111.3-22.587-5.686-314.44 303.83-472.88z" style="fill:none;stroke-dasharray:1, 20;stroke-linecap:round;stroke-linejoin:round;stroke-miterlimit:10;stroke-width:3.739;stroke:#ffffff"/>
</g>
<g transform="translate(1338 455.53)" style="stroke:#ffffff">
<path d="m0 0c152.2-78.705 73.153-351.99-310.65-322.52-144.46 11.031-616.09 207-478.88 344.14 226.68 225.7 352.99 468.82 492.41 440.53 108.94-22.048-5.031-307.18 297.12-462.14z" style="fill:none;stroke-dasharray:1, 20;stroke-linecap:round;stroke-linejoin:round;stroke-miterlimit:10;stroke-width:3.674;stroke:#ffffff"/>
</g>
<g transform="translate(1331 455.53)" style="stroke:#ffffff">
<path d="m0 0c148.64-76.771 71.328-346.4-303.41-317.65-141.23 10.762-601.79 204.65-467.93 338.74 221.15 220.49 344.62 457.92 480.94 430.31 106.57-21.511-4.061-299.32 290.4-451.41z" style="fill:none;stroke-dasharray:1, 20;stroke-linecap:round;stroke-linejoin:round;stroke-miterlimit:10;stroke-width:3.609;stroke:#ffffff"/>
</g>
<g transform="translate(1323.9 455.53)" style="stroke:#ffffff">
<path d="m0 0c144.96-75.094 69.503-340.81-296.17-312.78-138 10.492-587.5 202.3-456.98 333.34 215.62 215.28 336.25 447.02 469.46 420.1 104.21-20.973-3.353-291.96 283.69-440.67z" style="fill:none;stroke-dasharray:1, 20;stroke-linecap:round;stroke-linejoin:round;stroke-miterlimit:10;stroke-width:3.543;stroke:#ffffff"/>
</g>
<g transform="translate(1316.8 455.53)" style="stroke:#ffffff">
<path d="m0 0c141.27-73.418 67.677-335.23-288.93-307.91-134.77 10.223-573.2 199.96-446.03 327.95 210.09 210.07 327.88 436.11 457.98 409.89 101.85-20.435-2.645-284.61 276.97-429.93z" style="fill:none;stroke-dasharray:1, 20;stroke-linecap:round;stroke-linejoin:round;stroke-miterlimit:10;stroke-width:3.478;stroke:#ffffff"/>
</g>
<g transform="translate(1309.8 455.53)" style="stroke:#ffffff">
<path d="m0 0c137.59-71.742 65.852-329.64-281.68-303.04-131.54 9.955-558.9 197.61-435.08 322.55 204.56 204.86 319.5 425.21 446.5 399.68 99.485-19.898-1.936-277.26 270.26-419.19z" style="fill:none;stroke-dasharray:1, 20;stroke-linecap:round;stroke-linejoin:round;stroke-miterlimit:10;stroke-width:3.413;stroke:#ffffff"/>
</g>
<g transform="translate(1302.7 455.53)" style="stroke:#ffffff">
<path d="m0 0c133.9-70.066 64.026-324.05-274.44-298.17-128.32 9.686-544.87 195.53-424.13 317.16 198.61 200.07 311.13 414.31 435.02 389.46 97.122-19.36-1.228-269.9 263.55-408.45z" style="fill:none;stroke-dasharray:1, 20;stroke-linecap:round;stroke-linejoin:round;stroke-miterlimit:10;stroke-width:3.348;stroke:#ffffff"/>
</g>
<g transform="translate(1295.6 455.53)" style="stroke:#ffffff">
<path d="m0 0c130.22-68.39 62.201-318.46-267.2-293.3-125.08 9.416-530.6 193.2-413.18 311.76 193.04 194.9 302.76 403.41 423.55 379.25 94.758-18.822-0.519-262.55 256.83-397.71z" style="fill:none;stroke-dasharray:1, 20;stroke-linecap:round;stroke-linejoin:round;stroke-miterlimit:10;stroke-width:3.283;stroke:#ffffff"/>
</g>
<g transform="translate(1288.6 455.53)" style="stroke:#ffffff">
<path d="m0 0c126.53-66.714 60.376-312.88-259.96-288.43-121.86 9.147-516.32 190.88-402.23 306.36 187.47 189.73 294.39 392.5 412.07 369.04 92.396-18.285 0.19-255.2 250.12-386.97z" style="fill:none;stroke-dasharray:1, 20;stroke-linecap:round;stroke-linejoin:round;stroke-miterlimit:10;stroke-width:3.217;stroke:#ffffff"/>
</g>
<g transform="translate(1281.5 455.53)" style="stroke:#ffffff">
<path d="m0 0c122.85-65.039 58.55-307.29-252.72-283.57-118.63 8.879-502.05 188.56-391.28 300.97 181.9 184.56 286.02 381.6 400.59 358.83 90.033-17.746 0.899-247.84 243.4-376.23z" style="fill:none;stroke-dasharray:1, 20;stroke-linecap:round;stroke-linejoin:round;stroke-miterlimit:10;stroke-width:3.152;stroke:#ffffff"/>
</g>
<g transform="translate(1274.4 455.53)" style="stroke:#ffffff">
<path d="m0 0c119.17-63.364 56.725-301.7-245.48-278.7-115.4 8.61-487.78 186.24-380.32 295.57 176.32 179.39 277.65 370.7 389.11 348.62 87.67-17.209 1.608-240.49 236.69-365.49z" style="fill:none;stroke-dasharray:1, 20;stroke-linecap:round;stroke-linejoin:round;stroke-miterlimit:10;stroke-width:3.087;stroke:#ffffff"/>
</g>
<g transform="translate(1267.4 455.53)" style="stroke:#ffffff">
<path d="m0 0c115.48-61.689 54.899-296.11-238.24-273.83-112.17 8.34-473.51 183.92-369.38 290.17 170.75 174.22 269.28 359.8 377.64 338.4 85.307-16.671 2.318-233.14 229.97-354.75z" style="fill:none;stroke-dasharray:1, 20;stroke-linecap:round;stroke-linejoin:round;stroke-miterlimit:10;stroke-width:3.022;stroke:#ffffff"/>
</g>
<g transform="translate(1260.3 455.53)" style="stroke:#ffffff">
<path d="m0 0c111.8-60.014 53.074-290.52-230.99-268.96-108.94 8.071-459.24 181.6-358.42 284.78 165.18 169.05 260.91 348.9 366.16 328.19 82.944-16.133 3.028-225.79 223.26-344.01z" style="fill:none;stroke-dasharray:1, 20;stroke-linecap:round;stroke-linejoin:round;stroke-miterlimit:10;stroke-width:2.957;stroke:#ffffff"/>
</g>
<g transform="translate(1253.2 455.53)" style="stroke:#ffffff">
<path d="m0 0c108.12-58.34 51.249-284.94-223.75-264.09-105.71 7.803-444.97 179.28-347.47 279.38 159.61 163.88 252.54 337.99 354.68 317.98 80.581-15.596 3.737-218.44 216.54-333.27z" style="fill:none;stroke-dasharray:1, 20;stroke-linecap:round;stroke-linejoin:round;stroke-miterlimit:10;stroke-width:2.891;stroke:#ffffff"/>
</g>
<g transform="translate(1246.2 455.53)" style="stroke:#ffffff">
<path d="m0 0c104.44-56.666 49.423-279.35-216.51-259.22-102.48 7.533-430.7 176.96-336.52 273.99 154.04 158.71 244.16 327.09 343.2 307.77 78.218-15.057 4.448-211.09 209.83-322.53z" style="fill:none;stroke-dasharray:1, 20;stroke-linecap:round;stroke-linejoin:round;stroke-miterlimit:10;stroke-width:2.826;stroke:#ffffff"/>
</g>
<g transform="translate(1239.1 455.53)" style="stroke:#ffffff">
<path d="m0 0c100.75-54.992 47.598-273.76-209.27-254.35-99.25 7.264-416.43 174.64-325.57 268.59 148.47 153.53 235.79 316.19 331.73 297.56 75.856-14.52 5.159-203.74 203.12-311.79z" style="fill:none;stroke-dasharray:1, 20;stroke-linecap:round;stroke-linejoin:round;stroke-miterlimit:10;stroke-width:2.761;stroke:#ffffff"/>
</g>
<g transform="translate(1232 455.53)" style="stroke:#ffffff">
<path d="m0 0c97.071-53.319 45.772-268.18-202.03-249.48-96.021 6.995-402.16 172.32-314.62 263.19 142.9 148.36 227.42 305.29 320.25 287.34 73.492-13.982 5.869-196.4 196.4-301.05z" style="fill:none;stroke-dasharray:1, 20;stroke-linecap:round;stroke-linejoin:round;stroke-miterlimit:10;stroke-width:2.696;stroke:#ffffff"/>
</g>
<g transform="translate(1225 455.53)" style="stroke:#ffffff">
<path d="m0 0c93.39-51.647 43.947-262.59-194.79-244.62-92.791 6.727-387.89 169.99-303.67 257.8 137.33 143.19 219.05 294.38 308.77 277.13 71.129-13.444 6.581-189.05 189.69-290.32z" style="fill:none;stroke-dasharray:1, 20;stroke-linecap:round;stroke-linejoin:round;stroke-miterlimit:10;stroke-width:2.63;stroke:#ffffff"/>
</g>
<g transform="translate(1217.9 455.53)" style="stroke:#ffffff">
<path d="m0 0c89.709-49.974 42.121-257-187.54-239.75-89.562 6.457-373.62 167.67-292.72 252.4 131.76 138.01 210.68 283.48 297.29 266.92 68.767-12.907 7.293-181.71 182.97-279.58z" style="fill:none;stroke-dasharray:1, 20;stroke-linecap:round;stroke-linejoin:round;stroke-miterlimit:10;stroke-width:2.565;stroke:#ffffff"/>
</g>
<g transform="translate(1210.8 455.53)" style="stroke:#ffffff">
<path d="m0 0c86.028-48.303 40.296-251.41-180.3-234.88-86.333 6.188-359.35 165.35-281.77 247.01 126.19 132.84 202.31 272.58 285.82 256.71 66.404-12.369 8.005-174.36 176.26-268.84z" style="fill:none;stroke-dasharray:1, 20;stroke-linecap:round;stroke-linejoin:round;stroke-miterlimit:10;stroke-width:2.5;stroke:#ffffff"/>
</g>
<g transform="translate(1203.8 455.53)" style="stroke:#ffffff">
<path d="m0 0c82.349-46.632 38.471-245.82-173.06-230.01-83.103 5.919-345.08 163.02-270.82 241.61 120.62 127.66 193.94 261.68 274.34 246.5 64.041-11.831 8.718-167.02 169.54-258.1z" style="fill:none;stroke-dasharray:1, 20;stroke-linecap:round;stroke-linejoin:round;stroke-miterlimit:10;stroke-width:2.435;stroke:#ffffff"/>
</g>
<g transform="translate(1196.7 455.53)" style="stroke:#ffffff">
<path d="m0 0c78.67-44.962 36.645-240.24-165.82-225.14-79.874 5.649-330.81 160.7-259.87 236.21 115.05 122.48 185.54 250.61 262.86 236.28 61.654-11.424 9.431-159.68 162.83-247.36z" style="fill:none;stroke-dasharray:1, 20;stroke-linecap:round;stroke-linejoin:round;stroke-miterlimit:10;stroke-width:2.37;stroke:#ffffff"/>
</g>
<g transform="translate(1189.6 455.53)" style="stroke:#ffffff">
<path d="m0 0c74.992-43.293 34.849-234.25-158.58-220.27-76.634 5.539-316.54 158.37-248.92 230.82 109.48 117.3 177.16 239.7 251.38 226.07 59.291-10.891 10.146-152.35 156.12-236.62z" style="fill:none;stroke-dasharray:1, 20;stroke-linecap:round;stroke-linejoin:round;stroke-miterlimit:10;stroke-width:2.304;stroke:#ffffff"/>
</g>
<g transform="translate(1182.6 455.53)" style="stroke:#ffffff">
<path d="m0 0c71.314-41.625 33.024-228.65-151.34-215.4-73.404 5.275-302.26 156.05-237.97 225.42 103.91 112.12 168.79 228.8 239.9 215.86 56.927-10.357 10.86-145.01 149.4-225.88z" style="fill:none;stroke-dasharray:1, 20;stroke-linecap:round;stroke-linejoin:round;stroke-miterlimit:10;stroke-width:2.239;stroke:#ffffff"/>
</g>
<g transform="translate(1175.5 455.53)" style="stroke:#ffffff">
<path d="m0 0c67.638-39.959 31.2-223.05-144.09-210.53-70.174 5.011-288 153.72-227.02 220.02 98.346 106.94 160.42 217.89 228.43 205.65 54.563-9.823 11.575-137.68 142.69-215.14z" style="fill:none;stroke-dasharray:1, 20;stroke-linecap:round;stroke-linejoin:round;stroke-miterlimit:10;stroke-width:2.174;stroke:#ffffff"/>
</g>
<g transform="translate(1168.4 455.53)" style="stroke:#ffffff">
<path d="m0 0c63.963-38.294 29.375-217.45-136.85-205.66-66.944 4.747-273.72 151.39-216.07 214.63 92.778 101.76 152.05 206.98 216.95 195.44 52.201-9.289 12.292-130.35 135.97-204.4z" style="fill:none;stroke-dasharray:1, 20;stroke-linecap:round;stroke-linejoin:round;stroke-miterlimit:10;stroke-width:2.109;stroke:#ffffff"/>
</g>
<g transform="translate(1161.4 455.53)" style="stroke:#ffffff">
<path d="m0 0c60.289-36.63 27.55-211.86-129.61-200.8-63.715 4.484-259.46 149.07-205.12 209.23 87.211 96.574 143.68 196.08 205.47 185.22 49.837-8.755 13.008-123.03 129.26-193.66z" style="fill:none;stroke-dasharray:1, 20;stroke-linecap:round;stroke-linejoin:round;stroke-miterlimit:10;stroke-width:2.043;stroke:#ffffff"/>
</g>
<g transform="translate(1154.3 455.53)" style="stroke:#ffffff">
<path d="m0 0c56.616-34.969 25.725-206.26-122.37-195.93-60.485 4.22-245.18 146.74-194.17 203.84 81.644 91.386 135.31 185.17 193.99 175.01 47.474-8.22 13.726-115.71 122.54-182.92z" style="fill:none;stroke-dasharray:1, 20;stroke-linecap:round;stroke-linejoin:round;stroke-miterlimit:10;stroke-width:1.978;stroke:#ffffff"/>
</g>
<g transform="translate(1147.2 455.53)" style="stroke:#ffffff">
<path d="m0 0c52.946-33.31 23.9-200.66-115.13-191.06-57.255 3.955-230.91 144.4-183.22 198.44 76.079 86.196 126.94 174.27 182.52 164.8 45.111-7.685 14.446-108.4 115.83-172.18z" style="fill:none;stroke-dasharray:1, 20;stroke-linecap:round;stroke-linejoin:round;stroke-miterlimit:10;stroke-width:1.913;stroke:#ffffff"/>
</g>
<g transform="translate(1140.2 455.53)" style="stroke:#ffffff">
<path d="m0 0c49.277-31.655 22.075-195.07-107.89-186.19-54.026 3.691-216.64 142.07-172.27 193.04 70.515 81.002 118.56 163.36 171.04 154.59 42.748-7.149 15.165-101.09 109.12-161.44z" style="fill:none;stroke-dasharray:1, 20;stroke-linecap:round;stroke-linejoin:round;stroke-miterlimit:10;stroke-width:1.848;stroke:#ffffff"/>
</g>
<g transform="translate(1133.1 455.53)" style="stroke:#ffffff">
<path d="m0 0c45.61-30.003 20.249-189.48-100.64-181.32-50.797 3.427-202.37 139.74-161.32 187.65 64.952 75.803 110.19 152.46 159.56 144.38 40.386-6.614 15.886-93.793 102.4-150.7z" style="fill:none;stroke-dasharray:1, 20;stroke-linecap:round;stroke-linejoin:round;stroke-miterlimit:10;stroke-width:1.783;stroke:#ffffff"/>
</g>
<g transform="translate(1126 455.53)" style="stroke:#ffffff">
<path d="m0 0c41.947-28.356 18.424-183.88-93.403-176.45-47.567 3.162-188.1 137.4-150.37 182.25 59.391 70.601 101.82 141.56 148.08 134.16 38.023-6.078 16.609-86.507 95.688-139.96z" style="fill:none;stroke-dasharray:1, 20;stroke-linecap:round;stroke-linejoin:round;stroke-miterlimit:10;stroke-width:1.717;stroke:#ffffff"/>
</g>
<g transform="translate(1119 455.53)" style="stroke:#ffffff">
<path d="m0 0c38.286-26.715 16.598-178.3-86.161-171.58-44.338 2.896-173.83 135.05-139.42 176.86 53.833 65.391 93.454 130.66 136.61 123.95 35.661-5.54 17.332-79.234 88.974-129.22z" style="fill:none;stroke-dasharray:1, 20;stroke-linecap:round;stroke-linejoin:round;stroke-miterlimit:10;stroke-width:1.652;stroke:#ffffff"/>
</g>
<g transform="translate(1111.9 455.53)" style="stroke:#ffffff">
<path d="m0 0c34.629-25.082 14.772-172.71-78.92-166.72-41.108 2.63-159.56 132.71-128.47 171.46 48.278 60.173 85.084 119.76 125.13 113.74 33.299-5.003 18.054-71.981 82.259-118.48z" style="fill:none;stroke-dasharray:1, 20;stroke-linecap:round;stroke-linejoin:round;stroke-miterlimit:10;stroke-width:1.587;stroke:#ffffff"/>
</g>
<g transform="translate(1104.8 455.53)" style="stroke:#ffffff">
<path d="m0 0c30.977-23.46 12.946-167.13-71.678-161.85-37.879 2.364-145.29 130.36-117.52 166.06 42.729 54.945 76.714 108.86 113.65 103.53 30.937-4.463 18.777-64.752 75.545-107.74z" style="fill:none;stroke-dasharray:1, 20;stroke-linecap:round;stroke-linejoin:round;stroke-miterlimit:10;stroke-width:1.522;stroke:#ffffff"/>
</g>
<g transform="translate(1097.8 455.53)" style="stroke:#ffffff">
<path d="m0 0c27.328-21.853 11.119-161.55-64.436-156.98-34.651 2.096-131.01 128-106.57 160.67 37.186 49.703 68.345 97.959 102.17 93.315 28.576-3.923 19.497-57.556 68.831-97.006z" style="fill:none;stroke-dasharray:1, 20;stroke-linecap:round;stroke-linejoin:round;stroke-miterlimit:10;stroke-width:1.457;stroke:#ffffff"/>
</g>
<g transform="translate(1090.7 455.53)" style="stroke:#ffffff">
<path d="m0 0c23.685-20.267 9.292-155.97-57.195-152.11-31.421 1.826-116.74 125.62-95.617 155.27 31.655 44.443 59.976 87.064 90.696 83.103 26.215-3.38 20.21-50.407 62.116-86.267z" style="fill:none;stroke-dasharray:1, 20;stroke-linecap:round;stroke-linejoin:round;stroke-miterlimit:10;stroke-width:1.391;stroke:#ffffff"/>
</g>
<g transform="translate(1083.6 455.53)" style="stroke:#ffffff">
<path d="m0 0c20.043-18.712 7.464-150.41-49.953-147.24-28.193 1.555-102.45 123.24-84.667 149.88 26.14 39.157 51.608 76.172 79.218 72.89 23.854-2.835 20.907-43.323 55.402-75.527z" style="fill:none;stroke-dasharray:1, 20;stroke-linecap:round;stroke-linejoin:round;stroke-miterlimit:10;stroke-width:1.326;stroke:#ffffff"/>
</g>
<g transform="translate(1076.6 455.53)" style="stroke:#ffffff">
<path d="m0 0c16.398-17.205 5.635-144.85-42.711-142.37-24.965 1.281-88.153 120.83-73.717 144.48 20.653 33.837 43.241 65.285 67.74 62.679 21.495-2.287 21.57-36.337 48.688-64.788z" style="fill:none;stroke-dasharray:1, 20;stroke-linecap:round;stroke-linejoin:round;stroke-miterlimit:10;stroke-width:1.261;stroke:#ffffff"/>
</g>
<g transform="translate(1069.5 455.53)" style="stroke:#ffffff">
<path d="m0 0c12.729-15.771 3.805-139.31-35.47-137.5-21.737 1.001-73.829 118.39-62.766 139.08 15.216 28.465 34.874 54.403 56.263 52.466 19.135-1.732 22.156-29.494 41.973-54.048z" style="fill:none;stroke-dasharray:1, 20;stroke-linecap:round;stroke-linejoin:round;stroke-miterlimit:10;stroke-width:1.196;stroke:#ffffff"/>
</g>
<g transform="translate(1062.4 455.53)" style="stroke:#ffffff">
<path d="m0 0c8.969-14.456 1.974-133.79-28.228-132.63-18.51 0.71-59.445 115.9-51.817 133.69 9.875 23.022 26.509 43.53 44.786 42.254 16.776-1.171 22.57-22.857 35.259-43.309z" style="fill:none;stroke-dasharray:1, 20;stroke-linecap:round;stroke-linejoin:round;stroke-miterlimit:10;stroke-width:1.13;stroke:#ffffff"/>
</g>
<g transform="translate(1055.4 455.53)" style="stroke:#ffffff">
<path d="m0 0c4.912-13.298 0.142-128.31-20.987-127.76-15.283 0.394-44.902 113.36-40.866 128.29 4.731 17.503 18.143 32.671 33.308 32.043 14.418-0.597 22.585-16.435 28.545-32.57z" style="fill:none;stroke-dasharray:1, 20;stroke-linecap:round;stroke-linejoin:round;stroke-miterlimit:10;stroke-width:1.065;stroke:#ffffff"/>
</g>
<g transform="translate(1048.3 455.53)" style="stroke:#ffffff">
<path d="m0 0c0-12.057-1.688-122.9-13.745-122.9s-29.916 110.84-29.916 122.9 9.774 21.83 21.831 21.83c12.056 0 21.83-9.773 21.83-21.83z" style="fill:none;stroke-dasharray:1, 20;stroke-linecap:round;stroke-linejoin:round;stroke-miterlimit:10;stroke:#ffffff"/>
</g>
</g>
<g transform="translate(-.33373 16.54)" style="stroke-width:.26458" aria-label="CAPÍTULO 3">
<path d="m11.089 17.315q-0.61313 0-1.1331-0.20179-0.51223-0.20955-0.89253-0.58208-0.38029-0.38029-0.58984-0.89253-0.20179-0.51999-0.20179-1.1409 0-0.60537 0.21731-1.1176t0.59761-0.88477q0.38806-0.38029 0.90805-0.58984 0.52776-0.20955 1.1486-0.20955 0.38806 0 0.76059 0.10089 0.37253 0.1009 0.69074 0.30268 0.32597 0.19403 0.5588 0.46567l-0.80716 0.92357q-0.16298-0.17074-0.34925-0.29492-0.1785-0.13194-0.39582-0.20179t-0.46567-0.06985q-0.31044 0-0.58984 0.11642-0.27164 0.10866-0.48119 0.31821-0.20179 0.20179-0.31821 0.49671-0.11642 0.29492-0.11642 0.65969 0 0.35701 0.11642 0.65193 0.11642 0.28716 0.32597 0.49671 0.20955 0.20955 0.50447 0.31821 0.30268 0.10866 0.66746 0.10866 0.24836 0 0.47343-0.06985 0.22507-0.06985 0.41134-0.18627 0.19403-0.12418 0.34149-0.2794l0.63641 1.0089q-0.19403 0.21731-0.51999 0.38806-0.31821 0.17074-0.71402 0.27164-0.38806 0.09313-0.78387 0.09313z" style="fill:#ffffff"/>
<path d="m13.316 17.237 2.1498-5.4328h1.1176l2.1343 5.4328h-1.3349l-1.0245-2.7552q-0.06209-0.16298-0.12418-0.34925-0.06209-0.18627-0.12418-0.3803-0.06209-0.20179-0.12418-0.38806-0.05433-0.19403-0.09313-0.35701l0.23283-0.0078q-0.04657 0.19403-0.10866 0.38029-0.05433 0.18627-0.11642 0.37253-0.05433 0.17851-0.12418 0.36477-0.06985 0.17851-0.13194 0.37253l-1.0245 2.7474zm1.0245-1.04 0.41134-0.99342h2.4991l0.40358 0.99342z" style="fill:#ffffff"/>
<path d="m19.393 17.237v-5.4328h2.3439q0.51223 0 0.90805 0.23283 0.40358 0.23283 0.63641 0.63641 0.2406 0.40358 0.2406 0.90805 0 0.52776-0.2406 0.94686-0.23283 0.41134-0.63641 0.65193-0.39582 0.2406-0.90805 0.2406h-1.0245v1.8161zm1.2961-2.9725h0.86148q0.17074 0 0.31044-0.08537t0.22507-0.23283q0.08537-0.14746 0.08537-0.34149 0-0.20179-0.08537-0.34149t-0.22507-0.21731q-0.1397-0.07761-0.31044-0.07761h-0.86148z" style="fill:#ffffff"/>
<path d="m24.422 17.237v-1.1098h0.91581v-3.2131h-0.91581v-1.1098h3.1588v1.1098h-0.92357v3.2131h0.92357v1.1098zm0.89253-5.8053-0.28716-0.62089 1.6221-0.89253 0.42686 0.90805z" style="fill:#ffffff"/>
<path d="m30.018 17.237v-4.2686h-1.6143v-1.1642h4.5868v1.1642h-1.6531v4.2686z" style="fill:#ffffff"/>
<path d="m36.211 17.284q-0.67522 0-1.203-0.27164-0.52776-0.2794-0.83044-0.76059-0.29492-0.48119-0.29492-1.1021v-3.345h1.3349v3.2752q0 0.29492 0.13194 0.53552 0.13194 0.23283 0.35701 0.37253 0.22507 0.13194 0.50447 0.13194 0.29492 0 0.52-0.13194 0.23283-0.1397 0.37253-0.37253 0.1397-0.2406 0.1397-0.53552v-3.2752h1.2883v3.345q0 0.62089-0.30268 1.1021-0.29492 0.48119-0.82268 0.76059-0.52776 0.27164-1.1952 0.27164z" style="fill:#ffffff"/>
<path d="m39.859 17.237v-5.4328h1.3194v4.2686h2.4215v1.1642z" style="fill:#ffffff"/>
<path d="m46.906 17.315q-0.62089 0-1.1331-0.20955-0.51223-0.20955-0.89253-0.58984-0.38029-0.38029-0.58984-0.89253-0.20955-0.51223-0.20955-1.1254 0-0.61313 0.20955-1.1254t0.58984-0.89253q0.38029-0.38029 0.89253-0.58984 0.51223-0.20955 1.1254-0.20955 0.61313 0 1.1254 0.20955 0.51223 0.20955 0.89253 0.58984 0.38029 0.3803 0.58208 0.89253 0.20955 0.51223 0.20955 1.1254 0 0.60537-0.20955 1.1254-0.20179 0.51223-0.58208 0.89253-0.38029 0.3803-0.89253 0.58984-0.51223 0.20955-1.1176 0.20955zm-0.0078-1.2418q0.31821 0 0.58208-0.11642 0.27164-0.11642 0.46567-0.32597 0.20179-0.21731 0.31044-0.50447 0.10866-0.28716 0.10866-0.62865t-0.10866-0.62865q-0.10866-0.28716-0.31044-0.49671-0.19403-0.21731-0.46567-0.33373-0.26388-0.11642-0.58208-0.11642-0.3182 0-0.58984 0.11642-0.26388 0.11642-0.46567 0.33373-0.20179 0.20955-0.31044 0.49671-0.10089 0.28716-0.10089 0.62865t0.10089 0.63641q0.10866 0.28716 0.31044 0.49671 0.20179 0.20955 0.46567 0.32597 0.27164 0.11642 0.58984 0.11642z" style="fill:#ffffff"/>
<path d="m54.76 17.315q-0.65969 0-1.1564-0.27164-0.48895-0.2794-0.89253-0.95462l0.94686-0.61313q0.17074 0.27164 0.34925 0.43462 0.18627 0.16298 0.38029 0.24059 0.20179 0.06985 0.4191 0.06985t0.39582-0.09313q0.18627-0.1009 0.29492-0.2794 0.11642-0.17851 0.11642-0.40358 0-0.24059-0.10089-0.40358-0.09313-0.17074-0.2794-0.25612-0.17851-0.08537-0.43462-0.08537-0.11642 0-0.24836 0.03104-0.13194 0.02328-0.2794 0.06985t-0.30268 0.12418l-0.28716-0.76835 1.3194-1.4358 0.35701 0.19403-2.2662-0.04657v-1.1098h3.3373l0.24059 0.48119-1.7928 1.9248-0.31044-0.36477q0.06209-0.03104 0.20179-0.05433 0.14746-0.03104 0.2794-0.03104 0.36477 0 0.68298 0.13194 0.3182 0.13194 0.56656 0.36477 0.24836 0.23283 0.38806 0.55104 0.1397 0.31044 0.1397 0.66746 0 0.54328-0.2794 0.97014-0.27164 0.4191-0.74507 0.66746-0.46567 0.24836-1.04 0.24836z" style="fill:#ffffff"/>
</g>
<g transform="translate(.46715 -26.331)" style="fill:#ffffff;inline-size:66.063;stroke-width:.26458;white-space:pre" aria-label="Educação superior para acelerar a economia do conhecimento">
<path d="m7.5663 70.348v-3.9511h2.8335v0.8128h-1.8796v0.74507h1.7385v0.76764h-1.7385v0.81844h1.9812v0.80716z"/>
<path d="m12.824 70.354-0.10724-0.23142q-0.22578 0.14111-0.45156 0.21449-0.22578 0.06773-0.47413 0.06773-0.50236 0-0.77893-0.39511-0.27093-0.39511-0.27093-1.1402 0-0.5588 0.15804-0.92004 0.16369-0.36689 0.49107-0.54751 0.32738-0.18062 0.82973-0.18062 0.11289 0 0.23707 0.01129 0.12982 0.0056 0.24836 0.02822v-1.0894h0.93133v4.1825zm-0.11853-0.87489v-1.524q-0.11289-0.03387-0.22013-0.04515-0.1016-0.01693-0.2032-0.01693-0.19756 0-0.32738 0.08467-0.12982 0.08467-0.19191 0.27658-0.06209 0.19191-0.06209 0.52493 0 0.3048 0.0508 0.49671 0.05644 0.18627 0.15804 0.27658 0.1016 0.08467 0.24836 0.08467 0.08467 0 0.16933-0.01693 0.09031-0.01693 0.18062-0.0508 0.09596-0.03951 0.19756-0.09031z"/>
<path d="m15.059 70.405q-0.27093 0-0.47413-0.09596-0.2032-0.1016-0.32173-0.31044-0.11289-0.20884-0.11289-0.51929v-2.2013h0.92569v1.9812q0 0.19191 0.09596 0.28787 0.09596 0.09031 0.26529 0.09031 0.09031 0 0.16933-0.01693 0.08467-0.01693 0.16369-0.0508 0.08467-0.03387 0.18062-0.07902v-2.2126h0.92569v2.1167q0 0.08467 0.01693 0.13547 0.01693 0.04516 0.0508 0.06773 0.03387 0.02258 0.07902 0.02258 0.06209 0 0.11853-0.02822l0.07902 0.66604q-0.07338 0.03951-0.16369 0.07338-0.09031 0.03387-0.2032 0.0508-0.10724 0.02258-0.22013 0.02258-0.20884 0-0.34996-0.07902-0.13547-0.08467-0.22013-0.23142-0.16369 0.09596-0.32173 0.16933-0.15804 0.06773-0.32738 0.1016-0.16369 0.03951-0.3556 0.03951z"/>
<path d="m17.355 68.858q0-0.54751 0.18062-0.90876 0.18627-0.36124 0.54187-0.54187 0.3556-0.18627 0.87489-0.18627 0.18062 0 0.36124 0.01693 0.18627 0.01129 0.3556 0.03951 0.16933 0.02258 0.3048 0.06209l-0.12982 0.76764q-0.13547-0.02822-0.27093-0.04515-0.13547-0.01693-0.26529-0.02822t-0.254-0.01129q-0.24271 0-0.41204 0.09031-0.16369 0.08467-0.24836 0.26529-0.07902 0.17498-0.07902 0.45156 0 0.26529 0.08467 0.44027 0.09031 0.16933 0.25964 0.25964 0.17498 0.08467 0.41204 0.08467 0.13547 0 0.26529-0.01129 0.13547-0.01129 0.27093-0.03387 0.13547-0.02258 0.28222-0.0508l0.14111 0.73378q-0.24271 0.06773-0.55316 0.10724-0.31044 0.04516-0.6096 0.04516-0.75636 0-1.1345-0.37818-0.37818-0.38382-0.37818-1.1684z"/>
<path d="m20.224 69.507q0-0.27658 0.1016-0.4572 0.10724-0.18062 0.32173-0.28787 0.22013-0.10724 0.55316-0.16369 0.33302-0.06209 0.79022-0.09596v-0.18627q0-0.16933-0.14111-0.24836-0.14111-0.07902-0.4064-0.07902-0.11853 0-0.27093 0.01129-0.1524 0.01129-0.31609 0.03951-0.15804 0.02822-0.32738 0.07902l-0.14676-0.72249q0.254-0.07902 0.5588-0.12418 0.3048-0.0508 0.56444-0.0508 0.49671 0 0.80151 0.12418 0.31044 0.11853 0.45156 0.36124 0.14676 0.24271 0.14676 0.59831v1.0724q0 0.14111 0.03951 0.18627 0.04515 0.04516 0.1016 0.04516 0.02822 0 0.06209 0 0.03951-0.0056 0.06773-0.01693l0.07338 0.6604q-0.11289 0.06773-0.254 0.10724-0.13547 0.04516-0.3048 0.04516-0.23707 0-0.38947-0.08467-0.14676-0.09031-0.22013-0.27093-0.14676 0.10724-0.29916 0.19191-0.14676 0.07902-0.32173 0.11853-0.16933 0.04516-0.38382 0.04516-0.19191 0-0.34996-0.06209-0.1524-0.06209-0.27093-0.17498-0.11289-0.11853-0.17498-0.28222-0.05644-0.16369-0.05644-0.37818zm0.93133-0.05644q0 0.18062 0.07902 0.26529 0.07902 0.08467 0.20884 0.08467 0.09031 0 0.18627-0.02822 0.1016-0.02822 0.19756-0.07902 0.09596-0.05644 0.16369-0.12418v-0.57573q-0.20884 0.01693-0.36689 0.04516-0.1524 0.02258-0.25964 0.07338-0.10724 0.0508-0.15804 0.13547-0.0508 0.07902-0.0508 0.2032z"/>
<path d="m23.365 68.858q0-0.54751 0.18062-0.90876 0.18627-0.36124 0.54187-0.54187 0.3556-0.18627 0.87489-0.18627 0.18062 0 0.36124 0.01693 0.18627 0.01129 0.3556 0.03951 0.16933 0.02258 0.3048 0.06209l-0.12982 0.76764q-0.13547-0.02822-0.27093-0.04515t-0.26529-0.02822-0.254-0.01129q-0.24271 0-0.41204 0.09031-0.16369 0.08467-0.24836 0.26529-0.07902 0.17498-0.07902 0.45156 0 0.26529 0.08467 0.44027 0.09031 0.16933 0.25964 0.25964 0.17498 0.08467 0.41204 0.08467 0.13547 0 0.26529-0.01129 0.13547-0.01129 0.27093-0.03387 0.13547-0.02258 0.28222-0.0508l0.14111 0.73378q-0.24271 0.06773-0.55316 0.10724-0.31044 0.04516-0.6096 0.04516-0.75636 0-1.1345-0.37818-0.37818-0.38382-0.37818-1.1684zm0.89182 2.1054q0.07902 0.02258 0.14111 0.03387 0.06773 0.01129 0.11853 0.01129 0.12982 0 0.2032-0.06773 0.07902-0.06209 0.07902-0.18627 0-0.06209-0.02822-0.14111-0.02822-0.07338-0.07902-0.1524-0.04516-0.07902-0.11289-0.14676h0.66604q0.06773 0.07902 0.11853 0.18627 0.0508 0.10724 0.07902 0.22013t0.02822 0.22013q0 0.17498-0.07338 0.32173-0.06773 0.1524-0.23142 0.23707-0.15804 0.09031-0.43462 0.09031-0.10724 0-0.23142-0.01693-0.12418-0.01693-0.25964-0.06209z"/>
<path d="m26.234 69.507q0-0.27658 0.1016-0.4572 0.10724-0.18062 0.32173-0.28787 0.22013-0.10724 0.55316-0.16369 0.33302-0.06209 0.79022-0.09596v-0.18627q0-0.16933-0.14111-0.24836-0.14111-0.07902-0.4064-0.07902-0.11853 0-0.27093 0.01129t-0.31609 0.03951q-0.15804 0.02822-0.32738 0.07902l-0.14676-0.72249q0.254-0.07902 0.5588-0.12418 0.3048-0.0508 0.56444-0.0508 0.49671 0 0.80151 0.12418 0.31044 0.11853 0.45156 0.36124 0.14676 0.24271 0.14676 0.59831v1.0724q0 0.14111 0.03951 0.18627 0.04516 0.04516 0.1016 0.04516 0.02822 0 0.06209 0 0.03951-0.0056 0.06773-0.01693l0.07338 0.6604q-0.11289 0.06773-0.254 0.10724-0.13547 0.04516-0.3048 0.04516-0.23707 0-0.38947-0.08467-0.14676-0.09031-0.22013-0.27093-0.14676 0.10724-0.29916 0.19191-0.14676 0.07902-0.32173 0.11853-0.16933 0.04516-0.38382 0.04516-0.19191 0-0.34996-0.06209-0.1524-0.06209-0.27093-0.17498-0.11289-0.11853-0.17498-0.28222-0.05644-0.16369-0.05644-0.37818zm0.93133-0.05644q0 0.18062 0.07902 0.26529 0.07902 0.08467 0.20884 0.08467 0.09031 0 0.18627-0.02822 0.1016-0.02822 0.19756-0.07902 0.09596-0.05644 0.16369-0.12418v-0.57573q-0.20884 0.01693-0.36689 0.04516-0.1524 0.02258-0.25964 0.07338t-0.15804 0.13547q-0.0508 0.07902-0.0508 0.2032zm-0.53622-2.4836q-0.01129-0.06773-0.01693-0.13547 0-0.06773 0-0.12418 0-0.33867 0.14676-0.50236t0.45156-0.16369q0.12418 0 0.23707 0.03951 0.11853 0.03951 0.22013 0.09596 0.10724 0.0508 0.19756 0.09031 0.09031 0.03951 0.16933 0.03951 0.0508 0 0.08467-0.02822 0.03951-0.02822 0.05644-0.07338 0.02258-0.04516 0.02258-0.09596 0-0.01693-0.0056-0.04516 0-0.02822 0-0.04516h0.48542q0.01129 0.06773 0.01129 0.13547 0.0056 0.06209 0.0056 0.12418 0 0.33867-0.14676 0.508-0.14676 0.16369-0.45156 0.16369-0.11289 0-0.23142-0.03951-0.11289-0.03951-0.22013-0.09031-0.10724-0.05644-0.20884-0.09596-0.09596-0.03951-0.16369-0.03951-0.07902 0-0.12418 0.0508-0.03951 0.0508-0.03951 0.13547 0 0.02258 0 0.0508 0.0056 0.02822 0.0056 0.04516z"/>
<path d="m29.375 68.807q0-0.37253 0.07338-0.66604t0.24271-0.49671q0.16933-0.20884 0.4572-0.31609 0.28787-0.10724 0.71684-0.10724 0.42898 0 0.71684 0.10724 0.28787 0.10724 0.4572 0.31609 0.16933 0.2032 0.24271 0.49671 0.07338 0.29351 0.07338 0.66604 0 0.37818-0.07902 0.67733-0.07902 0.29916-0.254 0.50236-0.17498 0.2032-0.46284 0.31044-0.28222 0.10724-0.69427 0.10724t-0.69991-0.10724q-0.28222-0.10724-0.4572-0.31044-0.17498-0.2032-0.254-0.50236-0.07902-0.29916-0.07902-0.67733zm0.95391 0q0 0.33867 0.0508 0.53622 0.05644 0.19756 0.17498 0.28222 0.11853 0.07902 0.31044 0.07902 0.19756 0 0.31044-0.07902 0.11853-0.08467 0.17498-0.28222 0.05644-0.19756 0.05644-0.53622t-0.0508-0.53058-0.16933-0.27093q-0.11853-0.08467-0.32173-0.08467t-0.32173 0.08467q-0.11289 0.07902-0.16369 0.27093-0.0508 0.19191-0.0508 0.53058z"/>
<path d="m34.117 70.23 0.1016-0.66604q0.1016 0.03387 0.23142 0.06773 0.13547 0.02822 0.27658 0.0508t0.27658 0.03387q0.14111 0.01129 0.25964 0.01129 0.22013 0 0.32173-0.06209 0.10724-0.06773 0.10724-0.18627 0-0.07902-0.05644-0.12418-0.0508-0.0508-0.1524-0.09031t-0.24271-0.06773q-0.14111-0.03387-0.31044-0.07902-0.19191-0.03951-0.33302-0.11289-0.14111-0.07902-0.24271-0.18627-0.09595-0.11289-0.14676-0.254-0.04516-0.14676-0.04516-0.32738 0-0.508 0.32173-0.762t0.95391-0.254q0.19191 0 0.36689 0.02258 0.17498 0.01693 0.33302 0.0508 0.15804 0.03387 0.28787 0.08467l-0.11289 0.67733q-0.12418-0.04516-0.25964-0.07338-0.12982-0.02822-0.28222-0.04516-0.14676-0.01693-0.33302-0.01693-0.2032 0-0.3048 0.05644-0.1016 0.05645-0.1016 0.17498 0 0.07338 0.03951 0.11853 0.03951 0.03951 0.11853 0.07338 0.07902 0.02822 0.19191 0.05644 0.11853 0.02258 0.27093 0.05645 0.2032 0.03951 0.37253 0.10724 0.17498 0.06773 0.29916 0.17498 0.12418 0.1016 0.19191 0.25964 0.07338 0.15804 0.07338 0.38947 0 0.22578-0.07338 0.39511-0.06773 0.16933-0.19191 0.28787-0.12418 0.11853-0.29351 0.19191-0.16369 0.07338-0.36689 0.10724-0.2032 0.03387-0.41769 0.03387-0.2032 0-0.39511-0.02258-0.19191-0.01693-0.37253-0.0508-0.18062-0.03951-0.36124-0.1016z"/>
<path d="m37.829 70.405q-0.27093 0-0.47413-0.09596-0.2032-0.1016-0.32173-0.31044-0.11289-0.20884-0.11289-0.51929v-2.2013h0.92569v1.9812q0 0.19191 0.09596 0.28787 0.09596 0.09031 0.26529 0.09031 0.09031 0 0.16933-0.01693 0.08467-0.01693 0.16369-0.0508 0.08467-0.03387 0.18062-0.07902v-2.2126h0.92569v2.1167q0 0.08467 0.01693 0.13547 0.01693 0.04516 0.0508 0.06773 0.03387 0.02258 0.07902 0.02258 0.06209 0 0.11853-0.02822l0.07902 0.66604q-0.07338 0.03951-0.16369 0.07338-0.09031 0.03387-0.2032 0.0508-0.10724 0.02258-0.22013 0.02258-0.20884 0-0.34996-0.07902-0.13547-0.08467-0.22013-0.23142-0.16369 0.09596-0.32173 0.16933-0.15804 0.06773-0.32738 0.1016-0.16369 0.03951-0.3556 0.03951z"/>
<path d="m40.261 71.533v-4.2672h0.83538l0.02822 0.25964q0.254-0.15804 0.49107-0.23142 0.23707-0.07338 0.48542-0.07338 0.508 0 0.77893 0.39511t0.27093 1.1402q0 0.55316-0.16369 0.92004-0.15804 0.36689-0.48542 0.54751-0.32738 0.18062-0.82973 0.18062-0.10724 0-0.23142-0.01129t-0.254-0.03387v1.174zm1.349-1.8006q0.19756 0 0.32738-0.08467t0.19191-0.27658q0.06209-0.19756 0.06209-0.52493 0-0.31609-0.0508-0.50236-0.0508-0.18627-0.1524-0.27093-0.1016-0.09031-0.254-0.09031-0.08467 0-0.17498 0.01693-0.08467 0.01693-0.17498 0.0508-0.09031 0.03387-0.19756 0.09031v1.524q0.11289 0.03387 0.22013 0.0508 0.10724 0.01693 0.2032 0.01693z"/>
<path d="m44.952 70.405q-0.36124 0-0.63782-0.08467-0.27658-0.09031-0.47413-0.27093-0.19191-0.18627-0.29351-0.47413-0.1016-0.29351-0.1016-0.69427 0-0.4572 0.11289-0.77329 0.11853-0.31609 0.32173-0.51364 0.20884-0.19756 0.49107-0.28222 0.28222-0.09031 0.61524-0.09031 0.67733 0 0.99342 0.33302 0.32173 0.33302 0.32173 1.0837 0 0.05644-0.0056 0.14676 0 0.08467-0.0056 0.16933-0.14111 0.01129-0.34431 0.02822t-0.45156 0.03387q-0.24836 0.01693-0.52493 0.02822-0.27658 0.01129-0.56444 0.01693-0.0056 0.01693-0.0056 0.03387 0 0.01693 0 0.03951 0 0.18627 0.07338 0.31044 0.07902 0.11853 0.23707 0.18062 0.15804 0.05644 0.41204 0.05644 0.15804 0 0.33302-0.01693 0.17498-0.01693 0.3556-0.04516 0.18062-0.03387 0.36124-0.07338l0.10724 0.66604q-0.19756 0.06209-0.4064 0.10724-0.20884 0.04516-0.43462 0.06209-0.22578 0.02258-0.48542 0.02258zm-0.54187-1.8909q0.14676 0 0.29351-0.0056t0.27658-0.01129q0.12982-0.01129 0.23142-0.01693 0.1016-0.0056 0.16933-0.0056-0.0056-0.22578-0.05644-0.3556-0.0508-0.13547-0.14676-0.19191-0.09596-0.05644-0.24271-0.05644-0.1016 0-0.18627 0.02822-0.08467 0.02822-0.15804 0.1016-0.06773 0.06773-0.11853 0.19756-0.04516 0.12418-0.06209 0.31609z"/>
<path d="m47.554 67.278v0.3556q0.15804-0.14676 0.28787-0.23707 0.12982-0.09031 0.26529-0.12982 0.13547-0.04516 0.29916-0.04516 0.09031 0 0.19191 0.01693 0.1016 0.01129 0.2032 0.04515l-0.14676 0.83538q-0.1016-0.02258-0.2032-0.03387-0.1016-0.01693-0.18627-0.01693-0.14676 0-0.29916 0.0508-0.1524 0.04516-0.32738 0.16933v2.0602h-0.92004v-3.0706z"/>
<path d="m49.546 66.95q-0.28222 0-0.41769-0.11289-0.12982-0.11289-0.12982-0.34996 0-0.23707 0.12982-0.34996 0.13547-0.11289 0.41769-0.11289t0.41204 0.11289 0.12982 0.34996q0 0.23707-0.12982 0.34996-0.12418 0.11289-0.41204 0.11289zm-0.46284 3.398v-3.0706h0.92004v3.0706z"/>
<path d="m50.41 68.807q0-0.37253 0.07338-0.66604t0.24271-0.49671q0.16933-0.20884 0.4572-0.31609 0.28787-0.10724 0.71684-0.10724 0.42898 0 0.71684 0.10724 0.28787 0.10724 0.4572 0.31609 0.16933 0.2032 0.24271 0.49671 0.07338 0.29351 0.07338 0.66604 0 0.37818-0.07902 0.67733-0.07902 0.29916-0.254 0.50236-0.17498 0.2032-0.46284 0.31044-0.28222 0.10724-0.69427 0.10724t-0.69991-0.10724q-0.28222-0.10724-0.4572-0.31044-0.17498-0.2032-0.254-0.50236-0.07902-0.29916-0.07902-0.67733zm0.95391 0q0 0.33867 0.0508 0.53622 0.05644 0.19756 0.17498 0.28222 0.11853 0.07902 0.31044 0.07902 0.19756 0 0.31044-0.07902 0.11853-0.08467 0.17498-0.28222 0.05644-0.19756 0.05644-0.53622t-0.0508-0.53058-0.16933-0.27093q-0.11853-0.08467-0.32173-0.08467t-0.32173 0.08467q-0.11289 0.07902-0.16369 0.27093-0.0508 0.19191-0.0508 0.53058z"/>
<path d="m54.632 67.278v0.3556q0.15804-0.14676 0.28787-0.23707 0.12982-0.09031 0.26529-0.12982 0.13547-0.04516 0.29916-0.04516 0.09031 0 0.19191 0.01693 0.1016 0.01129 0.2032 0.04515l-0.14676 0.83538q-0.1016-0.02258-0.2032-0.03387-0.1016-0.01693-0.18627-0.01693-0.14676 0-0.29916 0.0508-0.1524 0.04516-0.32738 0.16933v2.0602h-0.92004v-3.0706z"/>
<path d="m7.6115 78.786v-4.2333h0.42898l0.016933 0.3048q0.25964-0.17498 0.50236-0.254 0.24836-0.08467 0.49671-0.08467 0.48542 0 0.74507 0.38947 0.26529 0.38382 0.26529 1.1063 0 0.56444-0.14676 0.93133-0.14676 0.36124-0.45156 0.53622-0.29916 0.17498-0.762 0.17498-0.13547 0-0.29351-0.01693-0.1524-0.01693-0.32738-0.0508v1.1966zm1.0555-1.4845q0.31609 0 0.51364-0.11853 0.2032-0.12418 0.29916-0.40076 0.1016-0.27658 0.1016-0.72813 0-0.37818-0.084667-0.63218-0.079022-0.254-0.23707-0.37818-0.1524-0.12982-0.37818-0.12982-0.12418 0-0.254 0.02822-0.12418 0.02822-0.25964 0.09031-0.12982 0.05644-0.28787 0.16369v2.0264q0.18062 0.03951 0.32173 0.06209 0.14111 0.01693 0.26529 0.01693z"/>
<path d="m10.386 76.873q0-0.27093 0.11289-0.44591t0.34431-0.27658q0.23142-0.10724 0.57009-0.16369 0.33867-0.06209 0.78458-0.1016v-0.42333q0-0.25964-0.16933-0.39511-0.16933-0.14111-0.508-0.14111-0.11289 0-0.254 0.01129t-0.29351 0.03951-0.31609 0.07902l-0.08467-0.38382q0.24271-0.07338 0.49671-0.11289 0.254-0.03951 0.47978-0.03951 0.37253 0 0.62089 0.10724 0.254 0.1016 0.37818 0.31044 0.12982 0.20884 0.12982 0.51929v1.4676q0 0.18627 0.0508 0.254 0.05645 0.06209 0.14676 0.06209 0.03387 0 0.07338-0.0056t0.08467-0.02258l0.0508 0.34996q-0.08467 0.04516-0.18062 0.06773-0.09031 0.02822-0.19191 0.02822-0.2032 0-0.32173-0.1016-0.11853-0.10724-0.1524-0.32173-0.13547 0.10724-0.3048 0.20884-0.16369 0.09596-0.36124 0.15804-0.19191 0.05644-0.42333 0.05644-0.17498 0-0.31609-0.0508-0.13547-0.0508-0.23707-0.14676-0.1016-0.1016-0.15804-0.24836-0.0508-0.14676-0.0508-0.33867zm0.47978-0.03951q0 0.24271 0.11853 0.36689 0.12418 0.11853 0.32738 0.11853 0.15804 0 0.31609-0.0508 0.15804-0.0508 0.3048-0.13547 0.1524-0.09031 0.26529-0.2032v-0.762q-0.29916 0.02822-0.54751 0.06773-0.24271 0.03387-0.42333 0.10724-0.17498 0.07338-0.27093 0.19191-0.09031 0.11853-0.09031 0.29916z"/>
<path d="m13.9 74.576v0.37253q0.16933-0.1524 0.31609-0.24271 0.14676-0.09596 0.29916-0.14111 0.1524-0.04516 0.31609-0.04516 0.11853 0 0.23142 0.01693t0.20884 0.04516l-0.07902 0.42898q-0.1016-0.02822-0.21449-0.03951-0.10724-0.01693-0.2032-0.01693-0.19756 0-0.4064 0.08467-0.2032 0.07902-0.42898 0.28787v2.2747h-0.46849v-3.0254z"/>
<path d="m15.296 76.873q0-0.27093 0.11289-0.44591t0.34431-0.27658q0.23142-0.10724 0.57009-0.16369 0.33867-0.06209 0.78458-0.1016v-0.42333q0-0.25964-0.16933-0.39511-0.16933-0.14111-0.508-0.14111-0.11289 0-0.254 0.01129t-0.29351 0.03951-0.31609 0.07902l-0.08467-0.38382q0.24271-0.07338 0.49671-0.11289 0.254-0.03951 0.47978-0.03951 0.37253 0 0.62089 0.10724 0.254 0.1016 0.37818 0.31044 0.12982 0.20884 0.12982 0.51929v1.4676q0 0.18627 0.0508 0.254 0.05644 0.06209 0.14676 0.06209 0.03387 0 0.07338-0.0056t0.08467-0.02258l0.0508 0.34996q-0.08467 0.04516-0.18062 0.06773-0.09031 0.02822-0.19191 0.02822-0.2032 0-0.32173-0.1016-0.11853-0.10724-0.1524-0.32173-0.13547 0.10724-0.3048 0.20884-0.16369 0.09596-0.36124 0.15804-0.19191 0.05644-0.42333 0.05644-0.17498 0-0.31609-0.0508-0.13547-0.0508-0.23707-0.14676-0.1016-0.1016-0.15804-0.24836-0.0508-0.14676-0.0508-0.33867zm0.47978-0.03951q0 0.24271 0.11853 0.36689 0.12418 0.11853 0.32738 0.11853 0.15804 0 0.31609-0.0508t0.3048-0.13547q0.1524-0.09031 0.26529-0.2032v-0.762q-0.29916 0.02822-0.54751 0.06773-0.24271 0.03387-0.42333 0.10724-0.17498 0.07338-0.27093 0.19191-0.09031 0.11853-0.09031 0.29916z"/>
<path d="m19.699 76.873q0-0.27093 0.11289-0.44591 0.11289-0.17498 0.34431-0.27658 0.23142-0.10724 0.57009-0.16369 0.33867-0.06209 0.78458-0.1016v-0.42333q0-0.25964-0.16933-0.39511-0.16933-0.14111-0.508-0.14111-0.11289 0-0.254 0.01129t-0.29351 0.03951q-0.1524 0.02822-0.31609 0.07902l-0.08467-0.38382q0.24271-0.07338 0.49671-0.11289 0.254-0.03951 0.47978-0.03951 0.37253 0 0.62089 0.10724 0.254 0.1016 0.37818 0.31044 0.12982 0.20884 0.12982 0.51929v1.4676q0 0.18627 0.0508 0.254 0.05645 0.06209 0.14676 0.06209 0.03387 0 0.07338-0.0056t0.08467-0.02258l0.0508 0.34996q-0.08467 0.04516-0.18062 0.06773-0.09031 0.02822-0.19191 0.02822-0.2032 0-0.32173-0.1016-0.11853-0.10724-0.1524-0.32173-0.13547 0.10724-0.3048 0.20884-0.16369 0.09596-0.36124 0.15804-0.19191 0.05644-0.42333 0.05644-0.17498 0-0.31609-0.0508-0.13547-0.0508-0.23707-0.14676-0.1016-0.1016-0.15804-0.24836-0.0508-0.14676-0.0508-0.33867zm0.47978-0.03951q0 0.24271 0.11853 0.36689 0.12418 0.11853 0.32738 0.11853 0.15804 0 0.31609-0.0508 0.15804-0.0508 0.3048-0.13547 0.1524-0.09031 0.26529-0.2032v-0.762q-0.29916 0.02822-0.54751 0.06773-0.24271 0.03387-0.42333 0.10724-0.17498 0.07338-0.27093 0.19191-0.09031 0.11853-0.09031 0.29916z"/>
<path d="m22.597 76.133q0-0.54751 0.16369-0.90311 0.16369-0.36124 0.47978-0.53622 0.32173-0.17498 0.77329-0.17498 0.14676 0 0.3048 0.01693 0.15804 0.01129 0.31044 0.03387 0.15804 0.02258 0.28222 0.06209l-0.06773 0.39511q-0.12418-0.02822-0.25964-0.04516-0.13547-0.02258-0.27093-0.03387-0.13547-0.01693-0.25964-0.01693-0.31044 0-0.53058 0.13547-0.21449 0.12982-0.32738 0.39511-0.11289 0.25964-0.11289 0.67169 0 0.37818 0.11289 0.62653 0.11289 0.24271 0.33302 0.36689 0.22013 0.11853 0.53058 0.11853 0.12982 0 0.27093-0.01129t0.28222-0.03387q0.14676-0.02822 0.27658-0.05644l0.07338 0.38382q-0.2032 0.05644-0.47978 0.09031-0.27093 0.03951-0.51929 0.03951-0.67733 0-1.0216-0.37253t-0.34431-1.1515z"/>
<path d="m26.56 77.657q-0.31044 0-0.55316-0.08467t-0.41204-0.26529q-0.16369-0.18062-0.254-0.46284-0.08467-0.28222-0.08467-0.67733 0-0.4572 0.1016-0.77329 0.10724-0.32173 0.29916-0.51364t0.44027-0.27658q0.254-0.08467 0.55316-0.08467 0.57573 0 0.85796 0.31044 0.28222 0.3048 0.28222 0.99342 0 0.03387-0.0056 0.09596 0 0.06209-0.0056 0.11853-0.11853 0.0056-0.32173 0.02258-0.19756 0.01693-0.46284 0.03387-0.26529 0.01693-0.58138 0.02822-0.31609 0.01129-0.66604 0.01693-0.0056 0.02822-0.0056 0.05645 0 0.02822 0 0.06209 0 0.36689 0.1016 0.59267 0.10724 0.22013 0.3048 0.32173 0.2032 0.1016 0.49107 0.1016 0.18062 0 0.36689-0.01693 0.18627-0.02258 0.3556-0.05645 0.17498-0.03387 0.32173-0.06773l0.06209 0.3556q-0.1524 0.0508-0.34431 0.09031-0.18627 0.03951-0.39511 0.05644-0.20884 0.02258-0.44591 0.02258zm-0.80716-1.8457q0.27093 0 0.51929-0.0056 0.254-0.01129 0.46284-0.02258 0.21449-0.01129 0.36124-0.02258 0.14676-0.01129 0.21449-0.01693-0.0056-0.31609-0.07902-0.508-0.07338-0.19191-0.22578-0.27658-0.1524-0.09031-0.38947-0.09031-0.14676 0-0.28787 0.04516-0.14111 0.03951-0.26529 0.14676-0.11853 0.1016-0.2032 0.28787-0.07902 0.18062-0.10724 0.46284z"/>
<path d="m28.803 73.424v3.3415q0 0.19756 0.03951 0.3048 0.04516 0.1016 0.11853 0.13547 0.07902 0.03387 0.16933 0.03387 0.06209 0 0.12982-0.01129 0.07338-0.01129 0.1524-0.03951l0.0508 0.37818q-0.09596 0.03951-0.21449 0.06209-0.11853 0.02822-0.24271 0.02822-0.20884 0-0.36124-0.07338t-0.23142-0.25964q-0.07902-0.18627-0.07902-0.51929v-3.381z"/>
<path d="m30.937 77.657q-0.31044 0-0.55316-0.08467t-0.41204-0.26529q-0.16369-0.18062-0.254-0.46284-0.08467-0.28222-0.08467-0.67733 0-0.4572 0.1016-0.77329 0.10724-0.32173 0.29916-0.51364t0.44027-0.27658q0.254-0.08467 0.55316-0.08467 0.57573 0 0.85796 0.31044 0.28222 0.3048 0.28222 0.99342 0 0.03387-0.0056 0.09596 0 0.06209-0.0056 0.11853-0.11853 0.0056-0.32173 0.02258-0.19756 0.01693-0.46284 0.03387-0.26529 0.01693-0.58138 0.02822-0.31609 0.01129-0.66604 0.01693-0.0056 0.02822-0.0056 0.05645 0 0.02822 0 0.06209 0 0.36689 0.1016 0.59267 0.10724 0.22013 0.3048 0.32173 0.2032 0.1016 0.49107 0.1016 0.18062 0 0.36689-0.01693 0.18627-0.02258 0.3556-0.05645 0.17498-0.03387 0.32173-0.06773l0.06209 0.3556q-0.1524 0.0508-0.34431 0.09031-0.18627 0.03951-0.39511 0.05644-0.20884 0.02258-0.44591 0.02258zm-0.80716-1.8457q0.27093 0 0.51929-0.0056 0.254-0.01129 0.46284-0.02258 0.21449-0.01129 0.36124-0.02258 0.14676-0.01129 0.21449-0.01693-0.0056-0.31609-0.07902-0.508-0.07338-0.19191-0.22578-0.27658-0.1524-0.09031-0.38947-0.09031-0.14676 0-0.28787 0.04516-0.14111 0.03951-0.26529 0.14676-0.11853 0.1016-0.2032 0.28787-0.07902 0.18062-0.10724 0.46284z"/>
<path d="m33.144 74.576v0.37253q0.16933-0.1524 0.31609-0.24271 0.14676-0.09596 0.29916-0.14111 0.1524-0.04516 0.31609-0.04516 0.11853 0 0.23142 0.01693 0.11289 0.01693 0.20884 0.04516l-0.07902 0.42898q-0.1016-0.02822-0.21449-0.03951-0.10724-0.01693-0.2032-0.01693-0.19756 0-0.4064 0.08467-0.2032 0.07902-0.42898 0.28787v2.2747h-0.46849v-3.0254z"/>
<path d="m34.54 76.873q0-0.27093 0.11289-0.44591 0.11289-0.17498 0.34431-0.27658 0.23142-0.10724 0.57009-0.16369 0.33867-0.06209 0.78458-0.1016v-0.42333q0-0.25964-0.16933-0.39511-0.16933-0.14111-0.508-0.14111-0.11289 0-0.254 0.01129t-0.29351 0.03951-0.31609 0.07902l-0.08467-0.38382q0.24271-0.07338 0.49671-0.11289 0.254-0.03951 0.47978-0.03951 0.37253 0 0.62089 0.10724 0.254 0.1016 0.37818 0.31044 0.12982 0.20884 0.12982 0.51929v1.4676q0 0.18627 0.0508 0.254 0.05644 0.06209 0.14676 0.06209 0.03387 0 0.07338-0.0056t0.08467-0.02258l0.0508 0.34996q-0.08467 0.04516-0.18062 0.06773-0.09031 0.02822-0.19191 0.02822-0.2032 0-0.32173-0.1016-0.11853-0.10724-0.1524-0.32173-0.13547 0.10724-0.3048 0.20884-0.16369 0.09596-0.36124 0.15804-0.19191 0.05644-0.42333 0.05644-0.17498 0-0.31609-0.0508-0.13547-0.0508-0.23707-0.14676-0.1016-0.1016-0.15804-0.24836-0.0508-0.14676-0.0508-0.33867zm0.47978-0.03951q0 0.24271 0.11853 0.36689 0.12418 0.11853 0.32738 0.11853 0.15804 0 0.31609-0.0508 0.15804-0.0508 0.3048-0.13547 0.1524-0.09031 0.26529-0.2032v-0.762q-0.29916 0.02822-0.54751 0.06773-0.24271 0.03387-0.42333 0.10724-0.17498 0.07338-0.27093 0.19191-0.09031 0.11853-0.09031 0.29916z"/>
<path d="m38.055 74.576v0.37253q0.16933-0.1524 0.31609-0.24271 0.14676-0.09596 0.29916-0.14111 0.1524-0.04516 0.31609-0.04516 0.11853 0 0.23142 0.01693t0.20884 0.04516l-0.07902 0.42898q-0.1016-0.02822-0.21449-0.03951-0.10724-0.01693-0.2032-0.01693-0.19756 0-0.4064 0.08467-0.2032 0.07902-0.42898 0.28787v2.2747h-0.46849v-3.0254z"/>
<path d="m41.131 76.873q0-0.27093 0.11289-0.44591t0.34431-0.27658q0.23142-0.10724 0.57009-0.16369 0.33867-0.06209 0.78458-0.1016v-0.42333q0-0.25964-0.16933-0.39511-0.16933-0.14111-0.508-0.14111-0.11289 0-0.254 0.01129t-0.29351 0.03951-0.31609 0.07902l-0.08467-0.38382q0.24271-0.07338 0.49671-0.11289 0.254-0.03951 0.47978-0.03951 0.37253 0 0.62089 0.10724 0.254 0.1016 0.37818 0.31044 0.12982 0.20884 0.12982 0.51929v1.4676q0 0.18627 0.0508 0.254 0.05644 0.06209 0.14676 0.06209 0.03387 0 0.07338-0.0056t0.08467-0.02258l0.0508 0.34996q-0.08467 0.04516-0.18062 0.06773-0.09031 0.02822-0.19191 0.02822-0.2032 0-0.32173-0.1016-0.11853-0.10724-0.1524-0.32173-0.13547 0.10724-0.3048 0.20884-0.16369 0.09596-0.36124 0.15804-0.19191 0.05644-0.42333 0.05644-0.17498 0-0.31609-0.0508-0.13547-0.0508-0.23707-0.14676-0.1016-0.1016-0.15804-0.24836-0.0508-0.14676-0.0508-0.33867zm0.47978-0.03951q0 0.24271 0.11853 0.36689 0.12418 0.11853 0.32738 0.11853 0.15804 0 0.31609-0.0508 0.15804-0.0508 0.3048-0.13547 0.1524-0.09031 0.26529-0.2032v-0.762q-0.29916 0.02822-0.54751 0.06773-0.24271 0.03387-0.42333 0.10724-0.17498 0.07338-0.27093 0.19191-0.09031 0.11853-0.09031 0.29916z"/>
<path d="m46.883 77.657q-0.31044 0-0.55316-0.08467t-0.41204-0.26529q-0.16369-0.18062-0.254-0.46284-0.08467-0.28222-0.08467-0.67733 0-0.4572 0.1016-0.77329 0.10724-0.32173 0.29916-0.51364t0.44027-0.27658q0.254-0.08467 0.55316-0.08467 0.57573 0 0.85796 0.31044 0.28222 0.3048 0.28222 0.99342 0 0.03387-0.0056 0.09596 0 0.06209-0.0056 0.11853-0.11853 0.0056-0.32173 0.02258-0.19756 0.01693-0.46284 0.03387-0.26529 0.01693-0.58138 0.02822-0.31609 0.01129-0.66604 0.01693-0.0056 0.02822-0.0056 0.05645 0 0.02822 0 0.06209 0 0.36689 0.1016 0.59267 0.10724 0.22013 0.3048 0.32173 0.2032 0.1016 0.49107 0.1016 0.18062 0 0.36689-0.01693 0.18627-0.02258 0.3556-0.05645 0.17498-0.03387 0.32173-0.06773l0.06209 0.3556q-0.1524 0.0508-0.34431 0.09031-0.18627 0.03951-0.39511 0.05644-0.20884 0.02258-0.44591 0.02258zm-0.80716-1.8457q0.27093 0 0.51929-0.0056 0.254-0.01129 0.46284-0.02258 0.21449-0.01129 0.36124-0.02258 0.14676-0.01129 0.21449-0.01693-0.0056-0.31609-0.07902-0.508-0.07338-0.19191-0.22578-0.27658-0.1524-0.09031-0.38947-0.09031-0.14676 0-0.28787 0.04516-0.14111 0.03951-0.26529 0.14676-0.11853 0.1016-0.2032 0.28787-0.07902 0.18062-0.10724 0.46284z"/>
<path d="m48.51 76.133q0-0.54751 0.16369-0.90311 0.16369-0.36124 0.47978-0.53622 0.32173-0.17498 0.77329-0.17498 0.14676 0 0.3048 0.01693 0.15804 0.01129 0.31044 0.03387 0.15804 0.02258 0.28222 0.06209l-0.06773 0.39511q-0.12418-0.02822-0.25964-0.04516-0.13547-0.02258-0.27093-0.03387-0.13547-0.01693-0.25964-0.01693-0.31044 0-0.53058 0.13547-0.21449 0.12982-0.32738 0.39511-0.11289 0.25964-0.11289 0.67169 0 0.37818 0.11289 0.62653 0.11289 0.24271 0.33302 0.36689 0.22013 0.11853 0.53058 0.11853 0.12982 0 0.27093-0.01129t0.28222-0.03387q0.14676-0.02822 0.27658-0.05644l0.07338 0.38382q-0.2032 0.05644-0.47978 0.09031-0.27093 0.03951-0.51929 0.03951-0.67733 0-1.0216-0.37253t-0.34431-1.1515z"/>
<path d="m51.169 76.083q0-0.40076 0.06773-0.69427 0.06773-0.29916 0.22013-0.48542 0.1524-0.19191 0.4064-0.28787 0.254-0.09596 0.62653-0.09596t0.62653 0.09596q0.25964 0.09596 0.41204 0.28787 0.1524 0.18627 0.22013 0.48542 0.06773 0.29351 0.06773 0.69427 0 0.41204-0.07338 0.7112-0.07338 0.29916-0.23142 0.49107-0.15804 0.18627-0.41204 0.28222-0.24836 0.09031-0.6096 0.09031-0.3556 0-0.6096-0.09031-0.24836-0.09596-0.4064-0.28222-0.15804-0.19191-0.23142-0.49107-0.07338-0.29916-0.07338-0.7112zm0.47978 0q0 0.44591 0.08467 0.7112 0.09031 0.26529 0.27658 0.38382 0.18627 0.11289 0.47978 0.11289 0.29916 0 0.48542-0.11289 0.18627-0.11853 0.27093-0.38382 0.08467-0.26529 0.08467-0.7112 0-0.44027-0.07902-0.69991-0.07338-0.26529-0.25964-0.37818-0.18627-0.11853-0.50236-0.11853-0.31044 0-0.49671 0.11853-0.18627 0.11289-0.26529 0.37818-0.07902 0.25964-0.07902 0.69991z"/>
<path d="m54.387 77.601v-3.0254h0.42898v0.26529q0.18627-0.1016 0.3556-0.17498 0.17498-0.07338 0.34996-0.10724 0.18062-0.03951 0.37818-0.03951 0.27658 0 0.46284 0.09596 0.18627 0.09596 0.28222 0.28222 0.09595 0.18062 0.09595 0.45156v2.2521h-0.46849v-2.1223q0-0.27093-0.14111-0.41204-0.13547-0.14676-0.41769-0.14676-0.1524 0-0.29351 0.03387t-0.27658 0.09031q-0.13547 0.0508-0.28787 0.12982v2.4271z"/>
<path d="m57.31 76.083q0-0.40076 0.06773-0.69427 0.06773-0.29916 0.22013-0.48542 0.1524-0.19191 0.4064-0.28787 0.254-0.09596 0.62653-0.09596t0.62653 0.09596q0.25964 0.09596 0.41204 0.28787 0.1524 0.18627 0.22013 0.48542 0.06773 0.29351 0.06773 0.69427 0 0.41204-0.07338 0.7112-0.07338 0.29916-0.23142 0.49107-0.15804 0.18627-0.41204 0.28222-0.24836 0.09031-0.6096 0.09031-0.3556 0-0.6096-0.09031-0.24836-0.09596-0.4064-0.28222-0.15804-0.19191-0.23142-0.49107-0.07338-0.29916-0.07338-0.7112zm0.47978 0q0 0.44591 0.08467 0.7112 0.09031 0.26529 0.27658 0.38382 0.18627 0.11289 0.47978 0.11289 0.29916 0 0.48542-0.11289 0.18627-0.11853 0.27093-0.38382 0.08467-0.26529 0.08467-0.7112 0-0.44027-0.07902-0.69991-0.07338-0.26529-0.25964-0.37818-0.18627-0.11853-0.50236-0.11853-0.31044 0-0.49671 0.11853-0.18627 0.11289-0.26529 0.37818-0.07902 0.25964-0.07902 0.69991z"/>
<path d="m60.528 77.601v-3.0254h0.42898v0.26529q0.15804-0.1016 0.31609-0.16933 0.15804-0.06773 0.32173-0.10724 0.16933-0.03951 0.34431-0.03951 0.17498 0 0.29916 0.04515 0.12982 0.03951 0.22013 0.11853 0.09031 0.07338 0.14676 0.18062 0.14676-0.09595 0.3048-0.16933 0.16369-0.07902 0.34996-0.12982 0.19191-0.0508 0.41204-0.0508 0.16933 0 0.29916 0.04516 0.13547 0.03951 0.22578 0.11853 0.09031 0.07902 0.14676 0.18627 0.06209 0.1016 0.08467 0.22578 0.02822 0.12418 0.02822 0.254v2.2521h-0.47413v-2.1223q0-0.09596-0.02258-0.19191-0.02258-0.1016-0.07902-0.18062-0.0508-0.08467-0.1524-0.12982-0.1016-0.0508-0.25964-0.0508-0.1524 0-0.29351 0.03951-0.14111 0.03387-0.26529 0.09031-0.11853 0.05644-0.22013 0.11853 0.02258 0.06773 0.02822 0.14111 0.01129 0.07338 0.01129 0.14111v2.1449h-0.46849v-2.111q0-0.1016-0.02258-0.19756-0.02258-0.1016-0.07902-0.18062-0.05644-0.07902-0.15804-0.12982-0.09595-0.0508-0.254-0.0508-0.13547 0-0.25964 0.03387-0.12418 0.02822-0.24836 0.08467-0.11853 0.0508-0.24271 0.12418v2.4271z"/>
<path d="m65.399 73.966q-0.15804 0-0.22578-0.05644-0.06773-0.05644-0.06773-0.19756 0-0.14676 0.06209-0.2032 0.06773-0.05644 0.23142-0.05644 0.15804 0 0.22013 0.05644 0.06773 0.05644 0.06773 0.2032 0 0.14111-0.06773 0.19756-0.06209 0.05644-0.22013 0.05644zm-0.23707 3.635v-3.0254h0.46849v3.0254z"/>
<path d="m66.148 76.873q0-0.27093 0.11289-0.44591 0.11289-0.17498 0.34431-0.27658 0.23142-0.10724 0.57009-0.16369 0.33867-0.06209 0.78458-0.1016v-0.42333q0-0.25964-0.16933-0.39511-0.16933-0.14111-0.508-0.14111-0.11289 0-0.254 0.01129t-0.29351 0.03951q-0.1524 0.02822-0.31609 0.07902l-0.08467-0.38382q0.24271-0.07338 0.49671-0.11289 0.254-0.03951 0.47978-0.03951 0.37253 0 0.62089 0.10724 0.254 0.1016 0.37818 0.31044 0.12982 0.20884 0.12982 0.51929v1.4676q0 0.18627 0.0508 0.254 0.05645 0.06209 0.14676 0.06209 0.03387 0 0.07338-0.0056t0.08467-0.02258l0.0508 0.34996q-0.08467 0.04516-0.18062 0.06773-0.09031 0.02822-0.19191 0.02822-0.2032 0-0.32173-0.1016-0.11853-0.10724-0.1524-0.32173-0.13547 0.10724-0.3048 0.20884-0.16369 0.09596-0.36124 0.15804-0.19191 0.05644-0.42333 0.05644-0.17498 0-0.31609-0.0508-0.13547-0.0508-0.23707-0.14676-0.1016-0.1016-0.15804-0.24836-0.0508-0.14676-0.0508-0.33867zm0.47978-0.03951q0 0.24271 0.11853 0.36689 0.12418 0.11853 0.32738 0.11853 0.15804 0 0.31609-0.0508 0.15804-0.0508 0.3048-0.13547 0.1524-0.09031 0.26529-0.2032v-0.762q-0.29916 0.02822-0.54751 0.06773-0.24271 0.03387-0.42333 0.10724-0.17498 0.07338-0.27093 0.19191-0.09031 0.11853-0.09031 0.29916z"/>
<path d="m9.5193 84.86-0.062089-0.27658q-0.254 0.16933-0.49107 0.24836-0.23142 0.07902-0.47978 0.07902-0.48542 0-0.75071-0.38382-0.26529-0.38947-0.26529-1.1176 0-0.56444 0.14111-0.92569 0.14676-0.36124 0.45156-0.53622 0.3048-0.17498 0.76764-0.17498 0.14111 0 0.29916 0.01693 0.16369 0.01129 0.32738 0.04516v-1.1571h0.47413v4.1825zm-0.062089-0.62653v-2.0264q-0.17498-0.04515-0.32173-0.06209-0.14111-0.01693-0.26529-0.01693-0.31044 0-0.51364 0.12418-0.2032 0.11853-0.29916 0.39511-0.095955 0.27093-0.095955 0.72813 0 0.37253 0.079022 0.62653 0.084667 0.254 0.23707 0.38382 0.15804 0.12418 0.37818 0.12418 0.12982 0 0.254-0.02822 0.12418-0.02822 0.254-0.09031 0.13547-0.06209 0.29351-0.15804z"/>
<path d="m10.496 83.336q0-0.40076 0.06773-0.69427 0.06773-0.29916 0.22013-0.48542 0.1524-0.19191 0.4064-0.28787 0.254-0.09595 0.62653-0.09595t0.62653 0.09595q0.25964 0.09596 0.41204 0.28787 0.1524 0.18627 0.22013 0.48542 0.06773 0.29351 0.06773 0.69427 0 0.41204-0.07338 0.7112t-0.23142 0.49107q-0.15804 0.18627-0.41204 0.28222-0.24836 0.09031-0.6096 0.09031-0.3556 0-0.6096-0.09031-0.24836-0.09596-0.4064-0.28222-0.15804-0.19191-0.23142-0.49107-0.07338-0.29916-0.07338-0.7112zm0.47978 0q0 0.44591 0.08467 0.7112 0.09031 0.26529 0.27658 0.38382 0.18627 0.11289 0.47978 0.11289 0.29916 0 0.48542-0.11289 0.18627-0.11853 0.27093-0.38382 0.08467-0.26529 0.08467-0.7112 0-0.44027-0.07902-0.69991-0.07338-0.26529-0.25964-0.37818-0.18627-0.11853-0.50236-0.11853-0.31044 0-0.49671 0.11853-0.18627 0.11289-0.26529 0.37818-0.07902 0.25964-0.07902 0.69991z"/>
<path d="m15.09 83.386q0-0.54751 0.16369-0.90311 0.16369-0.36124 0.47978-0.53622 0.32173-0.17498 0.77329-0.17498 0.14676 0 0.3048 0.01693 0.15804 0.01129 0.31044 0.03387 0.15804 0.02258 0.28222 0.06209l-0.06773 0.39511q-0.12418-0.02822-0.25964-0.04516-0.13547-0.02258-0.27093-0.03387-0.13547-0.01693-0.25964-0.01693-0.31044 0-0.53058 0.13547-0.21449 0.12982-0.32738 0.39511-0.11289 0.25964-0.11289 0.67169 0 0.37818 0.11289 0.62653 0.11289 0.24271 0.33302 0.36689 0.22013 0.11853 0.53058 0.11853 0.12982 0 0.27093-0.01129t0.28222-0.03387q0.14676-0.02822 0.27658-0.05644l0.07338 0.38382q-0.2032 0.05645-0.47978 0.09031-0.27093 0.03951-0.51929 0.03951-0.67733 0-1.0216-0.37253-0.34431-0.37253-0.34431-1.1515z"/>
<path d="m17.749 83.336q0-0.40076 0.06773-0.69427 0.06773-0.29916 0.22013-0.48542 0.1524-0.19191 0.4064-0.28787 0.254-0.09595 0.62653-0.09595t0.62653 0.09595q0.25964 0.09596 0.41204 0.28787 0.1524 0.18627 0.22013 0.48542 0.06773 0.29351 0.06773 0.69427 0 0.41204-0.07338 0.7112t-0.23142 0.49107q-0.15804 0.18627-0.41204 0.28222-0.24836 0.09031-0.6096 0.09031-0.3556 0-0.6096-0.09031-0.24836-0.09596-0.4064-0.28222-0.15804-0.19191-0.23142-0.49107-0.07338-0.29916-0.07338-0.7112zm0.47978 0q0 0.44591 0.08467 0.7112 0.09031 0.26529 0.27658 0.38382 0.18627 0.11289 0.47978 0.11289 0.29916 0 0.48542-0.11289 0.18627-0.11853 0.27093-0.38382 0.08467-0.26529 0.08467-0.7112 0-0.44027-0.07902-0.69991-0.07338-0.26529-0.25964-0.37818-0.18627-0.11853-0.50236-0.11853-0.31044 0-0.49671 0.11853-0.18627 0.11289-0.26529 0.37818-0.07902 0.25964-0.07902 0.69991z"/>
<path d="m20.967 84.854v-3.0254h0.42898v0.26529q0.18627-0.1016 0.3556-0.17498 0.17498-0.07338 0.34996-0.10724 0.18062-0.03951 0.37818-0.03951 0.27658 0 0.46284 0.09595 0.18627 0.09596 0.28222 0.28222 0.09596 0.18062 0.09596 0.45156v2.2521h-0.46849v-2.1223q0-0.27093-0.14111-0.41204-0.13547-0.14676-0.41769-0.14676-0.1524 0-0.29351 0.03387t-0.27658 0.09031q-0.13547 0.0508-0.28787 0.12982v2.4271z"/>
<path d="m24.026 84.854v-4.1769h0.47978v1.4055q0.17498-0.1016 0.33867-0.16933 0.16369-0.06773 0.33302-0.1016 0.17498-0.03951 0.36689-0.03951 0.27093 0 0.4572 0.09595 0.19191 0.09031 0.28787 0.27658 0.1016 0.18627 0.1016 0.4572v2.2521h-0.47978v-2.1223q0-0.27093-0.13547-0.41204-0.13547-0.14111-0.41769-0.14111-0.1524 0-0.29351 0.03387t-0.27658 0.09031q-0.13547 0.0508-0.28222 0.12418v2.4271z"/>
<path d="m28.259 84.91q-0.31044 0-0.55316-0.08467t-0.41204-0.26529q-0.16369-0.18062-0.254-0.46284-0.08467-0.28222-0.08467-0.67733 0-0.4572 0.1016-0.77329 0.10724-0.32173 0.29916-0.51364t0.44027-0.27658q0.254-0.08467 0.55316-0.08467 0.57573 0 0.85796 0.31044 0.28222 0.3048 0.28222 0.99342 0 0.03387-0.0056 0.09596 0 0.06209-0.0056 0.11853-0.11853 0.0056-0.32173 0.02258-0.19756 0.01693-0.46284 0.03387-0.26529 0.01693-0.58138 0.02822-0.31609 0.01129-0.66604 0.01693-0.0056 0.02822-0.0056 0.05644t0 0.06209q0 0.36689 0.1016 0.59267 0.10724 0.22013 0.3048 0.32173 0.2032 0.1016 0.49107 0.1016 0.18062 0 0.36689-0.01693 0.18627-0.02258 0.3556-0.05644 0.17498-0.03387 0.32173-0.06773l0.06209 0.3556q-0.1524 0.0508-0.34431 0.09031-0.18627 0.03951-0.39511 0.05644-0.20884 0.02258-0.44591 0.02258zm-0.80716-1.8457q0.27093 0 0.51929-0.0056 0.254-0.01129 0.46284-0.02258 0.21449-0.01129 0.36124-0.02258t0.21449-0.01693q-0.0056-0.31609-0.07902-0.508-0.07338-0.19191-0.22578-0.27658-0.1524-0.09031-0.38947-0.09031-0.14676 0-0.28787 0.04516-0.14111 0.03951-0.26529 0.14676-0.11853 0.1016-0.2032 0.28787-0.07902 0.18062-0.10724 0.46284z"/>
<path d="m29.887 83.386q0-0.54751 0.16369-0.90311 0.16369-0.36124 0.47978-0.53622 0.32173-0.17498 0.77329-0.17498 0.14676 0 0.3048 0.01693 0.15804 0.01129 0.31044 0.03387 0.15804 0.02258 0.28222 0.06209l-0.06773 0.39511q-0.12418-0.02822-0.25964-0.04516-0.13547-0.02258-0.27093-0.03387-0.13547-0.01693-0.25964-0.01693-0.31044 0-0.53058 0.13547-0.21449 0.12982-0.32738 0.39511-0.11289 0.25964-0.11289 0.67169 0 0.37818 0.11289 0.62653 0.11289 0.24271 0.33302 0.36689 0.22013 0.11853 0.53058 0.11853 0.12982 0 0.27093-0.01129t0.28222-0.03387q0.14676-0.02822 0.27658-0.05644l0.07338 0.38382q-0.2032 0.05645-0.47978 0.09031-0.27093 0.03951-0.51929 0.03951-0.67733 0-1.0216-0.37253-0.34431-0.37253-0.34431-1.1515z"/>
<path d="m32.98 81.219q-0.15804 0-0.22578-0.05644-0.06773-0.05644-0.06773-0.19756 0-0.14676 0.06209-0.2032 0.06773-0.05644 0.23142-0.05644 0.15804 0 0.22013 0.05644 0.06773 0.05644 0.06773 0.2032 0 0.14111-0.06773 0.19756-0.06209 0.05644-0.22013 0.05644zm-0.23707 3.635v-3.0254h0.46849v3.0254z"/>
<path d="m33.923 84.854v-3.0254h0.42898v0.26529q0.15804-0.1016 0.31609-0.16933 0.15804-0.06773 0.32173-0.10724 0.16933-0.03951 0.34431-0.03951 0.17498 0 0.29916 0.04516 0.12982 0.03951 0.22013 0.11853 0.09031 0.07338 0.14676 0.18062 0.14676-0.09596 0.3048-0.16933 0.16369-0.07902 0.34996-0.12982 0.19191-0.0508 0.41204-0.0508 0.16933 0 0.29916 0.04515 0.13547 0.03951 0.22578 0.11853 0.09031 0.07902 0.14676 0.18627 0.06209 0.1016 0.08467 0.22578 0.02822 0.12418 0.02822 0.254v2.2521h-0.47413v-2.1223q0-0.09596-0.02258-0.19191-0.02258-0.1016-0.07902-0.18062-0.0508-0.08467-0.1524-0.12982-0.1016-0.0508-0.25964-0.0508-0.1524 0-0.29351 0.03951-0.14111 0.03387-0.26529 0.09031-0.11853 0.05644-0.22013 0.11853 0.02258 0.06773 0.02822 0.14111 0.01129 0.07338 0.01129 0.14111v2.1449h-0.46849v-2.111q0-0.1016-0.02258-0.19756-0.02258-0.1016-0.07902-0.18062-0.05644-0.07902-0.15804-0.12982-0.09596-0.0508-0.254-0.0508-0.13547 0-0.25964 0.03387-0.12418 0.02822-0.24836 0.08467-0.11853 0.0508-0.24271 0.12418v2.4271z"/>
<path d="m39.72 84.91q-0.31044 0-0.55316-0.08467t-0.41204-0.26529q-0.16369-0.18062-0.254-0.46284-0.08467-0.28222-0.08467-0.67733 0-0.4572 0.1016-0.77329 0.10724-0.32173 0.29916-0.51364t0.44027-0.27658q0.254-0.08467 0.55316-0.08467 0.57573 0 0.85796 0.31044 0.28222 0.3048 0.28222 0.99342 0 0.03387-0.0056 0.09596 0 0.06209-0.0056 0.11853-0.11853 0.0056-0.32173 0.02258-0.19756 0.01693-0.46284 0.03387-0.26529 0.01693-0.58138 0.02822-0.31609 0.01129-0.66604 0.01693-0.0056 0.02822-0.0056 0.05644t0 0.06209q0 0.36689 0.1016 0.59267 0.10724 0.22013 0.3048 0.32173 0.2032 0.1016 0.49107 0.1016 0.18062 0 0.36689-0.01693 0.18627-0.02258 0.3556-0.05644 0.17498-0.03387 0.32173-0.06773l0.06209 0.3556q-0.1524 0.0508-0.34431 0.09031-0.18627 0.03951-0.39511 0.05644-0.20884 0.02258-0.44591 0.02258zm-0.80716-1.8457q0.27093 0 0.51929-0.0056 0.254-0.01129 0.46284-0.02258 0.21449-0.01129 0.36124-0.02258 0.14676-0.01129 0.21449-0.01693-0.0056-0.31609-0.07902-0.508-0.07338-0.19191-0.22578-0.27658-0.1524-0.09031-0.38947-0.09031-0.14676 0-0.28787 0.04516-0.14111 0.03951-0.26529 0.14676-0.11853 0.1016-0.2032 0.28787-0.07902 0.18062-0.10724 0.46284z"/>
<path d="m41.498 84.854v-3.0254h0.42898v0.26529q0.18627-0.1016 0.3556-0.17498 0.17498-0.07338 0.34996-0.10724 0.18062-0.03951 0.37818-0.03951 0.27658 0 0.46284 0.09595 0.18627 0.09596 0.28222 0.28222 0.09596 0.18062 0.09596 0.45156v2.2521h-0.46849v-2.1223q0-0.27093-0.14111-0.41204-0.13547-0.14676-0.41769-0.14676-0.1524 0-0.29351 0.03387t-0.27658 0.09031q-0.13547 0.0508-0.28787 0.12982v2.4271z"/>
<path d="m45.59 84.91q-0.27658 0-0.46284-0.1016-0.18062-0.10724-0.27093-0.31609-0.08467-0.21449-0.08467-0.53058v-1.778h-0.51929v-0.31609l0.51929-0.03951 0.06209-0.71684h0.41204v0.71684h1.0104v0.3556h-1.0104v1.7441q0 0.3048 0.11289 0.44027 0.11853 0.13547 0.38382 0.13547 0.13547 0 0.27093-0.02258 0.13547-0.02822 0.27093-0.06773l0.06773 0.36689q-0.20884 0.06773-0.40076 0.09596-0.19191 0.03387-0.36124 0.03387z"/>
<path d="m46.531 83.336q0-0.40076 0.06773-0.69427 0.06773-0.29916 0.22013-0.48542 0.1524-0.19191 0.4064-0.28787 0.254-0.09595 0.62653-0.09595t0.62653 0.09595q0.25964 0.09596 0.41204 0.28787 0.1524 0.18627 0.22013 0.48542 0.06773 0.29351 0.06773 0.69427 0 0.41204-0.07338 0.7112t-0.23142 0.49107q-0.15804 0.18627-0.41204 0.28222-0.24836 0.09031-0.6096 0.09031-0.3556 0-0.6096-0.09031-0.24836-0.09596-0.4064-0.28222-0.15804-0.19191-0.23142-0.49107-0.07338-0.29916-0.07338-0.7112zm0.47978 0q0 0.44591 0.08467 0.7112 0.09031 0.26529 0.27658 0.38382 0.18627 0.11289 0.47978 0.11289 0.29916 0 0.48542-0.11289 0.18627-0.11853 0.27093-0.38382 0.08467-0.26529 0.08467-0.7112 0-0.44027-0.07902-0.69991-0.07338-0.26529-0.25964-0.37818-0.18627-0.11853-0.50236-0.11853-0.31044 0-0.49671 0.11853-0.18627 0.11289-0.26529 0.37818-0.07902 0.25964-0.07902 0.69991z"/>
</g>
</svg>
