<?xml version="1.0" encoding="UTF-8"?>
<svg width="300" height="416.36" version="1.1" viewBox="0 0 79.375 110.16" xmlns="http://www.w3.org/2000/svg" xmlns:xlink="http://www.w3.org/1999/xlink">
<defs>
<filter id="a" x="-.03712" y="-.026202" width="1.0742" height="1.0524" style="color-interpolation-filters:sRGB">
<feGaussianBlur stdDeviation="1.2276667"/>
</filter>
<clipPath id="b">
<path d="m1821 722.5-166.78-447.09c-10.631-28.499-39.932-43.705-65.697-34.094l-686.11 255.95c-25.765 9.6113-37.948 40.292-27.317 68.792l166.78 447.09c10.631 28.499 39.932 43.705 65.697 34.094l686.11-255.95c25.765-9.6113 37.948-40.292 27.317-68.792z" style="fill:#9417e5;stroke-dasharray:3.64954, 1.21651;stroke-linecap:round;stroke-linejoin:round;stroke-width:1.2165"/>
</clipPath>
</defs>
<g transform="translate(.30057 .30057)">
<path transform="matrix(.93089 0 0 .93089 -.020772 -.020772)" d="m10.07 2.6458h64.526c4.1132 0 7.4245 2.9936 7.4245 6.7121v99.024c0 3.7185-3.3113 6.7121-7.4245 6.7121h-64.526c-4.1132 0-7.4245-2.9936-7.4245-6.7121v-99.024c0-3.7185 3.3113-6.7121 7.4245-6.7121z" style="fill:#4d4d4d;filter:url(#a);stroke-dasharray:0.4935, 0.1645;stroke-linecap:round;stroke-linejoin:round;stroke-width:.1645"/>
<path d="m6.8906-0.020772h60.067c3.8289 0 6.9114 2.7867 6.9114 6.2483v92.18c0 3.4615-3.0825 6.2483-6.9114 6.2483h-60.067c-3.8289 0-6.9114-2.7867-6.9114-6.2483v-92.18c0-3.4615 3.0825-6.2483 6.9114-6.2483z" style="fill:#0014fd;stroke-dasharray:0.459395, 0.153132;stroke-linecap:round;stroke-linejoin:round;stroke-width:.15313"/>
</g>
<g transform="matrix(-.043996 -.11794 -.11794 .043996 172.52 183.26)" clip-path="url(#b)" style="fill:none;opacity:.6;stroke:#ffffff">
<g transform="translate(1373.3 455.53)" style="stroke:#ffffff">
<path d="m0 0c170.76-86.832 82.281-379.93-346.86-346.86-160.61 12.375-687.58 218.72-533.63 371.12 254.32 251.76 394.84 523.33 549.8 491.59 120.75-24.737-8.307-343.46 330.69-515.84z" style="fill:none;stroke-dasharray:1, 20;stroke-linecap:round;stroke-linejoin:round;stroke-miterlimit:10;stroke-width:4;stroke:#ffffff"/>
</g>
<g transform="translate(1366.3 455.53)" style="stroke:#ffffff">
<path d="m0 0c167.04-85.207 80.455-374.34-339.62-341.99-157.38 12.107-673.28 216.38-522.68 365.72 248.79 246.55 386.47 512.43 538.32 481.37 118.39-24.2-7.652-336.2 323.97-505.1z" style="fill:none;stroke-dasharray:1, 20;stroke-linecap:round;stroke-linejoin:round;stroke-miterlimit:10;stroke-width:3.935;stroke:#ffffff"/>
</g>
<g transform="translate(1359.2 455.53)" style="stroke:#ffffff">
<path d="m0 0c163.33-83.581 78.63-368.75-332.38-337.12-154.15 11.838-658.98 214.03-511.73 360.32 243.26 241.34 378.1 501.53 526.84 471.16 116.02-23.662-6.997-328.95 317.26-494.36z" style="fill:none;stroke-dasharray:1, 20;stroke-linecap:round;stroke-linejoin:round;stroke-miterlimit:10;stroke-width:3.87;stroke:#ffffff"/>
</g>
<g transform="translate(1352.1 455.53)" style="stroke:#ffffff">
<path d="m0 0c159.62-81.956 76.804-363.16-325.14-332.25-150.92 11.569-644.68 211.68-500.78 354.93 237.74 236.13 369.73 490.62 515.37 460.95 113.66-23.124-6.341-321.69 310.55-483.62z" style="fill:none;stroke-dasharray:1, 20;stroke-linecap:round;stroke-linejoin:round;stroke-miterlimit:10;stroke-width:3.804;stroke:#ffffff"/>
</g>
<g transform="translate(1345.1 455.53)" style="stroke:#ffffff">
<path d="m0 0c155.91-80.33 74.979-357.58-317.89-327.38-147.69 11.299-630.39 209.34-489.83 349.53 232.21 230.91 361.36 479.72 503.89 450.74 111.3-22.587-5.686-314.44 303.83-472.88z" style="fill:none;stroke-dasharray:1, 20;stroke-linecap:round;stroke-linejoin:round;stroke-miterlimit:10;stroke-width:3.739;stroke:#ffffff"/>
</g>
<g transform="translate(1338 455.53)" style="stroke:#ffffff">
<path d="m0 0c152.2-78.705 73.153-351.99-310.65-322.52-144.46 11.031-616.09 207-478.88 344.14 226.68 225.7 352.99 468.82 492.41 440.53 108.94-22.048-5.031-307.18 297.12-462.14z" style="fill:none;stroke-dasharray:1, 20;stroke-linecap:round;stroke-linejoin:round;stroke-miterlimit:10;stroke-width:3.674;stroke:#ffffff"/>
</g>
<g transform="translate(1331 455.53)" style="stroke:#ffffff">
<path d="m0 0c148.64-76.771 71.328-346.4-303.41-317.65-141.23 10.762-601.79 204.65-467.93 338.74 221.15 220.49 344.62 457.92 480.94 430.31 106.57-21.511-4.061-299.32 290.4-451.41z" style="fill:none;stroke-dasharray:1, 20;stroke-linecap:round;stroke-linejoin:round;stroke-miterlimit:10;stroke-width:3.609;stroke:#ffffff"/>
</g>
<g transform="translate(1323.9 455.53)" style="stroke:#ffffff">
<path d="m0 0c144.96-75.094 69.503-340.81-296.17-312.78-138 10.492-587.5 202.3-456.98 333.34 215.62 215.28 336.25 447.02 469.46 420.1 104.21-20.973-3.353-291.96 283.69-440.67z" style="fill:none;stroke-dasharray:1, 20;stroke-linecap:round;stroke-linejoin:round;stroke-miterlimit:10;stroke-width:3.543;stroke:#ffffff"/>
</g>
<g transform="translate(1316.8 455.53)" style="stroke:#ffffff">
<path d="m0 0c141.27-73.418 67.677-335.23-288.93-307.91-134.77 10.223-573.2 199.96-446.03 327.95 210.09 210.07 327.88 436.11 457.98 409.89 101.85-20.435-2.645-284.61 276.97-429.93z" style="fill:none;stroke-dasharray:1, 20;stroke-linecap:round;stroke-linejoin:round;stroke-miterlimit:10;stroke-width:3.478;stroke:#ffffff"/>
</g>
<g transform="translate(1309.8 455.53)" style="stroke:#ffffff">
<path d="m0 0c137.59-71.742 65.852-329.64-281.68-303.04-131.54 9.955-558.9 197.61-435.08 322.55 204.56 204.86 319.5 425.21 446.5 399.68 99.485-19.898-1.936-277.26 270.26-419.19z" style="fill:none;stroke-dasharray:1, 20;stroke-linecap:round;stroke-linejoin:round;stroke-miterlimit:10;stroke-width:3.413;stroke:#ffffff"/>
</g>
<g transform="translate(1302.7 455.53)" style="stroke:#ffffff">
<path d="m0 0c133.9-70.066 64.026-324.05-274.44-298.17-128.32 9.686-544.87 195.53-424.13 317.16 198.61 200.07 311.13 414.31 435.02 389.46 97.122-19.36-1.228-269.9 263.55-408.45z" style="fill:none;stroke-dasharray:1, 20;stroke-linecap:round;stroke-linejoin:round;stroke-miterlimit:10;stroke-width:3.348;stroke:#ffffff"/>
</g>
<g transform="translate(1295.6 455.53)" style="stroke:#ffffff">
<path d="m0 0c130.22-68.39 62.201-318.46-267.2-293.3-125.08 9.416-530.6 193.2-413.18 311.76 193.04 194.9 302.76 403.41 423.55 379.25 94.758-18.822-0.519-262.55 256.83-397.71z" style="fill:none;stroke-dasharray:1, 20;stroke-linecap:round;stroke-linejoin:round;stroke-miterlimit:10;stroke-width:3.283;stroke:#ffffff"/>
</g>
<g transform="translate(1288.6 455.53)" style="stroke:#ffffff">
<path d="m0 0c126.53-66.714 60.376-312.88-259.96-288.43-121.86 9.147-516.32 190.88-402.23 306.36 187.47 189.73 294.39 392.5 412.07 369.04 92.396-18.285 0.19-255.2 250.12-386.97z" style="fill:none;stroke-dasharray:1, 20;stroke-linecap:round;stroke-linejoin:round;stroke-miterlimit:10;stroke-width:3.217;stroke:#ffffff"/>
</g>
<g transform="translate(1281.5 455.53)" style="stroke:#ffffff">
<path d="m0 0c122.85-65.039 58.55-307.29-252.72-283.57-118.63 8.879-502.05 188.56-391.28 300.97 181.9 184.56 286.02 381.6 400.59 358.83 90.033-17.746 0.899-247.84 243.4-376.23z" style="fill:none;stroke-dasharray:1, 20;stroke-linecap:round;stroke-linejoin:round;stroke-miterlimit:10;stroke-width:3.152;stroke:#ffffff"/>
</g>
<g transform="translate(1274.4 455.53)" style="stroke:#ffffff">
<path d="m0 0c119.17-63.364 56.725-301.7-245.48-278.7-115.4 8.61-487.78 186.24-380.32 295.57 176.32 179.39 277.65 370.7 389.11 348.62 87.67-17.209 1.608-240.49 236.69-365.49z" style="fill:none;stroke-dasharray:1, 20;stroke-linecap:round;stroke-linejoin:round;stroke-miterlimit:10;stroke-width:3.087;stroke:#ffffff"/>
</g>
<g transform="translate(1267.4 455.53)" style="stroke:#ffffff">
<path d="m0 0c115.48-61.689 54.899-296.11-238.24-273.83-112.17 8.34-473.51 183.92-369.38 290.17 170.75 174.22 269.28 359.8 377.64 338.4 85.307-16.671 2.318-233.14 229.97-354.75z" style="fill:none;stroke-dasharray:1, 20;stroke-linecap:round;stroke-linejoin:round;stroke-miterlimit:10;stroke-width:3.022;stroke:#ffffff"/>
</g>
<g transform="translate(1260.3 455.53)" style="stroke:#ffffff">
<path d="m0 0c111.8-60.014 53.074-290.52-230.99-268.96-108.94 8.071-459.24 181.6-358.42 284.78 165.18 169.05 260.91 348.9 366.16 328.19 82.944-16.133 3.028-225.79 223.26-344.01z" style="fill:none;stroke-dasharray:1, 20;stroke-linecap:round;stroke-linejoin:round;stroke-miterlimit:10;stroke-width:2.957;stroke:#ffffff"/>
</g>
<g transform="translate(1253.2 455.53)" style="stroke:#ffffff">
<path d="m0 0c108.12-58.34 51.249-284.94-223.75-264.09-105.71 7.803-444.97 179.28-347.47 279.38 159.61 163.88 252.54 337.99 354.68 317.98 80.581-15.596 3.737-218.44 216.54-333.27z" style="fill:none;stroke-dasharray:1, 20;stroke-linecap:round;stroke-linejoin:round;stroke-miterlimit:10;stroke-width:2.891;stroke:#ffffff"/>
</g>
<g transform="translate(1246.2 455.53)" style="stroke:#ffffff">
<path d="m0 0c104.44-56.666 49.423-279.35-216.51-259.22-102.48 7.533-430.7 176.96-336.52 273.99 154.04 158.71 244.16 327.09 343.2 307.77 78.218-15.057 4.448-211.09 209.83-322.53z" style="fill:none;stroke-dasharray:1, 20;stroke-linecap:round;stroke-linejoin:round;stroke-miterlimit:10;stroke-width:2.826;stroke:#ffffff"/>
</g>
<g transform="translate(1239.1 455.53)" style="stroke:#ffffff">
<path d="m0 0c100.75-54.992 47.598-273.76-209.27-254.35-99.25 7.264-416.43 174.64-325.57 268.59 148.47 153.53 235.79 316.19 331.73 297.56 75.856-14.52 5.159-203.74 203.12-311.79z" style="fill:none;stroke-dasharray:1, 20;stroke-linecap:round;stroke-linejoin:round;stroke-miterlimit:10;stroke-width:2.761;stroke:#ffffff"/>
</g>
<g transform="translate(1232 455.53)" style="stroke:#ffffff">
<path d="m0 0c97.071-53.319 45.772-268.18-202.03-249.48-96.021 6.995-402.16 172.32-314.62 263.19 142.9 148.36 227.42 305.29 320.25 287.34 73.492-13.982 5.869-196.4 196.4-301.05z" style="fill:none;stroke-dasharray:1, 20;stroke-linecap:round;stroke-linejoin:round;stroke-miterlimit:10;stroke-width:2.696;stroke:#ffffff"/>
</g>
<g transform="translate(1225 455.53)" style="stroke:#ffffff">
<path d="m0 0c93.39-51.647 43.947-262.59-194.79-244.62-92.791 6.727-387.89 169.99-303.67 257.8 137.33 143.19 219.05 294.38 308.77 277.13 71.129-13.444 6.581-189.05 189.69-290.32z" style="fill:none;stroke-dasharray:1, 20;stroke-linecap:round;stroke-linejoin:round;stroke-miterlimit:10;stroke-width:2.63;stroke:#ffffff"/>
</g>
<g transform="translate(1217.9 455.53)" style="stroke:#ffffff">
<path d="m0 0c89.709-49.974 42.121-257-187.54-239.75-89.562 6.457-373.62 167.67-292.72 252.4 131.76 138.01 210.68 283.48 297.29 266.92 68.767-12.907 7.293-181.71 182.97-279.58z" style="fill:none;stroke-dasharray:1, 20;stroke-linecap:round;stroke-linejoin:round;stroke-miterlimit:10;stroke-width:2.565;stroke:#ffffff"/>
</g>
<g transform="translate(1210.8 455.53)" style="stroke:#ffffff">
<path d="m0 0c86.028-48.303 40.296-251.41-180.3-234.88-86.333 6.188-359.35 165.35-281.77 247.01 126.19 132.84 202.31 272.58 285.82 256.71 66.404-12.369 8.005-174.36 176.26-268.84z" style="fill:none;stroke-dasharray:1, 20;stroke-linecap:round;stroke-linejoin:round;stroke-miterlimit:10;stroke-width:2.5;stroke:#ffffff"/>
</g>
<g transform="translate(1203.8 455.53)" style="stroke:#ffffff">
<path d="m0 0c82.349-46.632 38.471-245.82-173.06-230.01-83.103 5.919-345.08 163.02-270.82 241.61 120.62 127.66 193.94 261.68 274.34 246.5 64.041-11.831 8.718-167.02 169.54-258.1z" style="fill:none;stroke-dasharray:1, 20;stroke-linecap:round;stroke-linejoin:round;stroke-miterlimit:10;stroke-width:2.435;stroke:#ffffff"/>
</g>
<g transform="translate(1196.7 455.53)" style="stroke:#ffffff">
<path d="m0 0c78.67-44.962 36.645-240.24-165.82-225.14-79.874 5.649-330.81 160.7-259.87 236.21 115.05 122.48 185.54 250.61 262.86 236.28 61.654-11.424 9.431-159.68 162.83-247.36z" style="fill:none;stroke-dasharray:1, 20;stroke-linecap:round;stroke-linejoin:round;stroke-miterlimit:10;stroke-width:2.37;stroke:#ffffff"/>
</g>
<g transform="translate(1189.6 455.53)" style="stroke:#ffffff">
<path d="m0 0c74.992-43.293 34.849-234.25-158.58-220.27-76.634 5.539-316.54 158.37-248.92 230.82 109.48 117.3 177.16 239.7 251.38 226.07 59.291-10.891 10.146-152.35 156.12-236.62z" style="fill:none;stroke-dasharray:1, 20;stroke-linecap:round;stroke-linejoin:round;stroke-miterlimit:10;stroke-width:2.304;stroke:#ffffff"/>
</g>
<g transform="translate(1182.6 455.53)" style="stroke:#ffffff">
<path d="m0 0c71.314-41.625 33.024-228.65-151.34-215.4-73.404 5.275-302.26 156.05-237.97 225.42 103.91 112.12 168.79 228.8 239.9 215.86 56.927-10.357 10.86-145.01 149.4-225.88z" style="fill:none;stroke-dasharray:1, 20;stroke-linecap:round;stroke-linejoin:round;stroke-miterlimit:10;stroke-width:2.239;stroke:#ffffff"/>
</g>
<g transform="translate(1175.5 455.53)" style="stroke:#ffffff">
<path d="m0 0c67.638-39.959 31.2-223.05-144.09-210.53-70.174 5.011-288 153.72-227.02 220.02 98.346 106.94 160.42 217.89 228.43 205.65 54.563-9.823 11.575-137.68 142.69-215.14z" style="fill:none;stroke-dasharray:1, 20;stroke-linecap:round;stroke-linejoin:round;stroke-miterlimit:10;stroke-width:2.174;stroke:#ffffff"/>
</g>
<g transform="translate(1168.4 455.53)" style="stroke:#ffffff">
<path d="m0 0c63.963-38.294 29.375-217.45-136.85-205.66-66.944 4.747-273.72 151.39-216.07 214.63 92.778 101.76 152.05 206.98 216.95 195.44 52.201-9.289 12.292-130.35 135.97-204.4z" style="fill:none;stroke-dasharray:1, 20;stroke-linecap:round;stroke-linejoin:round;stroke-miterlimit:10;stroke-width:2.109;stroke:#ffffff"/>
</g>
<g transform="translate(1161.4 455.53)" style="stroke:#ffffff">
<path d="m0 0c60.289-36.63 27.55-211.86-129.61-200.8-63.715 4.484-259.46 149.07-205.12 209.23 87.211 96.574 143.68 196.08 205.47 185.22 49.837-8.755 13.008-123.03 129.26-193.66z" style="fill:none;stroke-dasharray:1, 20;stroke-linecap:round;stroke-linejoin:round;stroke-miterlimit:10;stroke-width:2.043;stroke:#ffffff"/>
</g>
<g transform="translate(1154.3 455.53)" style="stroke:#ffffff">
<path d="m0 0c56.616-34.969 25.725-206.26-122.37-195.93-60.485 4.22-245.18 146.74-194.17 203.84 81.644 91.386 135.31 185.17 193.99 175.01 47.474-8.22 13.726-115.71 122.54-182.92z" style="fill:none;stroke-dasharray:1, 20;stroke-linecap:round;stroke-linejoin:round;stroke-miterlimit:10;stroke-width:1.978;stroke:#ffffff"/>
</g>
<g transform="translate(1147.2 455.53)" style="stroke:#ffffff">
<path d="m0 0c52.946-33.31 23.9-200.66-115.13-191.06-57.255 3.955-230.91 144.4-183.22 198.44 76.079 86.196 126.94 174.27 182.52 164.8 45.111-7.685 14.446-108.4 115.83-172.18z" style="fill:none;stroke-dasharray:1, 20;stroke-linecap:round;stroke-linejoin:round;stroke-miterlimit:10;stroke-width:1.913;stroke:#ffffff"/>
</g>
<g transform="translate(1140.2 455.53)" style="stroke:#ffffff">
<path d="m0 0c49.277-31.655 22.075-195.07-107.89-186.19-54.026 3.691-216.64 142.07-172.27 193.04 70.515 81.002 118.56 163.36 171.04 154.59 42.748-7.149 15.165-101.09 109.12-161.44z" style="fill:none;stroke-dasharray:1, 20;stroke-linecap:round;stroke-linejoin:round;stroke-miterlimit:10;stroke-width:1.848;stroke:#ffffff"/>
</g>
<g transform="translate(1133.1 455.53)" style="stroke:#ffffff">
<path d="m0 0c45.61-30.003 20.249-189.48-100.64-181.32-50.797 3.427-202.37 139.74-161.32 187.65 64.952 75.803 110.19 152.46 159.56 144.38 40.386-6.614 15.886-93.793 102.4-150.7z" style="fill:none;stroke-dasharray:1, 20;stroke-linecap:round;stroke-linejoin:round;stroke-miterlimit:10;stroke-width:1.783;stroke:#ffffff"/>
</g>
<g transform="translate(1126 455.53)" style="stroke:#ffffff">
<path d="m0 0c41.947-28.356 18.424-183.88-93.403-176.45-47.567 3.162-188.1 137.4-150.37 182.25 59.391 70.601 101.82 141.56 148.08 134.16 38.023-6.078 16.609-86.507 95.688-139.96z" style="fill:none;stroke-dasharray:1, 20;stroke-linecap:round;stroke-linejoin:round;stroke-miterlimit:10;stroke-width:1.717;stroke:#ffffff"/>
</g>
<g transform="translate(1119 455.53)" style="stroke:#ffffff">
<path d="m0 0c38.286-26.715 16.598-178.3-86.161-171.58-44.338 2.896-173.83 135.05-139.42 176.86 53.833 65.391 93.454 130.66 136.61 123.95 35.661-5.54 17.332-79.234 88.974-129.22z" style="fill:none;stroke-dasharray:1, 20;stroke-linecap:round;stroke-linejoin:round;stroke-miterlimit:10;stroke-width:1.652;stroke:#ffffff"/>
</g>
<g transform="translate(1111.9 455.53)" style="stroke:#ffffff">
<path d="m0 0c34.629-25.082 14.772-172.71-78.92-166.72-41.108 2.63-159.56 132.71-128.47 171.46 48.278 60.173 85.084 119.76 125.13 113.74 33.299-5.003 18.054-71.981 82.259-118.48z" style="fill:none;stroke-dasharray:1, 20;stroke-linecap:round;stroke-linejoin:round;stroke-miterlimit:10;stroke-width:1.587;stroke:#ffffff"/>
</g>
<g transform="translate(1104.8 455.53)" style="stroke:#ffffff">
<path d="m0 0c30.977-23.46 12.946-167.13-71.678-161.85-37.879 2.364-145.29 130.36-117.52 166.06 42.729 54.945 76.714 108.86 113.65 103.53 30.937-4.463 18.777-64.752 75.545-107.74z" style="fill:none;stroke-dasharray:1, 20;stroke-linecap:round;stroke-linejoin:round;stroke-miterlimit:10;stroke-width:1.522;stroke:#ffffff"/>
</g>
<g transform="translate(1097.8 455.53)" style="stroke:#ffffff">
<path d="m0 0c27.328-21.853 11.119-161.55-64.436-156.98-34.651 2.096-131.01 128-106.57 160.67 37.186 49.703 68.345 97.959 102.17 93.315 28.576-3.923 19.497-57.556 68.831-97.006z" style="fill:none;stroke-dasharray:1, 20;stroke-linecap:round;stroke-linejoin:round;stroke-miterlimit:10;stroke-width:1.457;stroke:#ffffff"/>
</g>
<g transform="translate(1090.7 455.53)" style="stroke:#ffffff">
<path d="m0 0c23.685-20.267 9.292-155.97-57.195-152.11-31.421 1.826-116.74 125.62-95.617 155.27 31.655 44.443 59.976 87.064 90.696 83.103 26.215-3.38 20.21-50.407 62.116-86.267z" style="fill:none;stroke-dasharray:1, 20;stroke-linecap:round;stroke-linejoin:round;stroke-miterlimit:10;stroke-width:1.391;stroke:#ffffff"/>
</g>
<g transform="translate(1083.6 455.53)" style="stroke:#ffffff">
<path d="m0 0c20.043-18.712 7.464-150.41-49.953-147.24-28.193 1.555-102.45 123.24-84.667 149.88 26.14 39.157 51.608 76.172 79.218 72.89 23.854-2.835 20.907-43.323 55.402-75.527z" style="fill:none;stroke-dasharray:1, 20;stroke-linecap:round;stroke-linejoin:round;stroke-miterlimit:10;stroke-width:1.326;stroke:#ffffff"/>
</g>
<g transform="translate(1076.6 455.53)" style="stroke:#ffffff">
<path d="m0 0c16.398-17.205 5.635-144.85-42.711-142.37-24.965 1.281-88.153 120.83-73.717 144.48 20.653 33.837 43.241 65.285 67.74 62.679 21.495-2.287 21.57-36.337 48.688-64.788z" style="fill:none;stroke-dasharray:1, 20;stroke-linecap:round;stroke-linejoin:round;stroke-miterlimit:10;stroke-width:1.261;stroke:#ffffff"/>
</g>
<g transform="translate(1069.5 455.53)" style="stroke:#ffffff">
<path d="m0 0c12.729-15.771 3.805-139.31-35.47-137.5-21.737 1.001-73.829 118.39-62.766 139.08 15.216 28.465 34.874 54.403 56.263 52.466 19.135-1.732 22.156-29.494 41.973-54.048z" style="fill:none;stroke-dasharray:1, 20;stroke-linecap:round;stroke-linejoin:round;stroke-miterlimit:10;stroke-width:1.196;stroke:#ffffff"/>
</g>
<g transform="translate(1062.4 455.53)" style="stroke:#ffffff">
<path d="m0 0c8.969-14.456 1.974-133.79-28.228-132.63-18.51 0.71-59.445 115.9-51.817 133.69 9.875 23.022 26.509 43.53 44.786 42.254 16.776-1.171 22.57-22.857 35.259-43.309z" style="fill:none;stroke-dasharray:1, 20;stroke-linecap:round;stroke-linejoin:round;stroke-miterlimit:10;stroke-width:1.13;stroke:#ffffff"/>
</g>
<g transform="translate(1055.4 455.53)" style="stroke:#ffffff">
<path d="m0 0c4.912-13.298 0.142-128.31-20.987-127.76-15.283 0.394-44.902 113.36-40.866 128.29 4.731 17.503 18.143 32.671 33.308 32.043 14.418-0.597 22.585-16.435 28.545-32.57z" style="fill:none;stroke-dasharray:1, 20;stroke-linecap:round;stroke-linejoin:round;stroke-miterlimit:10;stroke-width:1.065;stroke:#ffffff"/>
</g>
<g transform="translate(1048.3 455.53)" style="stroke:#ffffff">
<path d="m0 0c0-12.057-1.688-122.9-13.745-122.9s-29.916 110.84-29.916 122.9 9.774 21.83 21.831 21.83c12.056 0 21.83-9.773 21.83-21.83z" style="fill:none;stroke-dasharray:1, 20;stroke-linecap:round;stroke-linejoin:round;stroke-miterlimit:10;stroke:#ffffff"/>
</g>
</g>
<rect x="7.9375" y="35.57" width="31.75" height="1.8521" rx="0" ry=".92604" style="fill:#ffffff"/>
<g transform="matrix(.26458 0 0 .26458 7.6806 27.383)" style="fill:#ffffff;shape-inside:url(#rect11617);white-space:pre" aria-label="INTRODUÇÃO">
<path d="m2.4108 21.654v-3.8133h3.1467v-11.04h-3.1467v-3.8133h10.853v3.8133h-3.1733v11.04h3.1733v3.8133z"/>
<path d="m17.584 21.654v-18.667h4.0533l9.7867 13.333-0.88-0.13333q-0.13333-0.88-0.21333-1.68t-0.16-1.5733q-0.05333-0.77334-0.10667-1.5733-0.02667-0.8-0.05333-1.7333 0-0.93333 0-2.0267v-4.6133h4.4v18.667h-4.1067l-10.213-13.76 1.36 0.18667q0.13333 1.28 0.21333 2.1867 0.10667 0.88 0.16 1.5733 0.08 0.69333 0.10667 1.2533 0.02667 0.56 0.02667 1.12 0.02667 0.53333 0.02667 1.2v6.24z"/>
<path d="m43.158 21.654v-14.667h-5.5467v-4h15.76v4h-5.68v14.667z"/>
<path d="m56.571 21.654v-18.667h8.4q1.7867 0 3.2267 0.77333 1.4667 0.77333 2.2933 2.1333 0.82667 1.3333 0.82667 3.04 0 1.76-0.82667 3.1733-0.82667 1.3867-2.2667 2.1867-1.44 0.8-3.2533 0.8h-4.08v6.56zm10.347 0-4.7467-8.4267 4.64-0.66667 5.28 9.0933zm-6.0267-10.027h3.68q0.69333 0 1.2-0.29333 0.53333-0.32 0.8-0.88 0.29333-0.56 0.29333-1.28t-0.32-1.2533q-0.32-0.56-0.93334-0.85333-0.58667-0.29333-1.44-0.29333h-3.28z"/>
<path d="m83.531 21.92q-2.1333 0-3.8933-0.72-1.76-0.72-3.0667-2.0267-1.3067-1.3067-2.0267-3.0667t-0.72-3.8667q0-2.1067 0.72-3.8667 0.72-1.76 2.0267-3.0667t3.0667-2.0267q1.76-0.72 3.8667-0.72t3.8667 0.72q1.76 0.72 3.0667 2.0267 1.3067 1.3067 2 3.0667 0.72 1.76 0.72 3.8667 0 2.08-0.72 3.8667-0.69333 1.76-2 3.0667-1.3067 1.3067-3.0667 2.0267-1.76 0.72-3.84 0.72zm-0.02667-4.2667q1.0933 0 2-0.4 0.93333-0.4 1.6-1.12 0.69333-0.74667 1.0667-1.7333t0.37333-2.16q0-1.1733-0.37333-2.16-0.37333-0.98667-1.0667-1.7067-0.66667-0.74667-1.6-1.1467-0.90667-0.4-2-0.4t-2.0267 0.4q-0.90667 0.4-1.6 1.1467-0.69333 0.72-1.0667 1.7067-0.34667 0.98667-0.34667 2.16 0 1.1733 0.34667 2.1867 0.37333 0.98667 1.0667 1.7067t1.6 1.12q0.93333 0.4 2.0267 0.4z"/>
<path d="m96.678 21.654v-18.667h7.8133q2.0533 0 3.76 0.69333 1.7067 0.66667 2.9333 1.92 1.2533 1.2533 1.92 2.96 0.66667 1.7067 0.66667 3.76t-0.66667 3.7867q-0.66666 1.7067-1.92 2.96-1.2267 1.2267-2.9333 1.92-1.7067 0.66667-3.76 0.66667zm4.5333-3.0933-0.61334-0.90667h3.76q1.12 0 2-0.37333 0.88-0.4 1.4933-1.0933 0.64001-0.69333 0.98667-1.68 0.34667-0.98667 0.34667-2.1867 0-1.2-0.34667-2.1867-0.34666-0.98667-0.98667-1.68-0.61333-0.69333-1.4933-1.0667-0.88-0.4-2-0.4h-3.84l0.69334-0.85333z"/>
<path d="m125.13 21.814q-2.32 0-4.1333-0.93334-1.8133-0.96-2.8533-2.6133-1.0133-1.6533-1.0133-3.7867v-11.493h4.5867v11.253q0 1.0133 0.45334 1.84 0.45333 0.8 1.2267 1.28 0.77333 0.45333 1.7333 0.45333 1.0133 0 1.7867-0.45333 0.8-0.48 1.28-1.28 0.48-0.82667 0.48-1.84v-11.253h4.4267v11.493q0 2.1333-1.04 3.7867-1.0133 1.6533-2.8267 2.6133-1.8133 0.93334-4.1067 0.93334z"/>
<path d="m146.14 21.92q-2.1067 0-3.8933-0.69333-1.76-0.72-3.0667-2-1.3067-1.3067-2.0267-3.0667-0.69333-1.7867-0.69333-3.92 0-2.08 0.74667-3.84 0.74667-1.76 2.0533-3.04 1.3333-1.3067 3.12-2.0267 1.8133-0.72 3.9467-0.72 1.3333 0 2.6133 0.34667 1.28 0.34667 2.3733 1.04 1.12 0.66667 1.92 1.6l-2.7733 3.1733q-0.56-0.58667-1.2-1.0133-0.61334-0.45333-1.36-0.69333-0.74666-0.24-1.6-0.24-1.0667 0-2.0267 0.4-0.93333 0.37333-1.6533 1.0933-0.69334 0.69333-1.0933 1.7067-0.4 1.0133-0.4 2.2667 0 1.2267 0.4 2.24 0.4 0.98667 1.12 1.7067 0.72001 0.72 1.7333 1.0933 1.04 0.37333 2.2933 0.37333 0.85333 0 1.6267-0.24 0.77333-0.24 1.4133-0.64 0.66667-0.42667 1.1733-0.96l2.1867 3.4667q-0.66666 0.74667-1.7867 1.3333-1.0933 0.58667-2.4533 0.93333-1.3333 0.32-2.6933 0.32zm-2.88 6.2933-0.24-2q0.53333 0 1.12-0.13333 0.61333-0.13333 1.04-0.4 0.42667-0.24 0.42667-0.53333 0-0.32-0.32-0.50667-0.29334-0.18667-0.72-0.29333-0.42667-0.08-0.85334-0.08l-0.48-0.37333 1.84-2.88h2.1867l-1.2 1.7867q1.3867 0.16 2.0533 0.85333 0.66667 0.72 0.66667 1.7067 0 0.82667-0.50667 1.36-0.50667 0.56-1.3333 0.90667-0.82666 0.34667-1.7867 0.48-0.96 0.13333-1.8933 0.10667z"/>
<path d="m153.8 21.654 7.3867-18.667h3.84l7.3333 18.667h-4.5867l-3.52-9.4667q-0.21334-0.56-0.42667-1.2-0.21334-0.64-0.42667-1.3067-0.21333-0.69333-0.42667-1.3333-0.18666-0.66667-0.32-1.2267l0.8-0.026667q-0.16 0.66667-0.37333 1.3067-0.18667 0.64-0.4 1.28-0.18667 0.61333-0.42667 1.2533-0.24 0.61333-0.45333 1.28l-3.52 9.44zm3.52-3.5733 1.4133-3.4133h8.5867l1.3867 3.4133zm7.8134-16.907q-0.53334 0-1.0667-0.16-0.53334-0.16-1.1733-0.42667-0.48-0.24-0.82666-0.34667-0.32-0.10667-0.58667-0.10667-0.37334 0-0.61334 0.26667-0.21333 0.26667-0.21333 0.74667h-2.6667q0-1.76 0.96-2.7467 0.98667-1.0133 2.4533-1.0133 0.48 0 0.93333 0.13333 0.48 0.13333 1.2 0.45333 0.42667 0.21333 0.72001 0.32 0.29333 0.10667 0.53333 0.10667 0.34667 0 0.53333-0.26667 0.21334-0.29333 0.18667-0.74667h2.64q0 1.0133-0.4 1.8933-0.37333 0.88-1.04 1.3867t-1.5733 0.50667z"/>
<path d="m182.65 21.92q-2.1333 0-3.8933-0.72t-3.0667-2.0267q-1.3067-1.3067-2.0267-3.0667t-0.72-3.8667q0-2.1067 0.72-3.8667 0.72-1.76 2.0267-3.0667t3.0667-2.0267q1.76-0.72 3.8667-0.72t3.8667 0.72q1.76 0.72 3.0667 2.0267 1.3067 1.3067 2 3.0667 0.72 1.76 0.72 3.8667 0 2.08-0.72 3.8667-0.69334 1.76-2 3.0667-1.3067 1.3067-3.0667 2.0267-1.76 0.72-3.84 0.72zm-0.0267-4.2667q1.0933 0 2-0.4 0.93333-0.4 1.6-1.12 0.69333-0.74667 1.0667-1.7333 0.37333-0.98667 0.37333-2.16 0-1.1733-0.37333-2.16-0.37334-0.98667-1.0667-1.7067-0.66667-0.74667-1.6-1.1467-0.90667-0.4-2-0.4-1.0933 0-2.0267 0.4-0.90666 0.4-1.6 1.1467-0.69333 0.72-1.0667 1.7067-0.34666 0.98667-0.34666 2.16 0 1.1733 0.34666 2.1867 0.37334 0.98667 1.0667 1.7067 0.69334 0.72 1.6 1.12 0.93334 0.4 2.0267 0.4z"/>
</g>
</svg>
