<?xml version="1.0" encoding="utf-8"?>
<!-- Generator: Adobe Illustrator 27.2.0, SVG Export Plug-In . SVG Version: 6.00 Build 0)  -->
<svg version="1.1" id="Grid_Traçado" xmlns="http://www.w3.org/2000/svg" xmlns:xlink="http://www.w3.org/1999/xlink" x="0px"
	 y="0px" viewBox="0 0 6885 6885" style="enable-background:new 0 0 6885 6885;" xml:space="preserve">
<style type="text/css">
	.st0{fill:none;stroke:#000000;stroke-width:5;stroke-linecap:round;stroke-linejoin:round;stroke-dasharray:0,0,0,20;}
</style>
<g id="grid_circ_cópia_cópia">
	<g>
		<circle class="st0" cx="3442.5" cy="3442.5" r="1987.6"/>
		<circle class="st0" cx="3442.5" cy="3442.5" r="1949.3"/>
		<circle class="st0" cx="3442.5" cy="3442.5" r="1911.1"/>
		<circle class="st0" cx="3442.5" cy="3442.5" r="1872.9"/>
		<circle class="st0" cx="3442.5" cy="3442.5" r="1834.7"/>
		<circle class="st0" cx="3442.5" cy="3442.5" r="1796.4"/>
		<circle class="st0" cx="3442.5" cy="3442.5" r="1758.2"/>
		<circle class="st0" cx="3442.5" cy="3442.5" r="1720"/>
		<circle class="st0" cx="3442.5" cy="3442.5" r="1681.8"/>
		<circle class="st0" cx="3442.5" cy="3442.5" r="1643.6"/>
		<circle class="st0" cx="3442.5" cy="3442.5" r="1605.3"/>
		<circle class="st0" cx="3442.5" cy="3442.5" r="1567.1"/>
		<circle class="st0" cx="3442.5" cy="3442.5" r="1528.9"/>
		<circle class="st0" cx="3442.5" cy="3442.5" r="1490.7"/>
		<circle class="st0" cx="3442.5" cy="3442.5" r="1452.4"/>
		<circle class="st0" cx="3442.5" cy="3442.5" r="1414.2"/>
		<circle class="st0" cx="3442.5" cy="3442.5" r="1376"/>
		<circle class="st0" cx="3442.5" cy="3442.5" r="1337.8"/>
		<circle class="st0" cx="3442.5" cy="3442.5" r="1299.6"/>
		<circle class="st0" cx="3442.5" cy="3442.5" r="1261.3"/>
		<circle class="st0" cx="3442.5" cy="3442.5" r="1223.1"/>
		<circle class="st0" cx="3442.5" cy="3442.5" r="1184.9"/>
		<circle class="st0" cx="3442.5" cy="3442.5" r="1146.7"/>
		<circle class="st0" cx="3442.5" cy="3442.5" r="1108.4"/>
		<circle class="st0" cx="3442.5" cy="3442.5" r="1070.2"/>
		<circle class="st0" cx="3442.5" cy="3442.5" r="1032"/>
		<circle class="st0" cx="3442.5" cy="3442.5" r="993.8"/>
		<circle class="st0" cx="3442.5" cy="3442.5" r="955.6"/>
		<circle class="st0" cx="3442.5" cy="3442.5" r="917.3"/>
		<circle class="st0" cx="3442.5" cy="3442.5" r="879.1"/>
		<circle class="st0" cx="3442.5" cy="3442.5" r="840.9"/>
		<circle class="st0" cx="3442.5" cy="3442.5" r="802.7"/>
		<circle class="st0" cx="3442.5" cy="3442.5" r="764.4"/>
		<circle class="st0" cx="3442.5" cy="3442.5" r="726.2"/>
		<circle class="st0" cx="3442.5" cy="3442.5" r="688"/>
		<circle class="st0" cx="3442.5" cy="3442.5" r="649.8"/>
		<circle class="st0" cx="3442.5" cy="3442.5" r="611.6"/>
		<circle class="st0" cx="3442.5" cy="3442.5" r="573.3"/>
		<circle class="st0" cx="3442.5" cy="3442.5" r="535.1"/>
		<circle class="st0" cx="3442.5" cy="3442.5" r="496.9"/>
		<circle class="st0" cx="3442.5" cy="3442.5" r="458.7"/>
		<circle class="st0" cx="3442.5" cy="3442.5" r="420.4"/>
		<circle class="st0" cx="3442.5" cy="3442.5" r="382.2"/>
		<circle class="st0" cx="3442.5" cy="3442.5" r="344"/>
		<circle class="st0" cx="3442.5" cy="3442.5" r="305.8"/>
		<circle class="st0" cx="3442.5" cy="3442.5" r="267.6"/>
		<circle class="st0" cx="3442.5" cy="3442.5" r="229.3"/>
		<circle class="st0" cx="3442.5" cy="3442.5" r="191.1"/>
		<circle class="st0" cx="3442.5" cy="3442.5" r="152.9"/>
		<circle class="st0" cx="3442.5" cy="3442.5" r="114.7"/>
		<circle class="st0" cx="3442.5" cy="3442.5" r="76.4"/>
		<circle class="st0" cx="3442.5" cy="3442.5" r="38.2"/>
	</g>
</g>
</svg>
